{"text_format":"1","workbook":"xlsx","n_sheets":116,"sheets":["PRESENTACION","ESTADÍSTICAS BÁSICAS","PRIMERA INFANCIA E INICIAL "," II-1.1.1","II-1.1.2","II-1.2.1","II-1.2.2","II-1.2.3","II-1.2.4","II-1.2.5","II-1.2.6","II-1.3.1","II-1.2.7","II-1.3.2","II-1.3.3 "," PRIMARIA ","II-2.1.1"," II-2.1.2","II-2.1.3","II-2.1.4","II-2.2.1","II-2.2.2","II-2.2.3","II-2.2.4","II-2.2.5","II-2.2.6","II-2.2.7","II-2.2.8","II-2.2.9","II-2.2.10","II-2.2.11","II-2.2.12","II-2.2.13","II-2.2.14","II-2.2.15","II-2.2.16","II-2.2.17","II-2.2.18","II-2.3.1 ","II-2.3.2 ","MEDIA BASICA ","II-3.1.1 ","II-3.1.2 ","II-3.2.1 ","II-3.2.2","II-3.2.3","II-3.2.4","II-3.2.5","II-3.2.6","II-3.2.7","II-3.2.8 ","II-3.3.1 ","II-3.3.2","II-3.4.1","MEDIA SUPERIOR ","II-4.1.1 ","II-4.2.1 ","II-4.2.2 ","II-4.2.3 ","II-4.2.4 ","II-4.2.5","II-4.2.6","II-4.2.7 ","II-4.2.8","II-4.2.9 ","II-4.2.10","II-4.2.11","II-4.3.1 ","II-4.3.2","II-4.4.1","TERCIARIA NO UNIVERSITARIA","II-5.1.1  ","II-5.2.1","II-5.2.2","II-5.3.1","II-5.3.2","FORMACIÓN EN EDUCACIÓN  ","II-6.1.1","II-6.2.1","II-6.2.2","II-6.3.1","II-6.3.2","II-6.3.3","EDUCACIÓN UNIVERSITARIA","II-7.1.1  ","II-7.2.2","II-7.2.3 ","II-7.2.4","II-7.2.5","II-7.2.6 ","II-7.2.7 ","II-7.2.8 ","II-7.2.9","II-7.2.10 ","II-7.2.11 ","EDUCACIÓN DE JÓVENES Y ADUL "," II-8.1.1"," II-8.1.2","II-8.1.3","II-8.1.4","II-8.1.5.","II-8.1.6","II-8.1.7","II-8.1.8  ","II-8.1.9  ","II-8.1.10 ","II-8.2.1 ","ll-8.2.2","II-8.3.1  ","II-8.4.1 ","II-8.4.2 ","II-8.4.3","CONTROL","CONTROL ","CONTROL Media Básica","CONTROL Media Superior"],"not_rendered":{"charts":0,"images":10,"macros":1,"external_links":1,"defined_names":752,"comments":0,"pivot_tables":0},"unopened":[],"bounds":{"document_bytes":16777216,"sheet_cells":100000,"rows_first":2000,"rows_last":500,"rows_between":2000,"halvings":0,"cell_chars":16384,"cell_head_chars":4096},"cells_cut":0,"cells_raw":0,"read":"whole","date_system":"1900"}

{"sheet":"PRESENTACION","index":0,"n_rows":31,"n_cols":7,"rows_kept":31,"cut":false,"hidden":false,"merged":[[19,0,19,2],[20,0,20,2],[26,0,26,2],[21,0,21,2],[22,0,22,2],[23,0,23,2],[24,0,24,2],[25,0,25,2],[16,0,16,2],[16,4,17,6],[18,4,18,6],[17,0,17,2],[18,0,18,2]]}
[]
[]
[]
[]
[]
[]
[]
[]
[]
[]
[]
[]
[]
[]
[]
[]
["Autoridades:",null,null,null,"Esta publicación ha sido elaborada por los Integrantes del Departamento de Estadística Educativa y de las Secciones de Reportes Internacionales e Investigación Educativa de la División de  Investigación y Estadística de la Dirección de Educación:"]
["Dr. Tabaré Vázquez"]
["Presidente de la República",null,null,null,"Mag. Gabriel Gómez (Director) "]
["Dra. María Julia Muñoz",null,null,null,"Departamento de Investigación Educativa ",null,"Departamento de Estadística Educativa"]
["Ministra de Educación y Cultura",null,null,null,"Mag. Leandro Pereira (Encargado) ",null,"Lic. Daniel Zoppis (Encargado) "]
["Mag. Edith Moraes",null,null,null,"Lic. Paola Cazulo ",null,"Lic. Mariana Yozzi "]
["Subsecretaria de Educación y Cultura",null,null,null,"Lic. Daniel Velázquez ",null,"Departamento de Reportes Internacionales"]
["Dra. Ana Gabriela González Gargano",null,null,null,"Mag. Richard Ferreira ",null,"Lic. Carla Orós (Encargada) "]
["Directora General de Secretaría",null,null,null,"Departamento de Comunicación y Publicaciones: ",null,"Lic. Daniel Manber"]
["Mag. Rosita Inés Angelo",null,null,null,"Nathalia Ascué (Encargada)"]
["Directora de Educación",null,null,null,"Corrección :",null,"Pilar Barreiro"]
[]
[null,null,null,null,null,null,"Departamento de Comunicación "]
[null,null,null,null,null,null,"y Publicaciones"]
[null,null,null,null,null,null,"Nathalia Ascué (Encargada)"]

{"sheet":"ESTADÍSTICAS BÁSICAS","index":1,"n_rows":16,"n_cols":6,"rows_kept":16,"cut":false,"hidden":false,"merged":[[15,5,15,7],[2,1,4,7],[11,2,11,3],[13,2,13,3],[15,2,15,3],[9,2,9,4],[9,5,9,7],[11,5,11,7],[13,5,13,7]]}
[]
[]
[null,"ESTADÍSTICAS BÁSICAS"]
[]
[]
[]
[]
[]
[]
[null,null,"PRIMERA INFANCIA E INICIAL",null,null,"TERCIARIA NO UNIVERSITARIA"]
[]
[null,null,"PRIMARIA",null,null,"FORMACIÓN EN EDUCACIÓN"]
[]
[null,null,"MEDIA BÁSICA",null,null,"EDUCACIÓN UNIVERSITARIA"]
[]
[null,null,"MEDIA SUPERIOR",null,null,"EDUCACIÓN DE JÓVENES Y ADULTOS"]

{"sheet":"PRIMERA INFANCIA E INICIAL ","index":2,"n_rows":33,"n_cols":2,"rows_kept":33,"cut":false,"hidden":false,"merged":[]}
[]
[]
[]
[]
[]
[]
[null,"ESTABLECIMIENTOS"]
["Cuadro Nº II-1.1.1  ","CANTIDAD DE ESTABLECIMIENTOS DE EDUCACIÓN EN LA PRIMERA INFANCIA E INICIAL DEL CEIP POR FORMA DE ADMINISTRACIÓN Y MODALIDAD SEGÚN DEPARTAMENTO. AÑO 2016"]
[""]
["Cuadro Nº  II-1.1.2 ","CANTIDAD DE ESTABLECIMIENTOS DE PRIMERA INFANCIA E INICIAL DEL MEC E INAU POR FORMA DE ADMINISTRACIÓN SEGÚN DEPARTAMENTO. AÑO 2016. "]
[""]
[""]
["Cuadro Nº II-1.2.1  ","ALUMNOS MATRICULADOS EN EDUCACIÓN EN LA PRIMERA INFANCIA E INICIAL POR FORMA DE ADMINISTRACIÓN, MODALIDAD Y SEXO SEGÚN DEPARTAMENTO. AÑO 2016."]
[""]
["Cuadro Nº II-1.2.2  ","ALUMNOS MATRICULADOS EN EDUCACIÓN PÚBLICA EN LA PRIMERA INFANCIA E INICIAL DEL CEIP POR  MODALIDAD Y EDAD SEGÚN DEPARTAMENTO. AÑO 2016."]
[""]
["Cuadro Nº II-1.2.3  "," ALUMNOS MATRICULADOS EN EDUCACIÓN EN LA PRIMERA INFANCIA E INICIAL PRIVADA POR MODALIDAD Y NIVEL SEGÚN DEPARTAMENTO. AÑO 2016."]
[""]
["Cuadro Nº II-1.2.4  ","ALUMNOS MATRICULADOS EN EDUCACIÓN EN LA PRIMERA INFANCIA E INICIAL  POR FORMA DE ADMINISTRACIÓN Y SEXO SEGÚN DEPARTAMENTO. AÑO 2016."]
[""]
["Cuadro Nº II-1.2.5  "," ALUMNOS MATRICULADOS EN EDUCACIÓN EN LA PRIMERA INFANCIA E INICIAL  POR FORMA DE ADMINISTRACIÓN SEGÚN EDAD. AÑO 2016."]
[""]
["Cuadro Nº II-1.2.6  "," ALUMNOS MATRICULADOS EN EDUCACIÓN EN LA PRIMERA INFANCIA E INICIAL PÚBLICA DEL CEIP POR ÁREA DEMOGRÁFICA SEGÚN DEPARTAMENTO. AÑO 2016."]
[""]
["Cuadro Nº II-1.2.7  "," ALUMNOS MATRICULADOS EN EDUCACIÓN EN LA PRIMERA INFANCIA E INICIAL  EN CENTROS PRIVADOS HABILITADOS POR EL MEC POR EDAD SEGÚN DEPARTAMENTO. AÑO 2016."]
[""]
[""]
["Cuadro Nº II-1.3.1  "," PERSONAL DOCENTE DE EDUCACIÓN EN LA PRIMERA INFANCIA E INICIAL  PÚBLICA DEL CEIP SEGÚN DEPARTAMENTO. AÑO 2016."]
[""]
["Cuadro Nº II-1.3.2  ","PERSONAL DOCENTE DE EDUCACIÓN EN LA PRIMERA INFANCIA E INICIAL PRIVADA SEGÚN DEPARTAMENTO. AÑO 2016."]
[""]
["Cuadro Nº II-1.3.3  "," PERSONAL DOCENTE EN EDUCACIÓN EN LA PRIMERA INFANCIA PRIVADA SUPERVISADA POR EL MEC SEGÚN FUNCIÓN Y DEPARTAMENTO. AÑO 2016.   "]
[""]

{"sheet":" II-1.1.1","index":3,"n_rows":35,"n_cols":9,"rows_kept":35,"cut":false,"hidden":false,"merged":[[7,7,9,7],[7,8,9,8],[0,6,1,8],[4,0,4,8],[5,0,9,0],[5,1,9,1],[5,2,5,8],[6,2,6,6],[7,2,9,2],[7,3,9,3],[7,5,9,5],[7,6,9,6],[7,4,9,4]]}
["CONSEJO DE EDUCACIÓN INICIAL Y PRIMARIA",null,null,null,null,null,"ESTABLECIMIENTOS"]
[]
["Cuadro Nº II-1.1.1",null,null,null,null,null,null,null,"VOLVER"]
[]
["CANTIDAD DE ESTABLECIMIENTOS DE EDUCACIÓN EN LA PRIMERA INFANCIA E INICIAL DEL CEIP POR FORMA DE ADMINISTRACIÓN Y MODALIDAD SEGÚN DEPARTAMENTO. AÑO 2016."]
["DEPARTAMENTO","TOTAL","FORMA DE ADMINISTRACIÓN"]
[null,null,"PÚBLICA",null,null,null,null,null,"PRIVADA"]
[null,null,"Total Público","Jardines de Infantes","Aprender","JICI","CEPI*","Jardines de Tiempo Completo","Jardines de Infantes"]
[]
[]
["TOTAL",{"$f":"+B12+B13","v":240},{"$f":"+C12+C13","v":191},{"$f":"SUM(D12:D13)","v":123},{"$f":"E12+E13","v":10},{"$f":"SUM(F12:F13)","v":2},{"$f":"SUM(G12:G13)","v":1},{"$f":"SUM(H12:H13)","v":55},{"$f":"SUM(I12:I13)","v":49}]
["MONTEVIDEO",{"$f":"+C12+I12","v":93},{"$f":"+D12++E12+F12+G12+H12","v":64},38,5,1,1,19,29]
["RESTO DEL PAÍS",{"$f":"+C13+I13","v":147},{"$f":"+D13+E13+F13+G13+H13","v":127},{"$f":"SUM(D15:D32)","v":85},5,1,0,36,20]
[]
["Artigas",{"$f":"+C15+I15","v":3},{"$f":"+D15+E15+F15+G15+H15","v":3},2,1,0,0,0,0]
["Canelones",{"$f":"+C16+I16","v":38},{"$f":"+D16+E16+F16+G16+H16","v":33},27,2,0,0,4,5]
["Cerro Largo",7,7,2,1,1,0,3,0]
["Colonia",7,6,6,0,0,0,0,1]
["Durazno",5,5,3,0,0,0,2,0]
["Flores",2,2,1,0,0,0,1,0]
["Florida",5,4,2,0,0,0,2,1]
["Lavalleja",7,7,4,0,0,0,3,0]
["Maldonado",10,7,7,0,0,0,0,3]
["Paysandú",5,4,2,0,0,0,2,1]
["Río Negro",6,6,3,0,0,0,3,0]
["Rivera",7,7,3,0,0,0,4,0]
["Rocha",7,7,5,0,0,0,2,0]
["Salto",9,4,3,0,0,0,1,5]
["San José",7,6,3,1,0,0,2,1]
["Soriano",6,5,4,0,0,0,1,1]
["Tacuarembó",{"$f":"+C31+I31","v":11},9,6,0,0,0,3,2]
["Treinta y Tres",{"$f":"+C32+I32","v":5},5,2,0,0,0,3,0]
["Fuente: Procesamiento propio en base a datos proporcionados por el D.E.E. — C.E.I.P."]
["Nota: * Centro Educativo de Primera Infancia.  Refiere a Guarderías en Anuarios Anteriores. "]
["           Privados habilitados y supervisados por ANEP"]

{"sheet":"II-1.1.2","index":4,"n_rows":36,"n_cols":5,"rows_kept":36,"cut":false,"hidden":false,"merged":[[0,4,1,5],[1,0,1,2],[5,0,5,4],[6,0,9,0],[6,2,6,4],[7,1,9,1],[7,2,9,2],[7,3,9,3],[7,4,9,4]]}
["MINISTERIO DE EDUCACIÓN Y CULTURA",null,null,null,"Establecimientos"]
["Dirección de Educación "]
[]
["Cuadro Nº  II-1.1.2"]
[]
["CANTIDAD DE ESTABLECIMIENTOS DE PRIMERA INFANCIA E INICIAL DEL MEC E INAU POR FORMA DE ADMINISTRACIÓN SEGÚN DEPARTAMENTO. AÑO 2016."]
["DEPARTAMENTO"]
[null,"TOTAL","CAIF","DIURNOS-INAU","PRIVADOS"]
[]
[]
["TOTAL",{"$f":"C11+D11+E11","v":829},{"$f":"C12+C13","v":390},{"$f":"D12+D13","v":37},{"$f":"E12+E13","v":402}]
["MONTEVIDEO",330,80,9,241]
["RESTO DEL PAÍS",{"$f":"C13+D13+E13","v":499},{"$f":"SUM(C15:C32)","v":310},{"$f":"SUM(D15:D32)","v":28},{"$f":"SUM(E15:E32)","v":161}]
[]
["Artigas",{"$f":"C15+D15+E15","v":20},16,2,2]
["Canelones",129,62,2,65]
["Cerro Largo",22,19,1,2]
["Colonia",29,13,2,14]
["Durazno",19,15,2,2]
["Flores",7,5,1,1]
["Florida",30,20,2,8]
["Lavalleja",13,6,2,5]
["Maldonado",31,12,2,17]
["Paysandú",32,24,1,7]
["Río Negro",15,12,1,2]
["Rivera",23,15,1,7]
["Rocha",20,14,1,5]
["Salto",30,22,1,7]
["San José",21,13,2,6]
["Soriano",25,14,2,9]
["Tacuarembó",20,16,2,2]
["Treinta y Tres",13,12,1,0]
["Fuente: Procesamiento propio en base a datos proporcionados por:"]
["Registro Nacional de Centros Educativos en la Primera Infancia. MEC"]
["Nota:  Privados supervisados por el MEC"]
["Para CAIF Y CENTROS DIURNOS: SIPI de INAU."]

{"sheet":"II-1.2.1","index":5,"n_rows":35,"n_cols":43,"rows_kept":35,"cut":false,"hidden":false,"merged":[[8,1,10,1],[7,5,7,14],[7,16,7,37],[8,16,8,17],[8,18,8,19],[8,20,8,21],[8,22,8,23],[8,24,8,25],[8,26,8,27],[8,28,8,29],[8,30,8,31],[8,32,8,33],[8,34,8,35],[8,36,8,37],[8,5,8,6],[8,7,8,8],[7,39,7,40],[7,41,7,42],[9,39,9,40],[9,41,9,42],[8,9,8,10],[8,11,8,12],[8,13,8,14],[9,16,9,17],[9,18,9,19],[0,39,1,42],[4,0,4,42],[5,0,9,0],[5,1,5,42],[6,1,7,3],[6,4,6,37],[6,38,6,42],[7,4,10,4],[9,36,9,37],[7,38,10,38],[9,2,9,3],[9,30,9,31],[9,34,9,35],[9,5,9,6],[9,9,9,10],[9,11,9,12],[9,7,9,8],[9,26,9,27],[9,28,9,29],[9,32,9,33],[9,13,9,14],[9,20,9,21],[9,22,9,23],[9,24,9,25]]}
["CONSEJO DE EDUCACIÓN INICIAL Y PRIMARIA",null,null,null,null,null,null,null,null,null,null,null,null,null,null,null,null,null,null,null,null,null,null,null,null,null,null,null,null,null,null,null,null,null,null,null,null,null,null,"ALUMNOS MATRICULADOS"]
[]
["Cuadro Nº II-1.2.1"]
[]
["ALUMNOS MATRICULADOS EN EDUCACIÓN EN LA PRIMERA INFANCIA E INICIAL POR FORMA DE ADMINISTRACIÓN, MODALIDAD Y SEXO SEGÚN DEPARTAMENTO. AÑO 2016."]
["DEPARTAMENTO","FORMA DE ADMINISTRACIÓN"]
[null,"TOTAL",null,null,"PÚBLICA",null,null,null,null,null,null,null,null,null,null,null,null,null,null,null,null,null,null,null,null,null,null,null,null,null,null,null,null,null,null,null,null,null,"PRIVADA"]
[null,null,null,null,"Total Público","Educación Inicial",null,null,null,null,null,null,null,null,null,null,"Inicial en Escuelas",null,null,null,null,null,null,null,null,null,null,null,null,null,null,null,null,null,null,null,null,null,"Total Privada","Jardines de Infantes",null,"Inicial en Colegios"]
[null,"TOTAL",null,null,null,"INICIAL",null,"JARDÍN APRENDER",null,"JARDÍN COMÚN",null,"JARDÍN DE CICLO INICIAL",null,"JARDÍN DE JORNADA COMPLETA",null,null,"APRENDER",null,"APRENDER  H. DE PRÁCTICA",null,"COMÚN",null,"CON MAESTRO A CARGO",null,"DE PRÁCTICA",null,"DE TIEMPO COMPLETO",null,"HABILITADA DE PRÁCTICA",null,"INTERNADO RURAL",null,"T.EXTENDIDO-DE PRÁCTICA",null,"TIEMPO EXTENDIDO",null,"UNIDOCENTE"]
[null,null,"SEXO",null,null,"SEXO",null,"SEXO",null,"SEXO",null,"SEXO",null,"SEXO",null,null,"SEXO",null,"SEXO",null,"SEXO",null,"SEXO",null,"SEXO",null,"SEXO",null,"SEXO",null,"SEXO",null,"SEXO",null,"SEXO",null,"SEXO",null,null,"SEXO",null,"SEXO"]
[null,null,"M","F",null,"M","F","M","F","M","F","M","F","M","F",null,"M","F","M","F","M","F","M","F","M","F","M","F","M","F","M","F","M","F","M","F","M","F",null,"M","F","M","F"]
["TOTAL",{"$f":"+B13+B14","v":114865},{"$f":"+C13+C14","v":56961},{"$f":"+D13+D14","v":57904},{"$f":"+E13+E14","v":84894},{"$f":"F13+F14","v":264},{"$f":"G13+G14","v":306},1445,1433,12838,12829,103,111,{"$f":"N13+N14","v":3684},{"$f":"O13+O14","v":3950},null,{"$f":"Q13+Q14","v":6189},{"$f":"R13+R14","v":6265},{"$f":"S13+S14","v":78},{"$f":"T13+T14","v":92},{"$f":"U13+U14","v":6525},{"$f":"V13+V14","v":6802},{"$f":"W13+W14","v":1328},{"$f":"X13+X14","v":1362},{"$f":"Y13+Y14","v":1452},{"$f":"Z13+Z14","v":1636},{"$f":"AA13+AA14","v":4290},4454,2403,2510,{"$f":"+AE13+AE14","v":6},{"$f":"AF13+AF14","v":7},{"$f":"AG14+AG13","v":30},{"$f":"AH13+AH14","v":24},{"$f":"AI13+AI14","v":579},{"$f":"AJ13+AJ14","v":635},{"$f":"+AK13+AK14","v":596},{"$f":"AL13+AL14","v":668},{"$f":"+AM13+AM14","v":29970.999999999996},{"$f":"+AN13+AN14","v":2406},{"$f":"+AO13+AO14","v":2183},{"$f":"+AP13+AP14","v":12744.999999999998},{"$f":"+AQ13+AQ14","v":12637}]
["MONTEVIDEO",{"$f":"E13+AM13","v":44181},{"$f":"F13+H13+J13+L13+N13+Q13+S13+U13+W13+Y13+AA13+AC13+AE13+AG13+AI13+AK13+AN13+AP13","v":21957},{"$f":"G13+I13+K13+M13+O13+R13+T13+V13+X13+Z13+AB13+AD13+AF13+AH13+AJ13+AL13+AO13+AQ13","v":22224},{"$f":"SUM(F13:AL13)","v":26156},0,0,903,863,4356,4586,0,0,1714,1789,null,2122,2120,0,0,1838,1928,0,0,436,449,1076,1210,201,230,0,0,30,24,126,155,0,0,{"$f":"+AN13+AO13+AP13+AQ13","v":18024.999999999996},1741,1537.9999999999998,7413.9999999999982,7331.9999999999991]
["RESTO DEL PAÍS",{"$f":"SUM(B16:B33)","v":70684},{"$f":"SUM(C16:C33)","v":35004},35680,{"$f":"SUM(F14:AL14)","v":58738},{"$f":"SUM(F16:F33)","v":264},306,542,570,8482,8243,103,111,1970,2161,null,4067,4145,78,92,4687,4874,1328,1362,1016,1187,3214,3244,2202,2280,6,7,0,0,453,{"$f":"SUM(AJ16:AJ33)","v":480},596,668,11946,{"$f":"SUM(AN16:AN33)","v":665},{"$f":"SUM(AO16:AO33)","v":645},5331,5305]
[]
["Artigas",{"$f":"E16+AM16","v":2637},{"$f":"F16+H16+J16+L16+N16+Q16+S16+U16+W16+Y16+AA16+AC16+AE16+AG16+AI16+AK16+AN16+AP16","v":1270},{"$f":"G16+I16+K16+M16+O16+R16+T16+V16+X16+Z16+AB16+AD16+AF16+AH16+AJ16+AL16+AO16+AQ16","v":1367},{"$f":"SUM(F16:AL16)","v":2420},0,0,74,70,215,253,0,0,0,0,null,244,245,0,0,126,126,68,73,55,67,224,238,135,132,3,3,0,0,18,16,13,22,{"$f":"+AN16+AO16+AP16+AQ16","v":217},0,0,95,122]
["Canelones",18089,9027,9062,{"$f":"SUM(F17:AL17)","v":14206},123,161,190,210,2974,2957,0,0,291,330,null,1146,1116,0,0,805,867,232,249,72,87,744,696,380,384,0,0,0,0,58,53,34,47,3883,227,207,1751.0000000000002,1698]
["Cerro Largo",2964,1407,1557,{"$f":"SUM(F18:AL18)","v":2734},0,0,142,142,131,160,103,111,137,151,null,199,201,0,0,96,119,57,54,48,57,132,148,166,195,0,0,0,0,48,47,39,51,230,0,0,109,121]
["Colonia",4452,2202,2250,{"$f":"SUM(F19:AL19)","v":3818},0,0,0,0,534,570,0,0,0,0,null,46,50,0,0,651,641,92,91,112,122,170,170,154,168,0,0,0,0,65,58,66,58,634,0,0,312,322]
["Durazno",1904,954,950,1625,0,0,0,0,242,235,0,0,56,71,null,108,144,0,0,64,64,13,13,61,60,144,112,88,80,0,0,0,0,0,0,36,34,279,0,0,142,137]
["Flores",874,432,442,755,0,0,0,0,83,76,0,0,41,43,null,0,0,0,0,79,100,19,12,21,26,74,77,23,19,0,0,0,0,10,16,19,17,119,0,0,63,56]
["Florida",1876,1027,849,1738,0,0,0,0,274,null,0,0,68,93,null,48,61,0,0,202,223,61,69,33,44,109,106,83,91,0,0,0,0,38,60,37,38,138,11,7,63,57]
["Lavalleja",1925,988,937,1585,0,0,0,0,303,252,0,0,138,179,null,28,34,42,32,96,87,27,19,24,21,71,56,53,51,0,0,0,0,0,0,31,41,340,0,0,175,165]
["Maldonado",6315,3132,3183,4228,0,0,0,0,823,825,0,0,0,0,null,92,80,0,0,583,616,42,53,59,56,221,204,221,249,0,0,0,0,30,24,25,25,2087,82,87,954.00000000000011,964]
["Paysandú",3853,1901,1952,3389,0,0,0,0,236,251,0,0,143,148,null,320,320,36,60,363,336,82,86,120,158,149,153,179,191,1,0,0,0,0,0,26,31,464,59,64,187,154]
["Río Negro",2180,1071,1109,1905,0,0,0,0,255,270,0,0,223,230,null,36,33,0,0,185,230,54,48,51,68,47,65,29,33,2,1,0,0,0,0,23,22,275,0,0,166,109]
["Rivera",3737,1875,1862,3393,0,0,0,0,342,292,0,0,241,261,null,397,393,0,0,135,127,81,86,85,93,167,181,198,180,0,0,0,0,31,28,36,39,344,0,0,162,182]
["Rocha",2532,1266,1266,2222,0,0,0,0,375,353,0,0,123,117,null,146,148,0,0,235,218,21,22,28,45,140,173,12,12,0,0,0,0,0,0,29,25,310,0,0,157,153]
["Salto",5435,2651,2784,4429,141,145,0,0,405,426,0,0,0,0,null,586,608,0,0,113,122,149,189,51,45,364,420,260,254,0,3,0,0,30,42,38,38,1006,158,124,356,368.00000000000006]
["San José",3981,1963,2018,3449,0,0,136,148,274,326,0,0,175,174,null,136,149,0,0,490,501,138,123,48,45,161,163,37,35,0,0,0,0,47,54,43,46,532,48,57,230.00000000000003,197.00000000000003]
["Soriano",2731,1337,1394,2461,0,0,0,0,362,363,0,0,38,35,null,242,231,0,0,204,206,45,42,58,78,119,105,107,136,0,0,0,0,0,0,44,46,270,19,24,99,128]
["Tacuarembó",3474,1667,1807,2786,0,0,0,0,441,412,0,0,122,150,null,262,294,0,0,122,137,117,113,46,55,122,114,35,37,0,0,0,0,60,60,35,52,688,61,75,244.00000000000003,308.00000000000006]
["Treinta y Tres",1725,834,891,1595,0,0,0,0,213,222,0,0,174,179,null,31,38,0,0,138,154,30,20,44,60,56,63,42,33,0,0,0,0,18,22,22,36,130,0,0,66,64]
["Fuente: Procesamiento propio en base a datos proporcionados por el D.E.E. — C.E.I.P."]
["Privados habilitados o autorizados por ANEP"]

{"sheet":"II-1.2.2","index":6,"n_rows":33,"n_cols":81,"rows_kept":33,"cut":false,"hidden":false,"merged":[[7,32,7,35],[1,8,2,11],[5,1,5,79],[4,0,4,79],[0,72,1,79],[7,57,7,60],[7,67,7,70],[7,72,7,75],[5,0,9,0],[7,2,7,5],[8,2,8,5],[8,57,8,60],[7,62,7,65],[8,62,8,65],[6,1,9,1],[6,2,6,25],[6,27,6,79],[7,76,7,80],[8,76,8,80],[7,42,7,45],[8,42,8,45],[7,47,7,50],[8,47,8,50],[8,52,8,55],[8,67,8,70],[8,72,8,75],[7,52,7,55],[8,32,8,35],[7,37,7,40],[8,37,8,40],[7,27,7,30],[8,27,8,30],[7,22,7,25],[8,22,8,25],[7,7,7,10],[8,7,8,10],[7,12,7,15],[8,12,8,15],[7,17,7,20],[8,17,8,20]]}
["CONSEJO DE EDUCACIÓN INICIAL Y PRIMARIA"]
[null,null,null,null,null,null,null,null,"ALUMNOS MATRICULADOS"]
["Cuadro Nº II-1.2.2"]
[null,null,null,null,null,null,null,null,null,null,null,null,null,null,null,null,null,null,null,null,null,null,null,null,null,null,null,null,null,null,null,null,null,null,null,null,null,null,null,null,null,null,null,null,null,null,null,null,null,null,null,null,null,null,null,null,null,null,null,null,null,null,null,null,null,null,null,null,null,null,null,null,null,null,null,null,null,null,null,"VOLVER"]
["ALUMNOS MATRICULADOS EN EDUCACIÓN PÚBLICA EN LA PRIMERA INFANCIA E INICIAL DEL CEIP POR  MODALIDAD Y EDAD SEGÚN DEPARTAMENTO. AÑO 2016."]
["DEPARTAMENTO","PÚBLICA"]
[null,"Total Público","EDUCACIÓN DE INICIAL",null,null,null,null,null,null,null,null,null,null,null,null,null,null,null,null,null,null,null,null,null,null,null,null,"INICIAL EN ESCUELAS"]
[null,null,"INICIAL",null,null,null,null,"JARDÍN APRENDER",null,null,null,null,"JARDÍN COMÚN",null,null,null,null,"JARDÍN DE CICLO INICIAL",null,null,null,null,"JARDÍN DE JORNADA COMPLETA",null,null,null,null,"APRENDER",null,null,null,null,"APRENDER  H. DE PRÁCTICA",null,null,null,null,"COMÚN",null,null,null,null,"CON MAESTRO A CARGO",null,null,null,null,"DE PRÁCTICA",null,null,null,null,"DE TIEMPO COMPLETO",null,null,null,null,"HABILITADA DE PRÁCTICA",null,null,null,null,"INTERNADO RURAL",null,null,null,null,"T.EXTENDIDO-DE PRÁCTICA",null,null,null,null,"TIEMPO EXTENDIDO",null,null,null,"UNIDOCENTE"]
[null,null,"AÑOS",null,null,null,null,"AÑOS",null,null,null,null,"AÑOS",null,null,null,null,"AÑOS",null,null,null,null,"AÑOS",null,null,null,null,"AÑOS",null,null,null,null,"AÑOS",null,null,null,null,"AÑOS",null,null,null,null,"AÑOS",null,null,null,null,"AÑOS",null,null,null,null,"AÑOS",null,null,null,null,"AÑOS",null,null,null,null,"AÑOS",null,null,null,null,"AÑOS",null,null,null,null,"AÑOS",null,null,null,"AÑOS"]
[null,null,"<= 2 ",3,4,5,null,"<= 2 ",3,4,5,null,"<= 2 ",3,4,5,null,"<= 2 ",3,4,5,null,"<= 2 ",3,4,5,null,"<= 2 ",3,4,5,null,"<= 2 ",3,4,5,null,"<= 2 ",3,4,5,null,"<= 2 ",3,4,5,null,"<= 2 ",3,4,5,null,"<= 2 ",3,4,5,null,"<= 2 ",3,4,5,null,"<= 2 ",3,4,5,null,"<= 2 ",3,4,5,null,"<= 2 ",3,4,5,null,"<= 2 ",3,4,5]
["TOTAL",{"$f":"+B12+B13","v":85130},{"$f":"C12+C13","v":21},{"$f":"D12+D13","v":197},{"$f":"E12+E13","v":202},{"$f":"F12+F13","v":150},null,{"$f":"H12+H13","v":34},{"$f":"I12+I13","v":701},{"$f":"J12+J13","v":1090},{"$f":"K12+K13","v":1053},null,{"$f":"M12+M13","v":701},{"$f":"N12+N13","v":8042},{"$f":"O12+O13","v":9441},{"$f":"P12+P13","v":7719},null,{"$f":"R12+R13","v":6},{"$f":"S12+S13","v":74},{"$f":"T12+T13","v":70},{"$f":"U12+U13","v":64},null,{"$f":"W12+W13","v":274},{"$f":"X12+X13","v":2262},{"$f":"Y12+Y13","v":2760},{"$f":"Z12+Z13","v":2338},null,{"$f":"AB12+AB13","v":27},{"$f":"AC12+AC13","v":820},{"$f":"AD12+AD13","v":5803},{"$f":"AE12+AE13","v":5804},null,{"$f":"AG12+AG13","v":2},{"$f":"AH12+AH13","v":46},{"$f":"AI12+AI13","v":75},{"$f":"AJ12+AJ13","v":47},null,{"$f":"AL12+AL13","v":41},{"$f":"AM12+AM13","v":1044},{"$f":"AN12+AN13","v":5887},{"$f":"AO12+AO13","v":6355},null,{"$f":"AQ12+AQ13","v":27},{"$f":"AR12+AR13","v":281},{"$f":"AS12+AS13","v":1178},{"$f":"AT12+AT13","v":1204},null,{"$f":"AV12+AV13","v":4},{"$f":"AW12+AW13","v":125},{"$f":"AX12+AX13","v":1221},{"$f":"AY12+AY13","v":1738},null,{"$f":"BA12+BA13","v":24},{"$f":"BB12+BB13","v":507},{"$f":"BC12+BC13","v":4040},{"$f":"BD12+BD13","v":4173},null,{"$f":"BF12+BF13","v":15},{"$f":"BG12+BG13","v":352},{"$f":"BH12+BH13","v":2204},{"$f":"BI12+BI13","v":2342},null,{"$f":"BK12+BK13","v":0},{"$f":"BL12+BL13","v":0},{"$f":"BM12+BM13","v":6},{"$f":"BN12+BN13","v":7},null,{"$f":"+BP12+BP13","v":0},{"$f":"BQ12+BQ13","v":2},{"$f":"BR12+BR13","v":23},{"$f":"BS12+BS13","v":29},null,{"$f":"BU13+BU12","v":2},{"$f":"BV13+BV12","v":89},{"$f":"BW13+BW12","v":550},{"$f":"BX13+BX12","v":573},null,{"$f":"BZ12+BZ13","v":11},{"$f":"CA12+CA13","v":136},{"$f":"CB12+CB13","v":543},{"$f":"CC12+CC13","v":574}]
["MONTEVIDEO",{"$f":"SUM(C12:CC12)","v":26156},0,0,0,0,null,25,445,646,650,null,261,2556,3302,2823,null,0,0,0,0,null,176,963,1207,1157,null,9,255,1987,1991,null,0,0,0,0,null,9,255,1658,1844,null,0,0,0,0,null,2,41,345,497,null,2,90,1058,1136,null,2,63,177,189,null,0,0,0,0,null,0,2,23,29,null,0,8,113,160,null,0,0,0,0]
["RESTO DEL PAÍS",{"$f":"SUM(B15:B32)","v":58974},{"$f":"SUM(C15:C32)","v":21},{"$f":"SUM(D15:D32)","v":197},{"$f":"SUM(E15:E32)","v":202},{"$f":"SUM(F15:F32)","v":150},null,{"$f":"SUM(H15:H32)","v":9},{"$f":"SUM(I15:I32)","v":256},{"$f":"SUM(J15:J32)","v":444},{"$f":"SUM(K15:K32)","v":403},null,{"$f":"SUM(M15:M32)","v":440},{"$f":"SUM(N15:N32)","v":5486},{"$f":"SUM(O15:O32)","v":6139},{"$f":"SUM(P15:P32)","v":4896},null,{"$f":"SUM(R15:R32)","v":6},{"$f":"SUM(S15:S32)","v":74},{"$f":"SUM(T15:T32)","v":70},{"$f":"SUM(U15:U32)","v":64},null,{"$f":"SUM(W15:W32)","v":98},{"$f":"SUM(X15:X32)","v":1299},{"$f":"SUM(Y15:Y32)","v":1553},{"$f":"SUM(Z15:Z32)","v":1181},null,{"$f":"SUM(AB15:AB32)","v":18},{"$f":"SUM(AC15:AC32)","v":565},{"$f":"SUM(AD15:AD32)","v":3816},{"$f":"SUM(AE15:AE32)","v":3813},null,{"$f":"SUM(AG15:AG32)","v":2},{"$f":"SUM(AH15:AH32)","v":46},{"$f":"SUM(AI15:AI32)","v":75},{"$f":"SUM(AJ15:AJ32)","v":47},null,{"$f":"SUM(AL15:AL32)","v":32},{"$f":"SUM(AM15:AM32)","v":789},{"$f":"SUM(AN15:AN32)","v":4229},{"$f":"SUM(AO15:AO32)","v":4511},null,{"$f":"SUM(AQ15:AQ32)","v":27},{"$f":"SUM(AR15:AR32)","v":281},{"$f":"SUM(AS15:AS32)","v":1178},{"$f":"SUM(AT15:AT32)","v":1204},null,{"$f":"SUM(AV15:AV32)","v":2},{"$f":"SUM(AW15:AW32)","v":84},{"$f":"SUM(AX15:AX32)","v":876},{"$f":"SUM(AY15:AY32)","v":1241},null,{"$f":"SUM(BA15:BA32)","v":22},{"$f":"SUM(BB15:BB32)","v":417},{"$f":"SUM(BC15:BC32)","v":2982},{"$f":"SUM(BD15:BD32)","v":3037},null,{"$f":"SUM(BF15:BF32)","v":13},{"$f":"SUM(BG15:BG32)","v":289},{"$f":"SUM(BH15:BH32)","v":2027},{"$f":"SUM(BI15:BI32)","v":2153},null,{"$f":"SUM(BK15:BK32)","v":0},{"$f":"SUM(BL15:BL32)","v":0},{"$f":"SUM(BM15:BM32)","v":6},{"$f":"SUM(BN15:BN32)","v":7},null,{"$f":"SUM(BP15:BP32)","v":0},{"$f":"SUM(BQ15:BQ32)","v":0},0,0,null,{"$f":"SUM(BU15:BU32)","v":2},{"$f":"SUM(BV15:BV32)","v":81},437,413,null,11,{"$f":"SUM(CA15:CA32)","v":136},{"$f":"SUM(CB15:CB32)","v":543},{"$f":"SUM(CC15:CC32)","v":574}]
[]
["Artigas",{"$f":"SUM(C15:CC15)","v":2420},0,0,0,0,null,0,23,71,50,null,10,155,165,138,null,0,0,0,0,null,0,0,0,0,null,0,30,245,214,null,0,0,0,0,null,0,17,114,121,null,0,9,72,60,null,0,3,57,62,null,0,24,232,206,null,0,6,139,122,null,0,0,3,3,null,0,0,0,0,null,0,4,17,13,null,0,5,14,16]
["Canelones",{"$f":"SUM(C16:CC16)","v":14206},11,81,95,97,null,6,81,153,160,null,138,1756,2074,1963,null,0,0,0,0,null,17,207,240,157,null,3,110,1053,1096,null,0,0,0,0,null,0,59,805,808,null,0,20,222,239,null,0,8,60,91,null,3,78,667,692,null,4,65,332,363,null,0,0,0,0,null,0,0,0,0,null,0,3,60,48,null,1,5,35,40]
["Cerro Largo",2734,0,0,0,0,null,1,52,119,112,null,4,74,111,102,null,6,74,70,64,null,7,83,101,97,null,5,62,179,154,null,0,0,0,0,null,0,5,106,104,null,2,17,35,57,null,0,2,48,55,null,4,37,129,110,null,0,14,194,153,null,0,0,0,0,null,0,0,0,0,null,0,6,51,38,null,0,6,41,43]
["Colonia",3818,0,0,0,0,null,0,0,0,0,null,46,445,373,240,null,0,0,0,0,null,0,0,0,0,null,0,7,51,38,null,0,0,0,0,null,15,187,562,528,null,1,10,82,90,null,0,6,83,145,null,0,17,149,174,null,0,9,162,151,null,0,0,0,0,null,0,0,0,0,null,0,3,56,64,null,0,19,48,57]
["Durazno",1625,0,0,0,0,null,0,0,0,0,null,8,144,190,135,null,0,0,0,0,null,2,30,58,37,null,0,8,104,140,null,0,0,0,0,null,1,18,51,58,null,1,1,9,15,null,0,2,70,49,null,1,31,112,112,null,1,26,79,62,null,0,0,0,0,null,0,0,0,0,null,0,0,0,0,null,0,7,24,39]
["Flores",755,0,0,0,0,null,0,0,0,0,null,9,50,61,39,null,0,0,0,0,null,6,36,25,17,null,0,0,0,0,null,0,0,0,0,null,0,43,65,71,null,1,10,14,6,null,0,2,23,22,null,5,33,51,62,null,0,0,17,25,null,0,0,0,0,null,0,0,0,0,null,0,0,11,15,null,0,9,9,18]
["Florida",1974,0,0,0,0,null,0,0,0,0,null,20,220,202,68,null,0,0,0,0,null,2,48,66,45,null,0,4,62,43,null,0,0,0,0,null,1,40,142,242,null,0,9,54,67,null,0,0,3,74,null,2,21,99,93,null,0,4,73,97,null,0,0,0,0,null,0,0,0,0,null,0,2,44,52,null,0,4,37,34]
["Lavalleja",1585,0,0,0,0,null,0,0,0,null,null,13,163,195,184,null,0,0,0,0,null,9,118,116,74,null,0,2,28,32,null,1,22,33,18,null,2,26,71,84,null,1,4,18,23,null,0,2,20,23,null,1,9,63,54,null,0,6,49,49,null,0,0,0,0,null,0,0,0,0,null,0,0,0,0,null,2,3,41,26]
["Maldonado",4228,0,0,0,0,null,0,0,0,0,null,43,539,581,485,null,0,0,0,0,null,0,0,0,0,null,0,4,83,85,null,0,0,0,0,null,2,101,587,509,null,1,6,49,39,null,0,5,48,62,null,0,18,193,214,null,0,14,229,227,null,0,0,0,0,null,0,0,0,0,null,0,0,28,26,null,0,6,18,26]
["Paysandú",3389,0,0,0,0,null,0,0,0,0,null,19,116,189,163,null,0,0,0,0,null,9,88,102,92,null,5,92,260,283,null,1,24,42,29,null,5,91,293,310,null,3,17,70,78,null,1,21,100,156,null,1,38,131,132,null,6,63,142,159,null,0,0,1,0,null,0,0,0,0,null,0,0,0,0,null,0,4,27,26]
["Río Negro",1905,0,0,0,0,null,0,0,0,0,null,13,185,185,142,null,0,0,0,0,null,12,140,161,140,null,0,4,28,37,null,0,0,0,0,null,2,30,206,177,null,1,17,38,46,null,1,5,48,65,null,0,4,56,52,null,0,0,2,60,null,0,0,1,2,null,0,0,0,0,null,0,0,0,0,null,1,7,19,18]
["Rivera",3393,0,0,0,0,null,0,0,0,0,null,12,191,237,194,null,0,0,0,0,null,5,126,213,158,null,0,36,395,359,null,0,0,0,0,null,0,8,95,159,null,5,27,71,64,null,0,4,88,86,null,1,20,169,158,null,0,15,167,196,null,0,0,0,0,null,0,0,0,0,null,0,1,32,26,null,0,2,40,33]
["Rocha",2222,0,0,0,0,null,0,0,0,0,null,18,207,330,173,null,0,0,0,0,null,2,49,101,88,null,0,5,136,153,null,0,0,0,0,null,0,26,200,227,null,0,7,23,13,null,0,4,22,47,null,0,7,149,157,null,0,0,3,21,null,0,0,0,0,null,0,0,0,0,null,0,0,0,0,null,3,8,20,23]
["Salto",4429,10,116,107,53,null,0,0,0,0,null,16,306,283,226,null,0,0,0,0,null,0,0,0,0,null,1,107,574,512,null,0,0,0,0,null,0,10,89,136,null,5,63,142,128,null,0,1,18,77,null,0,17,378,389,null,2,36,237,239,null,0,0,1,2,null,0,0,0,0,null,1,17,30,24,null,2,13,34,27]
["San José",3449,0,0,0,0,null,2,100,101,81,null,21,214,201,164,null,0,0,0,0,null,9,135,122,83,null,0,26,133,126,null,0,0,0,0,null,4,88,440,459,null,1,23,112,125,null,0,2,44,47,null,0,12,144,168,null,0,19,29,24,null,0,0,0,0,null,0,0,0,0,null,1,36,27,37,null,0,6,36,47]
["Soriano",2461,0,0,0,0,null,0,0,0,0,null,22,270,271,162,null,0,0,0,0,null,1,29,23,20,null,2,44,205,222,null,0,0,0,0,null,0,10,182,218,null,1,8,35,43,null,0,7,44,85,null,0,6,107,111,null,0,6,121,116,null,0,0,0,0,null,0,0,0,0,null,0,0,0,0,null,0,15,36,39]
["Tacuarembó",2786,0,0,0,0,null,0,0,0,0,null,19,295,342,197,null,0,0,0,0,null,8,102,83,79,null,2,23,243,288,null,0,0,0,0,null,0,15,76,168,null,2,21,112,95,null,0,6,49,46,null,3,27,101,105,null,0,3,26,43,null,0,0,0,0,null,0,0,0,0,null,0,9,60,51,null,0,7,42,38]
["Treinta y Tres",1595,0,0,0,0,null,0,0,0,0,null,9,156,149,121,null,0,0,0,0,null,9,108,142,94,null,0,1,37,31,null,0,0,0,0,null,0,15,145,132,null,2,12,20,16,null,0,4,51,49,null,1,18,52,48,null,0,3,26,46,null,0,0,0,0,null,0,0,0,0,null,0,0,21,19,null,2,10,22,24]
["Fuente: Procesamiento propio en base a datos proporcionados por el D.E.E. — C.E.I.P."]

{"sheet":"II-1.2.3","index":7,"n_rows":34,"n_cols":14,"rows_kept":34,"cut":false,"hidden":false,"merged":[[0,11,1,13],[4,0,4,13],[5,0,9,0],[5,3,5,13],[6,3,6,7],[6,9,6,13],[7,1,9,1],[7,3,7,7],[7,9,7,13],[8,2,9,2],[8,13,9,13],[8,3,9,3],[8,4,9,4],[8,5,9,5],[8,6,9,6],[8,7,9,7],[8,12,9,12],[8,8,9,8],[8,9,9,9],[8,10,9,10],[8,11,9,11]]}
["CONSEJO DE EDUCACIÓN INICIAL Y PRIMARIA",null,null,null,null,null,null,null,null,null,null,"ALUMNOS MATRICULADOS"]
[]
["Cuadro Nº II-1.2.3"]
[]
["ALUMNOS MATRICULADOS EN EDUCACIÓN EN LA PRIMERA INFANCIA E INICIAL PRIVADA POR MODALIDAD Y NIVEL SEGÚN DEPARTAMENTO. AÑO 2016."]
["DEPARTAMENTO",null,null,"MODALIDAD"]
[null,null,null,"JARDINES PRIVADOS",null,null,null,null,null,"INICIAL EN COLEGIOS"]
[null,"TOTAL",null,"NIVEL",null,null,null,null,null,"NIVEL"]
[null,null,"Total","Nursery","2 años","3 años","4 años","5 años","Total","Nursery","2 años","3 años","4 años","5 años"]
[]
["TOTAL",{"$f":"+B12+B13","v":29911},{"$f":"+C12+C13","v":4589},{"$f":"SUM(D12:D13)","v":725},1117,1119,859.00000000000011,769,{"$f":"+I12+I13","v":25322},{"$f":"SUM(J12:J13)","v":1498.0000000000002},{"$f":"SUM(K12:K13)","v":3827},{"$f":"SUM(L12:L13)","v":5143},{"$f":"SUM(M12:M13)","v":7060.9999999999991},{"$f":"SUM(N12:N13)","v":7793.0000000000009}]
["MONTEVIDEO",{"$f":"+C12+I12","v":18025},{"$f":"SUM(D12:H12)","v":3279},560,773.00000000000011,796,617.00000000000011,533,{"$f":"SUM(J12:N12)","v":14746},788.00000000000023,2084.0000000000005,2922,4155.9999999999991,4796.0000000000009]
["RESTO DEL PAÍS",{"$f":"SUM(B15:B32)","v":11886},{"$f":"SUM(C15:C32)","v":1310},165,344,323,242,236,10576,710,1742.9999999999998,2221,2905,2997]
[]
["Artigas",{"$f":"+C15+I15","v":217},{"$f":"SUM(D15:H15)","v":0},0,0,0,0,0,{"$f":"+J15+K15+L15+M15+N15","v":217},39,40,51,50,37]
["Canelones",3883,434,30,98,95,113,98,3449,220,552.99999999999989,658,932.00000000000023,1086]
["Cerro Largo",230,0,0,0,0,0,0,230,0,11,40,82,97]
["Colonia",634,0,0,0,0,0,0,634,96,113,163,143,119]
["Durazno",279,0,0,0,0,0,0,279,22,28,80,85,64]
["Flores",119,0,0,0,0,0,0,119,5,30,19,24,41]
["Florida",138,18,8,4,4,2,0,120,0,11,34,34,41]
["Lavalleja",280,0,0,0,0,0,0,280,40,null,60.999999999999993,84,95]
["Maldonado",2087,169,9,32,47,36,45,1918,75.999999999999986,370.99999999999994,431,536.99999999999989,503.00000000000011]
["Paysandú",464,123,16,38,23,20,26,341,0,11,30,152,148]
["Río Negro",275,0,0,0,0,0,0,275,16.000000000000004,32.000000000000007,55.999999999999993,92,79]
["Rivera",344,0,0,0,0,0,0,344,18.999999999999996,74,72,81,98]
["Rocha",310,0,0,0,0,0,0,310,36,73,65,76,60]
["Salto",1006,282,50,98,89,32,13,724,68,120,144,184.00000000000003,208]
["San José",532,105,22,20,34,9,20,427,6,81,108,126,106.00000000000001]
["Soriano",270,43,13,15,8,7,0,227,0,48,49,65,65]
["Tacuarembó",688,136,17,39,23,23,34,552,67,122.00000000000001,126,119,118]
["Treinta y Tres",130,0,0,0,0,0,0,130,0,25,34,39,32]
["Fuente: Procesamiento propio en base a datos proporcionados por el D.E.E. — C.E.I.P."]
["Nota: Se refiere a centros privados habilitados o autorizados  por ANEP"]

{"sheet":"II-1.2.4","index":8,"n_rows":42,"n_cols":9,"rows_kept":42,"cut":false,"hidden":false,"merged":[[39,0,39,7],[0,8,2,9],[7,0,7,7],[8,0,12,0],[8,4,8,7],[9,1,10,3],[9,4,10,5],[9,6,10,7],[11,1,12,1],[11,2,11,3],[11,4,11,7]]}
["MINISTERIO DE EDUCACIÓN Y CULTURA",null,null,null,null,null,null,null,"Alumnos Matriculados "]
["Dirección de Educación – Área de Educación en la Primera Infancia"]
["INAU-CAIF"]
[]
[]
["Cuadro Nº II-1.2.4"]
[]
["ALUMNOS MATRICULADOS EN EDUCACIÓN EN LA PRIMERA INFANCIA E INICIAL  POR FORMA DE ADMINISTRACIÓN Y SEXO SEGÚN DEPARTAMENTO. AÑO 2016."]
["  DEPARTAMENTO",null,null,null,"FORMA DE ADMINISTRACIÓN"]
[null,"TOTAL",null,null,"CAIF,CAPI Y NUESTROS NIÑOS",null,"Centros Privados"]
[]
[null,"TOTAL","SEXO",null,"SEXO"]
[null,null,"M","F","M","F","M","F"]
["TOTAL",{"$f":"+B15+B16","v":73033},{"$f":"E14+G14","v":37361},35672,{"$f":"E15+E16","v":28083},{"$f":"F15+F16","v":26993},{"$f":"G15+G16","v":9278},{"$f":"H15+H16","v":8679}]
["MONTEVIDEO",{"$f":"+C15+D15","v":24693},12821,11872,7037,6667,5784,5205]
["RESTO DEL PAÍS",{"$f":"+C16+D16","v":48340},24540,23800,{"$f":"SUM(E17:E35)","v":21046},{"$f":"SUM(F17:F35)","v":20326},{"$f":"SUM(G17:G35)","v":3494},{"$f":"SUM(H17:H35)","v":3474}]
[]
["Artigas",{"$f":"+C18+D18","v":2570},{"$f":"E18+G18","v":1272},{"$f":"F18+H18","v":1298},1201,1212,71,86]
["Canelones",10972,{"$f":"E19+G19","v":5628},5344,4314,4035,1314,1309]
["Cerro Largo",2812,1382,1430,1371,1410,11,20]
["Colonia",2494,1281,1213,999,962,282,251]
["Durazno",2223,1156,1067,1027,963,129,104]
["Flores",900,455,445,421,387,34,58]
["Florida",1802,899,903,689,682,210,221]
["Lavalleja",1064,549,515,479,437,70,78]
["Maldonado",2295,1135,1160,806,821,329,339]
["Paysandú",3715,1901,1814,1716,1624,185,190]
["Río Negro",1488,730,758,673,703,57,55]
["Rivera",2978,1488,1490,1262,1265,226,225]
["Rocha",1968,984,984,939,937,45,47]
["Salto",3550,1826,1724,1669,1612,157,112]
["San José",2055,1045,1010,874,850,171,160]
["Soriano",2020,1054,966,876,780,178,186]
["Tacuarembó",2200,1115,1085,1090,1052,25,33]
["Treinta y Tres",1234,640,594,640,594,0,0]
["Fuente: Procesamiento propio en base a datos proporcionados por:"]
["        Registro Nacional de Centros de Educación Infantil Privados. MEC"]
["        Para CAIF Y CENTROS DIURNOS: SIPI de INAU."]
["Nota: Privados supervisados por el MEC"]
["Los centros pertenecientes al Proyecto  Nuestros Niños de la Intendencia Municipal de Montevideo, se encuentran incluidos en la matrícula de Centros Privados, en tanto los mismos son supervisados por el MEC.  "]
["CAIF y Centros Diurnos incluyen para este año la matrícula de Experiencia Oportuna. "]
["(0 a 1 año) que en el anuario 2012 solo se incluía en el cuadro II"]

{"sheet":"II-1.2.5","index":9,"n_rows":21,"n_cols":8,"rows_kept":21,"cut":false,"hidden":false,"merged":[[6,5,7,5],[6,7,7,7],[10,3,11,3],[6,6,7,6],[6,0,7,0],[6,1,7,1],[6,2,7,2],[6,3,7,3],[6,4,7,4],[0,7,1,8],[0,9,1,10],[1,0,1,5],[4,0,4,7],[5,2,5,7],[20,0,20,8],[21,0,21,8],[22,0,22,7],[23,0,23,7],[24,0,24,7]]}
["MINISTERIO DE EDUCACIÓN Y CULTURA",null,null,null,null,null,null,"ALUMNOS MATRICULADOS"]
["Dirección de Educación – Área de Educación en la Primera Infancia"]
[]
["Cuadro Nº II-1.2.5"]
["ALUMNOS MATRICULADOS EN EDUCACIÓN EN LA PRIMERA INFANCIA E INICIAL  POR FORMA DE ADMINISTRACIÓN SEGÚN EDAD. AÑO 2016."]
[null,null,"FORMA DE ADMINISTRACIÓN"]
["EDAD",null,"CEIP- PÚBLICOS","CEIP-PRIVADOS (Habilitados y Autorizados) ","CAIF","CAPI","NUESTROS NIÑOS","PRIVADOS MEC"]
[]
[]
["TOTAL",{"$f":"SUM(B11:B16)","v":188134},85130,29971,52129,1804,1143,17957]
["0 a 11 meses",{"$f":"SUM(C11:H11)","v":10745},29,2223,7530,124,4,835]
["1 año",{"$f":"SUM(C12:H12)","v":18756},55,null,14526,499,128,3548]
["2 años",27200,1104,5004,14813,684,435,5160]
["3 años",39256,14678,6262,12855,410,491,4560]
["4 años",48039,35093,7919.9999999999991,2405,87,85,2449]
["5 años",44138,34171,8562,null,0,null,1405]
["Fuente: Procesamiento propio en base a datos proporcionados por:"]
["Registro Nacional de Centros de Educación Infantil Privados. MEC"]
["La denomicación de Centros Diurnos pasó a ser CAPI (Centros de Atención a la Primera Infancia)"]
["Para CAIF, CAPI Y NUESTROS NIÑOS: SIPI de INAU."]
["Para CAIF las edades de 0 y 1 año corresponden a la modalidad Experiencia Oportuna."]

{"sheet":"II-1.2.6","index":10,"n_rows":33,"n_cols":6,"rows_kept":33,"cut":false,"hidden":false,"merged":[[0,5,1,6],[4,0,4,5],[5,2,5,5],[5,0,8,0],[5,1,8,1],[7,2,7,5],[6,2,6,3],[6,4,6,5]]}
["CONSEJO DE EDUCACIÓN INICIAL Y PRIMARIA",null,null,null,null,"ALUMNOS MATRICULADOS"]
[]
["Cuadro Nº II-1.2.6"]
[]
["ALUMNOS MATRICULADOS EN EDUCACIÓN EN LA PRIMERA INFANCIA E INICIAL PÚBLICA DEL CEIP POR ÁREA DEMOGRÁFICA SEGÚN DEPARTAMENTO. AÑO 2016."]
["DEPARTAMENTO","TOTAL","NIVEL"]
[null,null,"Educación Inicial",null,"Inicial en Escuelas"]
[null,null,"ÁREA DEMOGRÁFICA"]
[null,null,"RURAL","URBANA","RURAL","URBANA"]
["TOTAL ",{"$f":"SUM(C10:F10)","v":85130},{"$f":"SUM(C11:C12)","v":0},{"$f":"SUM(D11:D12)","v":37199},3968,43963]
["MONTEVIDEO",{"$f":"SUM(C11:F11)","v":26156},0,14211,0,11945]
["RESTO DEL PAÍS",58974,{"$f":"SUM(C14:C31)","v":0},{"$f":"SUM(D14:D31)","v":22988},3968,32018]
[]
["Artigas",{"$f":"SUM(C14:F14)","v":2420},0,612,182,1626]
["Canelones",14206,0,7236,567,6403]
["Cerro Largo",2734,0,1077,201,1456]
["Colonia",3818,0,1104,307,2407]
["Durazno",1625,0,604,96,925]
["Flores",755,0,243,67,445]
["Florida",1974,0,671,205,1098]
["Lavalleja",1585,0,872,114,599]
["Maldonado",4228,0,1648,145,2435]
["Paysandú",3389,0,778,226,2385]
["Río Negro",1905,0,978,150,777]
["Rivera",3393,0,1136,242,2015]
["Rocha",2222,0,968,97,1157]
["Salto",4429,0,1117,417,2895]
["San José",3449,0,1233,350,1866]
["Soriano",2461,0,798,177,1486]
["Tacuarembó",2786,0,1125,317,1344]
["Treinta y Tres",1595,0,788,108,699]
["Fuente: Procesamiento propio en base a datos proporcionados "]
["        por el D.E.E. — C.E.I.P."]

{"sheet":"II-1.3.1","index":11,"n_rows":33,"n_cols":4,"rows_kept":33,"cut":false,"hidden":false,"merged":[[0,3,1,4],[4,0,4,1],[5,0,6,0],[5,1,6,1],[30,0,30,4]]}
["CONSEJO DE EDUCACIÓN INICIAL Y PRIMARIA",null,null,"PERSONAL DOCENTE"]
[]
["Cuadro Nº II-1.3.1"]
[]
["PERSONAL DOCENTE DE EDUCACIÓN EN LA PRIMERA INFANCIA E INICIAL  PÚBLICA DEL CEIP SEGÚN DEPARTAMENTO. AÑO 2016."]
["DEPARTAMENTO","DOCENTES"]
[]
["TOTAL",{"$f":"SUM(B9:B10)","v":2974}]
["MONTEVIDEO",1003]
["RESTO DEL PAÍS",{"$f":"SUM(B12:B29)","v":1971}]
[]
["Artigas",82]
["Canelones",477]
["Cerro Largo",89]
["Colonia",107]
["Durazno",54]
["Flores",27]
["Florida",73]
["Lavalleja",60]
["Maldonado",160]
["Paysandú",100]
["Río Negro",71]
["Rivera",112]
["Rocha",77]
["Salto",131]
["San José",111]
["Soriano",85]
["Tacuarembó",97]
["Treinta y Tres",58]
["Fuente: D.E.E. - C.E.I.P"]
["Nota: Personal docente solo considera maestro/a de clase. "]
["        "]
["        "]

{"sheet":"II-1.2.7","index":12,"n_rows":33,"n_cols":10,"rows_kept":33,"cut":false,"hidden":false,"merged":[[10,9,11,11],[33,0,33,7],[36,0,36,7],[0,9,1,10],[5,0,5,7],[6,0,8,0],[7,1,8,1],[7,2,8,2],[7,3,8,3],[7,4,8,4],[7,5,8,5],[7,6,8,6],[7,8,8,8],[6,2,6,8],[7,7,8,7]]}
["MINISTERIO DE EDUCACIÓN Y CULTURA",null,null,null,null,null,null,null,null,"ALUMNOS MATRICULADOS"]
["Dirección de Educación – Área de Educación en la Primera Infancia"]
[]
["Cuadro Nº II-1.2.7"]
[]
["ALUMNOS MATRICULADOS EN EDUCACIÓN EN LA PRIMERA INFANCIA E INICIAL  EN CENTROS PRIVADOS HABILITADOS POR EL MEC POR EDAD SEGÚN DEPARTAMENTO. AÑO 2016."]
["DEPARTAMENTO",null,"E D A D"]
[null,"TOTAL","0 a 11 meses","1 año","2 años","3 años","4 años","5 años","6 años"]
[]
["TOTAL",{"$f":"+B11+B12","v":17957},835,3548,5160,4560,2449,1152,253]
["MONTEVIDEO",{"$f":"+C11+D11+E11+F11+G11+H11+I11","v":10989},643,2230,3142,2767,1453,648,106]
["RESTO DEL PAÍS",{"$f":"SUM(B14:B31)","v":6968},{"$f":"SUM(C14:C31)","v":192},1318,2018,1793,996,504,147]
[]
["Artigas",{"$f":"+C14+D14+E14+F14+G14+H14+I14","v":157},2,26,28,48,34,10,9]
["Canelones",{"$f":"+C15+D15+E15+F15+G15+H15+I15","v":2623},96,436,707,673,438,248,25]
["Cerro Largo",31,0,10,11,10,0,0,0]
["Colonia",533,13,137,228,151,4,0,0]
["Durazno",233,0,47,48,40,58,40,0]
["Flores",92,0,18,19,26,19,6,4]
["Florida",431,7,79,123,94,60,14,54]
["Lavalleja",148,4,32,61,41,10,0,0]
["Maldonado",668,9,107,167,167,121,52,45]
["Paysandú",375,28,85,89,102,32,39,0]
["Río Negro",112,0,26,42,29,9,6,0]
["Rivera",451,6,103,115,120,70,37,0]
["Rocha",92,0,21,24,14,13,11,9]
["Salto",269,3,63,85,85,28,5,0]
["San José",331,13,43,116,97,44,17,1]
["Soriano",364,10,69,138,81,49,17,0]
["Tacuarembó",58,1,16,17,15,7,2,0]
["Treinta y Tres",0,0,0,0,0,0,0,0]
["Fuente: Procesamiento propio en base a datos proporcionados por:"]
["        Registro Nacional de Centros de Educación Infantil Privados. MEC"]

{"sheet":"II-1.3.2","index":13,"n_rows":35,"n_cols":5,"rows_kept":35,"cut":false,"hidden":false,"merged":[[32,0,32,4],[0,4,1,5],[4,0,4,4],[5,0,8,0],[5,2,6,3],[7,1,8,1],[7,2,8,2],[7,3,8,3],[7,4,8,4]]}
["CONSEJO DE EDUCACIÓN INICIAL Y PRIMARIA",null,null,null,"PERSONAL DOCENTE"]
[]
["Cuadro Nº II-1.3.2."]
[]
["PERSONAL DOCENTE DE EDUCACIÓN EN LA PRIMERA INFANCIA E INICIAL PRIVADA SEGÚN DEPARTAMENTO. AÑO 2016."]
["DEPARTAMENTO",null,"DOCENTES"]
[]
[null,"TOTAL","Colegios Habilitados","Colegios Autorizados","Jardines de Infantes Autorizados"]
[]
["TOTAL",{"$f":"SUM(B11:B12)","v":1089},{"$f":"SUM(C11:C12)","v":751},{"$f":"SUM(D11:D12)","v":33},{"$f":"SUM(E11:E12)","v":305}]
["MONTEVIDEO",{"$f":"+C11+D11+E11","v":667},429,28,210]
["RESTO DEL PAÍS",{"$f":"+C12+D12+E12","v":422},{"$f":"SUM(C14:C31)","v":322},{"$f":"SUM(D14:D31)","v":5},{"$f":"SUM(E14:E31)","v":95}]
[]
["Artigas",{"$f":"+C14+D14+E14","v":8},8,0,0]
["Canelones",{"$f":"+C15+D15+E15","v":127},93,5,29]
["Cerro Largo",9,5,0,4]
["Colonia",25,22,0,3]
["Durazno",5,5,0,0]
["Flores",4,4,0,0]
["Florida",5,4,0,1]
["Lavalleja",9,9,0,0]
["Maldonado",70,59,0,11]
["Paysandú",16,9,0,7]
["Río Negro",12,12,0,0]
["Rivera",12,12,0,0]
["Rocha",10,10,0,0]
["Salto",49,23,0,26]
["San José",17,13,0,4]
["Soriano",10,9,0,1]
["Tacuarembó",31,22,0,9]
["Treinta y Tres",3,3,0,0]
["Fuente: D.E.E. — C.E.P.","C.E.I.P"]
["Nota: Personal docente solo considera maestro/a de clase. "]
["        Centros privados habilitados o autorizados por ANEP"]
["        "]

{"sheet":"II-1.3.3 ","index":14,"n_rows":37,"n_cols":7,"rows_kept":37,"cut":false,"hidden":false,"merged":[[0,4,1,5],[4,0,5,6],[6,2,6,3],[7,0,8,0],[7,1,8,1],[7,2,8,2],[7,3,8,3],[7,4,8,4],[7,5,8,5],[7,6,8,6]]}
["CONSEJO DE EDUCACIÓN INICIAL Y PRIMARIA",null,null,null,"PERSONAL DOCENTE"]
[]
["Cuadro Nº II-1.3.3."]
[]
["PERSONAL DOCENTE EN EDUCACIÓN EN LA PRIMERA INFANCIA PRIVADA SUPERVISADA POR EL MEC SEGÚN FUNCIÓN Y DEPARTAMENTO. AÑO 2016."]
[]
[null,null,"FUNCIÓN"]
["DEPARTAMENTO","TOTAL","Director responsable técnico","Educadores","Otros especialistas","Profesores especiales","Responsable legal"]
[]
["TOTAL",{"$f":"SUM(C10:G10)","v":3768},{"$f":"C12+C11","v":356},{"$f":"D11+D12","v":2505},218,324,{"$f":"G11+G12","v":365}]
["MONTEVIDEO",{"$f":"SUM(C11:G11)","v":2450},214,1627,160,230,219]
["RESTO DEL PAIS",{"$f":"SUM(C12:G12)","v":1318},{"$f":"SUM(C14:C31)","v":142},{"$f":"SUM(D14:D31)","v":878},{"$f":"SUM(E14:E31)","v":58},{"$f":"SUM(F14:F31)","v":94},{"$f":"SUM(G14:G31)","v":146}]
[]
["Artigas",{"$f":"SUM(C14:G14)","v":29},3,22,1,0,3]
["Canelones ",{"$f":"SUM(C15:G15)","v":518},56,344,25,36,57]
["Cerro Largo",11,1,6,2,1,1]
["Colonia",91,13,59,2,3,14]
["Durazno",41,3,32,2,2,2]
["Flores",14,1,10,1,1,1]
["Florida",53,5,34,5,3,6]
["Lavalleja",38,5,27,0,1,5]
["Maldonado",146,13,94,7,16,16]
["Paysandú",81,7,61,1,6,6]
["Rio Negro",15,2,7,2,2,2]
["Rivera",85,7,61,2,8,7]
["Rocha",21,3,12,2,1,3]
["Salto ",43,5,30,2,2,4]
["San José",51,8,29,2,3,9]
["Soriano",67,8,42,2,7,8]
["Tacuarembó",14,2,8,0,2,2]
["Treinta y Tres",0,0,0,0,0,0]
["Fuente: Procesamiento propio en base a datos proporcionados por:   Registro Nacional de Centros de Educación Infantil Privados. MEC"]
["Nota:"]
["Director responsable técnico: art 4. 268/014"]
["Educadores: Son aquellos que la tarea de docencia es directa, ya sea de carácter de docente propiamente dicho o de auxiliar. Informe Primer censo nacional de centros de Educaciòn Infanti Privados."]
["Otros especialistas: Se refiere a profesionales que apoyan la tarea de los educadores sin ejercer educación directa. En esta categoría entran psicólogo, psicomotricistas, trabajadores sociales, nutricionistas, médico pediatra y otros especialistas."]
["Profesores especiales: Son docentes que se especializan en un área en particular. Esta categoría incluye profesores de computación, inglés, plástica, eduación musical u artística. "]

{"sheet":" PRIMARIA ","index":15,"n_rows":200,"n_cols":2,"rows_kept":200,"cut":false,"hidden":false,"merged":[]}
[]
[]
[]
[]
[]
[]
["Cuadro Nº II-2.1.1  "," ESTABLECIMIENTOS DE EDUCACIÓN PRIMARIA POR FORMA DE ADMINISTRACIÓN Y TIPO DE EDUCACIÓN SEGÚN DEPARTAMENTO. AÑO 2016. "]
[""]
["Cuadro Nº II-2.1.2  ","ESTABLECIMIENTOS DE EDUCACIÓN PRIMARIA PÚBLICA COMÚN POR ÁREA DEMOGRÁFICA Y CATEGORÍA SEGÚN DEPARTAMENTO. AÑO 2016. "]
[""]
["Cuadro Nº II-2.1.3  ","ESTABLECIMIENTOS DE EDUCACIÓN PRIMARIA PÚBLICA ESPECIAL POR TIPO DE DISCAPACIDAD SEGÚN DEPARTAMENTO. AÑO 2016."]
[""]
["Cuadro Nº II-2.1.4  ","ESTABLECIMIENTOS DE EDUCACIÓN PRIMARIA PRIVADA POR TIPO DE EDUCACIÓN SEGÚN DEPARTAMENTO. AÑO 2016."]
[""]
[""]
["Cuadro Nº II-2.2.1  ","ALUMNOS MATRICULADOS EN EDUCACIÓN PRIMARIA COMÚN POR FORMA DE ADMINISTRACIÓN Y SEXO SEGÚN DEPARTAMENTO. AÑO 2016. "]
[""]
["Cuadro Nº II-2.2.2  ","ALUMNOS MATRICULADOS EN EDUCACIÓN PRIMARIA PÚBLICA POR TIPO DE EDUCACIÓN Y SEXO SEGÚN DEPARTAMENTO. AÑO 2016. "]
[""]
["Cuadro Nº II-2.2.3  "," ALUMNOS MATRICULADOS EN EDUCACIÓN PRIMARIA PÚBLICA COMÚN POR ÁREA DEMOGRÁFICA Y CATEGORÍA SEGÚN DEPARTAMENTO. AÑO 2016. "]
[""]
["Cuadro Nº II-2.2.4  "," ALUMNOS MATRICULADOS EN EDUCACIÓN PRIMARIA PÚBLICA ESPECIAL POR TIPO DE DISCAPACIDAD SEGÚN DEPARTAMENTO. AÑO 2016. "]
[""]
["Cuadro Nº II-2.2.5  "," ALUMNOS MATRICULADOS EN EDUCACIÓN ESPECIAL PÚBLICA POR EDADES SIMPLES Y SEXO SEGÚN DEPARTAMENTO. AÑO 2016. "]
[""]
["Cuadro Nº II-2.2.6  "," ALUMNOS MATRICULADOS EN EDUCACIÓN PRIMARIA PRIVADA POR TIPO DE EDUCACIÓN SEGÚN DEPARTAMENTO. AÑO 2016. "]
[""]
["Cuadro Nº II-2.2.7  "," ALUMNOS MATRICULADOS EN EDUCACIÓN ESPECIAL PRIVADA POR EDADES SIMPLES Y SEXO SEGÚN DEPARTAMENTO. AÑO 2016. "]
[""]
["Cuadro Nº II-2.2.8  "," ALUMNOS MATRICULADOS EN EDUCACIÓN PRIMARIA COMÚN POR GRADO Y FORMA DE ADMINISTRACIÓN SEGÚN EDAD. AÑO 2016. "]
[""]
["Cuadro Nº II-2.2.9  ","ALUMNOS MATRICULADOS EN EDUCACIÓN PRIMARIA COMÚN PÚBLICA POR GRADO Y SEXO SEGÚN EDAD. AÑO 2016. "]
[""]
["Cuadro Nº II-2.2.10 ","ALUMNOS MATRICULADOS EN EDUCACIÓN PRIMARIA COMÚN PRIVADA POR GRADO Y SEXO SEGÚN EDAD. AÑO 2016. "]
[""]
["Cuadro Nº II-2.2.11 "," ALUMNOS MATRICULADOS EN EDUCACIÓN PRIMARIA COMÚN POR GRADO Y FORMA DE ADMINISTRACIÓN SEGÚN DEPARTAMENTO. AÑO 2016. "]
[""]
["Cuadro Nº II-2.2.12 ","RENDIMIENTO ESCOLAR EDUCACIÓN PRIMARIA COMÚN PÚBLICA POR ÁREA DEMOGRÁFICA SEGÚN GRADO. AÑO 2016. "]
[""]
["Cuadro Nº II-2.2.13 ","RENDIMIENTO ESCOLAR EN EDUCACIÓN PRIMARIA COMÚN PÚBLICA POR  ÁREA DEMOGRÁFICA SEGÚN DEPARTAMENTO. AÑO 2016. "]
[""]
["Cuadro Nº II-2.2.14 ","RENDIMIENTO ESCOLAR  EN EDUCACIÓN PRIMARIA COMÚN PÚBLICA POR SEXO SEGÚN DEPARTAMENTO. AÑO 2016."]
[""]
["Cuadro Nº II-2.2.15 ","RENDIMIENTO ESCOLAR EN EDUCACIÓN PRIMARIA COMÚN PRIVADA POR SEXO SEGÚN DEPARTAMENTO. AÑO 2016. "]
[""]
["Cuadro Nº II-2.2.16 ","RENDIMIENTO ESCOLAR DE EDUCACIÓN PRIMARIA COMÚN PÚBLICA POR ÁREA DEMOGRÁFICA SEGÚN DEPARTAMENTO. AÑO 2016. "]
[""]
["Cuadro Nº II-2.2.17 ","RENDIMIENTO ESCOLAR DE EDUCACIÓN PRIMARIA COMÚN POR FORMA DE ADMINISTRACIÓN SEGÚN DEPARTAMENTO. AÑO 2016. "]
[""]
["Cuadro Nº II-2.2.18 ","ASISTENCIA INSUFICIENTE Y ABANDONO INTERMITENTE DE 1º GRADO Y 1º A 6º GRADO EN EDUCACIÓN COMÚN PÚBLICA SEGÚN DEPARTAMENTO. AÑO 2016. "]
[""]
[""]
["Cuadro Nº II-2.3.1  ","PERSONAL DOCENTE DE EDUCACIÓN PRIMARIA PÚBLICA POR TIPO DE DESEMPEÑO DOCENTE SEGÚN DEPARTAMENTO. AÑO 2016. "]
[""]
["Cuadro Nº II-2.3.2  ","PERSONAL DOCENTE DE EDUCACIÓN PRIMARIA PRIVADA POR TIPO DE ESTABLECIMIENTO Y TIPO DE DESEMPEÑO DOCENTE SEGÚN DEPARTAMENTO. AÑO 2016. "]
[""]
[""]
[""]
[""]
[""]
[""]
[""]
[""]
[""]
[""]
[""]
[""]
[""]
[""]
[""]
[""]
[""]
[""]
[""]
[""]
[""]
[""]
[""]
[""]
[""]
[""]
[""]
[""]
[""]
[""]
[""]
[""]
[""]
[""]
[""]
[""]
[""]
[""]
[""]
[""]
[""]
[""]
[""]
[""]
[""]
[""]
[""]
[""]
[""]
[""]
[""]
[""]
[""]
[""]
[""]
[""]
[""]
[""]
[""]
[""]
[""]
[""]
[""]
[""]
[""]
[""]
[""]
[""]
[""]
[""]
[""]
[""]
[""]
[""]
[""]
[""]
[""]
[""]
[""]
[""]
[""]
[""]
[""]
[""]
[""]
[""]
[""]
[""]
[""]
[""]
[""]
[""]
[""]
[""]
[""]
[{"$f":"MID(B101, 1,20)","v":""}]
[""]
[""]
[""]
[""]
[""]
[""]
[""]
[""]
[""]
[""]
[""]
[""]
[""]
[""]
[""]
[""]
[""]
[""]
[""]
[""]
[""]
[""]
[""]
[""]
[""]
[""]
[""]
[""]
[""]
[""]
[""]
[""]
[""]
[""]
[{"$f":"MID(B136, 1,20)","v":""}]
[""]
[""]
[""]
[""]
[""]
[""]
[""]
[""]
[""]
[""]
[""]
[""]
[""]
[""]

{"sheet":"II-2.1.1","index":16,"n_rows":32,"n_cols":6,"rows_kept":32,"cut":false,"hidden":false,"merged":[[7,4,8,4],[7,5,8,5],[30,0,30,7],[0,4,1,6],[3,0,3,5],[4,0,8,0],[4,2,4,5],[5,1,8,1],[5,2,5,5],[6,2,6,3],[6,4,6,5],[7,2,8,2],[7,3,8,3]]}
["CONSEJO DE EDUCACIÓN PRIMARIA",null,null,null,"ESTABLECIMIENTOS"]
[]
["Cuadro Nº II-2.1.1"]
["ESTABLECIMIENTOS DE EDUCACIÓN PRIMARIA POR FORMA DE ADMINISTRACIÓN Y TIPO DE EDUCACIÓN SEGÚN DEPARTAMENTO. AÑO 2016."]
["DEPARTAMENTO",null,"FORMA DE ADMINISTRACIÓN"]
[null,"TOTAL","TIPO DE EDUCACIÓN"]
[null,null,"PÚBLICA",null,"PRIVADA"]
[null,null,"Común","Especial","Común","Especial"]
[]
["TOTAL",{"$f":"+C10+D10+E10+F10","v":2524},{"$f":"SUM(C11:C12)","v":2022},{"$f":"SUM(D11:D12)","v":79},{"$f":"SUM(E11,E12)","v":352},{"$f":"SUM(F11:F12)","v":71}]
["MONTEVIDEO",{"$f":"+C11+D11+E11+F11","v":485},248,26,172,39]
["RESTO DEL PAÍS",2039,{"$f":"SUM(C13:C30)","v":1774},{"$f":"SUM(D13:D30)","v":53},{"$f":"SUM(E13:E30)","v":180},{"$f":"SUM(F13:F30)","v":32}]
["Artigas",84,78,2,2,2]
["Canelones",310,231,10,63,6]
["Cerro Largo",122,113,3,6,0]
["Colonia",140,125,4,9,2]
["Durazno",87,80,2,5,0]
["Flores",37,33,1,3,0]
["Florida",104,97,2,4,1]
["Lavalleja",92,83,2,7,0]
["Maldonado",113,79,4,27,3]
["Paysandú",120,103,2,10,5]
["Río Negro",68,58,2,7,1]
["Rivera",132,119,4,7,2]
["Rocha",79,70,3,4,2]
["Salto",114,100,3,7,4]
["San José",117,107,3,7,0]
["Soriano",107,96,3,4,4]
["Tacuarembó",141,132,2,7,0]
["Treinta y Tres",72,70,1,1,0]
["Fuente: Procesamiento propio en base a datos proporcionados por el D.E.E. — C.E.I.P."]
["Nota: Pública no incluye JICI"]

{"sheet":" II-2.1.2","index":17,"n_rows":32,"n_cols":13,"rows_kept":32,"cut":false,"hidden":false,"merged":[[8,6,9,6],[8,8,9,8],[8,9,9,9],[8,11,9,11],[8,12,9,12],[0,11,1,12],[4,0,4,12],[5,0,9,0],[5,1,9,1],[5,2,5,12],[6,3,6,9],[6,11,6,12],[7,2,9,2],[7,3,7,9],[7,10,9,10],[7,11,7,12],[8,3,9,3],[8,7,9,7],[8,4,9,4],[8,5,9,5]]}
["CONSEJO DE EDUCACIÓN PRIMARIA",null,null,null,null,null,null,null,null,null,null,"ESTABLECIMIENTOS"]
[]
["Cuadro Nº II-2.1.2"]
[]
["ESTABLECIMIENTOS DE EDUCACIÓN PRIMARIA PÚBLICA COMÚN POR ÁREA DEMOGRÁFICA Y CATEGORÍA SEGÚN DEPARTAMENTO. AÑO 2016."]
["DEPARTAMENTO","TOTAL","ÁREA DEMOGRÁFICA"]
[null,null,null,"URBANA",null,null,null,null,null,null,null,"RURAL"]
[null,null,"Total Urbana","CATEGORÍA",null,null,null,null,null,null,"Total Rural","CATEGORÍA"]
[null,null,null,"Común","De Práctica","Tiempo Completo","Aprender","Tiempo Extendido","Habilitada de Práctica","JICI",null,"Común","Internado Rural"]
[]
["TOTAL",{"$f":"+C11+K11","v":1988},{"$f":"SUM(D11:J11)","v":934},{"$f":"SUM(D12:D13)","v":293},{"$f":"SUM(E12:E13)","v":62},209,251,{"$f":"H12+H13","v":38},79,2,{"$f":"SUM(K12:K13)","v":1054},1084,6]
["MONTEVIDEO",249,{"$f":"SUM(D12:J12)","v":249},84,18,49,82,7,8,1,0,0,0]
["RESTO DEL PAÍS",1739,{"$f":"SUM(D13:J13)","v":685},{"$f":"SUM(D14:D31)","v":209},44,160,169,{"$f":"SUM(H14:H31)","v":31},71,1,1054,1084,6]
["Artigas",78,{"$f":"SUM(D14:J14)","v":31},5,2,9,10,1,4,0,{"$f":"+L14+M14","v":47},46,1]
["Canelones",231,{"$f":"SUM(D15:J15)","v":138},38,6,30,44,7,13,0,{"$f":"+L15+M15","v":93},93,0]
["Cerro Largo",114,29,3,2,9,7,2,5,1,85,85,0]
["Colonia",125,42,19,4,6,6,3,4,0,83,83,0]
["Durazno",80,24,5,2,7,6,0,4,0,56,56,0]
["Flores",33,10,3,1,4,0,1,1,0,23,22,1]
["Florida",97,28,10,2,8,1,4,3,0,69,69,0]
["Lavalleja",83,24,10,2,6,3,1,2,0,59,59,0]
["Maldonado",43,43,16,2,12,5,1,7,0,null,35,1]
["Paysandú",103,46,16,3,9,14,0,4,0,57,55,2]
["Río Negro",58,21,11,2,5,2,0,1,0,37,36,1]
["Rivera",119,41,7,3,9,17,1,4,0,78,78,0]
["Rocha",70,32,12,2,9,7,0,2,0,38,38,0]
["Salto",100,40,5,3,12,13,2,5,0,60,60,0]
["San José",107,36,18,2,6,5,3,2,0,71,71,0]
["Soriano",96,35,13,2,7,10,0,3,0,61,61,0]
["Tacuarembó",132,43,10,2,7,16,5,3,0,89,89,0]
["Treinta y Tres",70,22,8,2,5,3,0,4,0,48,48,0]
["Fuente: Procesamiento propio en base a datos proporcionados por el DEE — CEIP",null,null,null,null,"D.E.E.-C.E.I.P."]

{"sheet":"II-2.1.3","index":18,"n_rows":35,"n_cols":5,"rows_kept":35,"cut":false,"hidden":false,"merged":[[30,0,30,4],[0,3,1,4],[4,0,4,4],[5,0,7,0],[5,1,7,1],[5,2,5,4],[6,2,7,2],[6,3,7,3],[6,4,7,4]]}
["CONSEJO DE EDUCACIÓN PRIMARIA",null,null,"Establecimientos"]
[]
["Cuadro Nº II-2.1.3"]
[]
["ESTABLECIMIENTOS DE EDUCACIÓN PRIMARIA PÚBLICA ESPECIAL POR TIPO DE DISCAPACIDAD SEGÚN DEPARTAMENTO. AÑO 2016."]
["DEPARTAMENTO","TOTAL","DISCAPACIDAD"]
[null,null,"Intelectual","Auditiva","Visual"]
[]
["TOTAL",{"$f":"+B10+B11","v":79},{"$f":"SUM(C10:C11)","v":73},{"$f":"SUM(D10:D11)","v":4},{"$f":"SUM(E10:E11)","v":2}]
["MONTEVIDEO",{"$f":"+C10+D10+E10","v":26},23,1,2]
["RESTO DEL PAÍS",{"$f":"SUM(B12:B29)","v":53},{"$f":"SUM(C12:C29)","v":50},{"$f":"SUM(D12:D29)","v":3},{"$f":"SUM(E12:E29)","v":0}]
["Artigas",{"$f":"+C12+D12+E12","v":2},2,0,0]
["Canelones",10,10,0,0]
["Cerro Largo",3,3,0,0]
["Colonia",4,4,0,0]
["Durazno",2,2,0,0]
["Flores",1,1,0,0]
["Florida",2,2,0,0]
["Lavalleja",2,2,0,0]
["Maldonado",4,3,1,0]
["Paysandú",2,2,0,0]
["Río Negro",2,2,0,0]
["Rivera",4,3,1,0]
["Rocha",3,3,0,0]
["Salto",3,2,1,0]
["San José",3,3,0,0]
["Soriano",3,3,0,0]
["Tacuarembó",2,2,0,0]
["Treinta y Tres",1,1,0,0]
["Fuente: DEE — CEIP"]
["Nota: Los establecimientos que atienden discapacidades intelectuales, además de atender niños con disfunciones clásicamente tipificadas como “Intelectuales”, atienden a los niños con discapacidades de orden motriz o de carácter, lo que implica que la matrícula correspondiente los agrupa."]
["        "]
["        "]
["       "]
["        "]

{"sheet":"II-2.1.4","index":19,"n_rows":31,"n_cols":6,"rows_kept":31,"cut":false,"hidden":false,"merged":[[6,8,6,15],[7,3,8,3],[7,4,8,4],[7,8,7,15],[11,8,12,9],[11,10,12,10],[11,11,11,13],[0,4,1,5],[4,0,4,5],[5,0,8,0],[5,1,8,1],[5,3,5,5],[6,2,8,2],[6,3,6,4],[6,5,8,5]]}
["CONSEJO DE EDUCACIÓN PRIMARIA",null,null,null,"ESTABLECIMIENTOS"]
[]
["Cuadro Nº II-2.1.4"]
[]
["ESTABLECIMIENTOS DE EDUCACIÓN PRIMARIA PRIVADA POR TIPO DE EDUCACIÓN SEGÚN DEPARTAMENTO. AÑO 2016."]
["DEPARTAMENTO","TOTAL",null,"TIPO DE EDUCACIÓN"]
[null,null,"Total","EDUCACIÓN COMÚN",null,"EDUCACIÓN ESPECIAL"]
[null,null,null,"Habilitados","Autorizados"]
[]
["TOTAL DEL PAÍS",{"$f":"+C10+F10","v":423},{"$f":"+D10+E10","v":352},{"$f":"SUM(D11:D12)","v":334},{"$f":"SUM(E11:E12)","v":18},{"$f":"SUM(F11:F12)","v":71}]
["MONTEVIDEO",{"$f":"+C11+F11","v":211},{"$f":"+D11+E11","v":172},162,10,39]
["RESTO DEL PAÍS",212,180,{"$f":"SUM(D13:D30)","v":172},{"$f":"SUM(E13:E30)","v":8},{"$f":"SUM(F13:F30)","v":32}]
["Artigas",4,2,2,0,2]
["Canelones",69,63,59,4,6]
["Cerro Largo",6,6,6,0,0]
["Colonia",11,9,9,0,2]
["Durazno",5,5,5,0,0]
["Flores",3,3,3,0,0]
["Florida",5,4,4,0,1]
["Lavalleja",7,7,7,0,0]
["Maldonado",30,27,27,0,3]
["Paysandú",15,10,9,1,5]
["Río Negro",8,7,5,2,1]
["Rivera",9,7,7,0,2]
["Rocha",6,4,4,0,2]
["Salto",11,7,7,0,4]
["San José",7,7,6,1,0]
["Soriano",8,4,4,0,4]
["Tacuarembó",7,7,7,0,0]
["Treinta y Tres",1,1,1,0,0]
["Fuente: Procesamiento propio en base a datos proporcionados por el D.E.E. — C.E.I.P."]

{"sheet":"II-2.2.1","index":20,"n_rows":31,"n_cols":10,"rows_kept":31,"cut":false,"hidden":false,"merged":[[6,7,7,7],[6,8,6,9],[30,0,30,9],[0,7,1,9],[3,0,3,9],[4,0,7,0],[4,1,7,1],[4,2,4,9],[5,2,6,3],[5,4,5,6],[5,7,5,9],[6,4,7,4],[6,5,6,6]]}
["CONSEJO DE EDUCACIÓN PRIMARIA",null,null,null,null,null,null,"ALUMNOS MATRICULADOS"]
[]
["Cuadro Nº II-2.2.1"]
["ALUMNOS MATRICULADOS EN EDUCACIÓN PRIMARIA COMÚN POR FORMA DE ADMINISTRACIÓN Y SEXO SEGÚN DEPARTAMENTO. AÑO 2016"]
["DEPARTAMENTO","TOTAL","FORMA DE ADMINISTRACIÓN"]
[null,null,"TOTAL",null,"PÚBLICA",null,null,"PRIVADA"]
[null,null,null,null,"TOTAL","SEXO",null,"TOTAL","SEXO"]
[null,null,"M","F",null,"M","F",null,"M","F"]
["TOTAL",{"$f":"E9+H9","v":299765},{"$f":"+F9+I9","v":154158},{"$f":"+G9+J9","v":145607},{"$f":"+F9+G9","v":246239},{"$f":"SUM(F10:F11)","v":127012},{"$f":"SUM(G10:G11)","v":119227},{"$f":"+I9+J9","v":53525.999999999985},{"$f":"SUM(I10:I11)","v":27145.999999999989},{"$f":"SUM(J10:J11)","v":26379.999999999993}]
["MONTEVIDEO",{"$f":"E10+H10","v":108999.99999999997},{"$f":"+F10+I10","v":56224.999999999985},52774.999999999993,{"$f":"+F10+G10","v":76445},39695,36750,{"$f":"+I10+J10","v":32554.999999999978},16529.999999999989,16024.999999999991]
["RESTO DEL PAÍS",190765,97933,92832,{"$f":"SUM(E12:E29)","v":169794},{"$f":"SUM(F12:F29)","v":87317},{"$f":"SUM(G12:G29)","v":82477},{"$f":"+I11+J11","v":20971},{"$f":"SUM(I12:I29)","v":10616},{"$f":"SUM(J12:J29)","v":10355}]
["Artigas",7545,3952,3593,{"$f":"+F12+G12","v":7358},3843,3515,{"$f":"+I12+J12","v":187},109,78]
["Canelones",49601,25532,24069,{"$f":"+F13+G13","v":41897},21605,20292,7703.9999999999982,3926.9999999999991,3776.9999999999995]
["Cerro Largo",8456,4289,4167,7830,3988,3842,626,301,325]
["Colonia",11022,5625,5397,10243,5232,5011,779,393,386]
["Durazno",5457,2757,2700,4803,2438,2365,654,319,335]
["Flores",2178,1064,1114,1915,940,975,263,124,139]
["Florida",5864,3011,2853,5591,2871,2720,273,140,133]
["Lavalleja",4892,2475,2417,4274,2168,2106,618,307,310.99999999999994]
["Maldonado",16557,8411,8146,12631,6407,6224,3926.0000000000005,2004.0000000000002,1922.0000000000002]
["Paysandú",11580,5936,5644,10403,5347,5056,1177,589,588.00000000000011]
["Río Negro",5818,2972,2846,5275,2690,2585,543,282,261]
["Rivera",10712,5549,5163,10125,5255,4870,587,294,293]
["Rocha",6615,3389,3226,6278,3218,3060,337,171,166]
["Salto",13436,6931,6505,12229,6329,5900,1207,602,605]
["San José",10191,5228,4963,9453,4876,4577,738,352,386]
["Soriano",8004,4158,3846,7550,3913,3637,454,245,209]
["Tacuarembó",8577,4413,4164,7852,4049,3803,725,364,361]
["Treinta y Tres",4260,2241,2019,4087,2148,1939,173,93,80]
["Fuente: Procesamiento propio en base a datos proporcionados por el DEE — CEIP."]
["Nota: Pública no incluye JICI."]

{"sheet":"II-2.2.2","index":21,"n_rows":32,"n_cols":12,"rows_kept":32,"cut":false,"hidden":false,"merged":[[9,141,9,142],[9,143,9,144],[9,145,9,146],[9,147,9,148],[32,0,32,9],[9,139,9,140],[34,0,34,9],[7,10,7,11],[8,4,9,4],[8,5,8,6],[8,8,8,9],[8,10,8,11],[0,7,1,9],[4,0,4,11],[5,0,9,0],[5,1,9,1],[5,2,8,3],[5,4,5,11],[6,4,7,6],[6,7,6,11],[7,7,9,7],[7,8,7,9]]}
["CONSEJO DE EDUCACIÓN PRIMARIA",null,null,null,null,null,null,"ALUMNOS MATRICULADOS"]
[]
["Cuadro Nº II-2.2.2"]
[]
["ALUMNOS MATRICULADOS EN EDUCACIÓN PRIMARIA PÚBLICA POR TIPO DE EDUCACIÓN Y SEXO SEGÚN DEPARTAMENTO. AÑO 2016."]
["DEPARTAMENTO","TOTAL","TOTAL SEXO",null,"TIPO DE EDUCACIÓN "]
[null,null,null,null,"COMÚN ",null,null,"ESPECIAL "]
[null,null,null,null,null,null,null,"Total","ESCUELAS\nESPECIALES",null,"CLASES ESPECIALES EN ESCUELAS COMUNES"]
[null,null,null,null,"Total","SEXO",null,null,"SEXO",null,"SEXO"]
[null,null,"M","F",null,"M","F",null,"M","F","M","F"]
["TOTAL",{"$f":"+C11+D11","v":252676},{"$f":"+F11+I11+K11","v":130972},{"$f":"+G11+J11+L11","v":121704},{"$f":"+F11+G11","v":246239},{"$f":"SUM(F12:F13)","v":127012},{"$f":"SUM(G12:G13)","v":119227},{"$f":"+I11+J11+K11+L11","v":6437},{"$f":"SUM(I12:I13)","v":3866},{"$f":"SUM(J12:J13)","v":2416},{"$f":"SUM(K12:K13)","v":94},{"$f":"SUM(L12:L13)","v":61}]
["MONTEVIDEO",{"$f":"+C12+D12","v":79038},{"$f":"+F12+I12+K12","v":41273},37765,{"$f":"+F12+G12","v":76445},39695,36750,{"$f":"+I12+J12+K12+L12","v":2593},1578,1015,0,0]
["RESTO DEL PAÍS",173638,89699,83939,{"$f":"+F13+G13","v":169794},{"$f":"SUM(F14:F31)","v":87317},82477,3844,2288,1401,94,61]
["Artigas",7539,3955,3584,{"$f":"+F14+G14","v":7358},3843,3515,181,106,64,6,5]
["Canelones",42609,22042,20567,41897,21605,20292,712,407,259,30,16]
["Cerro Largo",8063,4132,3931,7830,3988,3842,233,136,86,8,3]
["Colonia",10446,5356,5090,10243,5232,5011,203,120,76,4,3]
["Durazno",4942,2529,2413,4803,2438,2365,139,89,44,2,4]
["Flores",1948,962,986,1915,940,975,33,22,10,0,1]
["Florida",5739,2965,2774,5591,2871,2720,148,91,52,3,2]
["Lavalleja",4433,2268,2165,4274,2168,2106,159,99,57,1,2]
["Maldonado",12934,6582,6352,12631,6407,6224,303,175,128,null,0]
["Paysandú",10613,5489,5124,10403,5347,5056,210,129,59,13,9]
["Río Negro",5436,2790,2646,5275,2690,2585,161,96,58,4,3]
["Rivera",10282,5349,4933,10125,5255,4870,157,94,63,0,0]
["Rocha",6517,3370,3147,6278,3218,3060,239,141,80,11,7]
["Salto",12534,6517,6017,12229,6329,5900,305,187,116,1,1]
["San José",9657,5006,4651,9453,4876,4577,204,125,74,5,0]
["Soriano",7736,4031,3705,7550,3913,3637,186,116,68,2,0]
["Tacuarembó",8042,4167,3875,7852,4049,3803,190,115,69,3,3]
["Treinta y Tres",4168,2189,1979,4087,2148,1939,81,40,38,1,2]
["Fuente: Procesamiento propio en base a datos proporcionados por el D.E.E. — C.E.I.P."]

{"sheet":"II-2.2.3","index":22,"n_rows":32,"n_cols":20,"rows_kept":32,"cut":false,"hidden":false,"merged":[[8,17,9,17],[0,13,1,17],[4,0,4,17],[5,0,9,0],[5,1,9,1],[5,2,5,17],[6,2,6,12],[6,14,6,17],[7,2,9,2],[7,3,7,12],[7,13,9,13],[7,14,7,17],[8,3,9,3],[8,5,9,5],[8,8,9,8],[8,10,9,10],[8,15,9,15],[8,4,9,4],[8,6,9,6],[8,16,9,16],[8,14,9,14],[8,12,9,12],[8,11,9,11],[8,7,9,7],[8,9,9,9]]}
["CONSEJO DE EDUCACIÓN PRIMARIA",null,null,null,null,null,null,null,null,null,null,null,null,"ALUMNOS MATRICULADOS"]
[]
["Cuadro Nº II-2.2.3"]
[]
["ALUMNOS MATRICULADOS EN EDUCACIÓN PRIMARIA PÚBLICA COMÚN POR ÁREA DEMOGRÁFICA Y CATEGORÍA SEGÚN DEPARTAMENTO. AÑO 2016.",null,null,null,null,null,null,null,null,null,null,null,null,null,null,null,null,null,null,"VOLVER"]
["DEPARTAMENTO","TOTAL","ÁREA DEMOGRÁFICA"]
[null,null,"URBANA",null,null,null,null,null,null,null,null,null,null,null,"RURAL"]
[null,null,"Total Urbana","CATEGORÍA",null,null,null,null,null,null,null,null,null,"Total Rural","CATEGORÍA"]
[null,null,null,"Común","De Práctica","Habilitada de Práctica","Tiempo Completo","Aprender","Aprender Habilitada de Práctica","Tiempo Extendido","Tiempo Extendido de Práctica","Unidocente","JICI",null,"con Maestro a cargo","Internado Rural","Tiempo Extendido","Unidocente"]
[]
["TOTAL",{"$f":"+C11+N11","v":246382},{"$f":"SUM(D11:M11)","v":232388},{"$f":"SUM(D12:D13)","v":77666},19198,25578,36725,66798,488,5481,291,20,143,{"$f":"SUM(O11:R11)","v":13994},{"$f":"SUM(O12:O13)","v":9334},{"$f":"SUM(P12:P13)","v":114},{"$f":"SUM(Q12:Q13)","v":68},{"$f":"SUM(R12:R13)","v":4478}]
["MONTEVIDEO",{"$f":"+C12+N12","v":76563},{"$f":"SUM(D12:M12)","v":76563},27383,4898,2026,11218,28941,0,1688,291,0,118,0,0,0,0,0]
["RESTO DEL PAÍS",{"$f":"+C13+N13","v":169819},{"$f":"SUM(D13:M13)","v":155825},{"$f":"SUM(D14:D31)","v":50283},14300,23552,25507,37857,488,3793,0,20,25,{"$f":"SUM(O13:R13)","v":13994},{"$f":"SUM(O14:O31)","v":9334},{"$f":"SUM(P14:P31)","v":114},{"$f":"SUM(Q14:Q31)","v":68},{"$f":"SUM(R14:R31)","v":4478}]
["Artigas",{"$f":"C14+N14","v":7358},{"$f":"SUM(D14:M14)","v":6788},1396,607,1157,1502,2031,0,95,0,0,0,{"$f":"SUM(O14:R14)","v":570},424,34,0,112]
["Canelones",{"$f":"C15+N15","v":41897},{"$f":"SUM(D15:M15)","v":39414},12941,1876,5447,5437,13194,0,519,0,0,0,2483,2061,0,68,354]
["Cerro Largo",7855,7056,954,687,1548,1485,1783,0,574,0,0,25,799,457,0,0,342]
["Colonia",10243,9281,4635,1185,1431,1195,343,0,492,0,0,0,962,576,0,0,386]
["Durazno",4803,4392,629,769,1010,909,1075,0,0,0,0,0,411,135,0,0,276]
["Flores",1915,1721,659,255,262,450,0,0,95,0,0,0,194,69,21,0,104]
["Florida",5591,4792,1774,609,822,894,329,0,364,0,0,0,799,504,0,0,295]
["Lavalleja",4274,3863,1339,518,573,838,216,239,120,0,20,0,411,204,0,0,207]
["Maldonado",12631,12134,4985,888,2652,1583,1768,0,258,null,0,0,497,332,12,0,153]
["Paysandú",10403,9517,2969,1146,1323,1498,2332,249,0,0,0,0,886,610,12,0,264]
["Río Negro",5275,4806,2451,681,748,715,211,0,0,0,0,0,469,282,29,0,158]
["Rivera",10125,9248,1856,777,1386,1653,3417,0,159,0,0,0,877,588,0,0,289]
["Rocha",6278,5971,2805,654,166,1185,1161,0,0,0,0,0,307,93,0,0,214]
["Salto",12229,11042,1462,1328,1730,2439,3879,0,204,0,0,0,1187,995,6,0,186]
["San José",9453,8275,4244,307,652,1249,1554,0,269,0,0,0,1178,865,0,0,313]
["Soriano",7550,6957,2291,809,1044,955,1858,0,0,0,0,0,593,282,0,0,311]
["Tacuarembó",7852,6799,1655,535,756,927,2441,0,485,0,0,0,1053,713,0,0,340]
["Treinta y Tres",4087,3769,1238,669,845,593,265,0,159,0,0,0,318,144,0,0,174]
["Fuente: Procesamiento propio en base a datos proporcionados por el D.E.E .— C.E.I.P."]

{"sheet":"II-2.2.4","index":23,"n_rows":32,"n_cols":10,"rows_kept":32,"cut":false,"hidden":false,"merged":[[32,0,32,9],[0,8,1,9],[4,0,4,9],[5,0,7,1],[5,2,7,2],[5,3,5,9],[6,3,7,3],[6,8,7,8],[6,9,7,9],[6,4,7,4],[6,5,7,5],[6,6,7,6],[6,7,7,7]]}
["CONSEJO DE EDUCACIÓN PRIMARIA",null,null,null,null,null,null,null,"Alumnos matriculados"]
[]
["Cuadro Nº II-2.2.4"]
[]
["ALUMNOS MATRICULADOS EN EDUCACIÓN PRIMARIA PÚBLICA ESPECIAL POR TIPO DE DISCAPACIDAD SEGÚN DEPARTAMENTO. AÑO 2016."]
["DEPARTAMENTO",null,"TOTAL","DISCAPACIDAD"]
[null,null,null,"Auditiva","Intelectual","Motriz","Visual","Problemas de conducta","Problemas de personalidad","Trastornos generalizados del desarrollo"]
[]
["TOTAL",null,{"$f":"SUM(D9:J9)","v":6282},{"$f":"SUM(D11:D12)","v":202},{"$f":"SUM(E11:E12)","v":5728},103,83,40,76,50]
[]
["MONTEVIDEO",null,{"$f":"SUM(D11:J11)","v":2593},107,2184,103,83,40,76,0]
["RESTO DEL PAÍS",null,{"$f":"SUM(D12:J12)","v":3689},{"$f":"SUM(D13:D30)","v":95},{"$f":"SUM(E13:E30)","v":3544},0,0,0,0,50]
["Artigas",null,{"$f":"SUM(D13:J13)","v":170},0,170,0,0,0,0,0]
["Canelones",null,666,0,666,0,0,0,0,0]
["Cerro Largo",null,222,0,222,0,0,0,0,0]
["Colonia",null,196,0,196,0,0,0,0,0]
["Durazno",null,133,0,133,0,0,0,0,0]
["Flores",null,32,0,32,0,0,0,0,0]
["Florida",null,143,0,143,0,0,0,0,0]
["Lavalleja",null,156,0,156,0,0,0,0,0]
["Maldonado",null,303,25,278,0,0,0,0,0]
["Paysandú",null,188,0,188,0,0,0,0,0]
["Río Negro",null,154,0,154,0,0,0,0,0]
["Rivera",null,157,16,141,0,0,0,0,0]
["Rocha",null,221,0,221,0,0,0,0,0]
["Salto",null,303,54,199,0,0,0,0,50]
["San José",null,199,0,199,0,0,0,0,0]
["Soriano",null,184,0,184,0,0,0,0,0]
["Tacuarembó",null,184,0,184,0,0,0,0,0]
["Treinta y Tres",null,78,0,78,0,0,0,0,0]
["Fuente: D.E.E. — C.E.P."]
["Nota: No incluye Clases Especiales en Escuelas Comunes"]

{"sheet":"II-2.2.5","index":24,"n_rows":32,"n_cols":46,"rows_kept":32,"cut":false,"hidden":false,"merged":[[8,44,9,44],[8,45,9,45],[5,4,5,45],[6,44,6,45],[7,4,7,45],[8,40,9,40],[8,41,9,41],[8,42,9,42],[8,43,9,43],[8,34,9,34],[8,35,9,35],[8,36,9,36],[8,37,9,37],[8,38,9,38],[8,39,9,39],[8,20,9,20],[8,7,9,7],[8,8,9,8],[8,33,9,33],[8,22,9,22],[8,23,9,23],[8,24,9,24],[8,25,9,25],[8,26,9,26],[8,27,9,27],[8,28,9,28],[8,29,9,29],[8,30,9,30],[8,31,9,31],[8,32,9,32],[6,18,6,19],[6,20,6,21],[8,9,9,9],[6,34,6,35],[6,36,6,37],[8,21,9,21],[8,10,9,10],[8,11,9,11],[8,12,9,12],[8,13,9,13],[8,14,9,14],[8,15,9,15],[8,16,9,16],[8,17,9,17],[8,18,9,18],[8,19,9,19],[0,13,1,17],[4,0,4,15],[5,0,9,0],[5,1,9,1],[5,2,9,2],[5,3,9,3],[6,4,6,5],[6,6,6,7],[6,8,6,9],[6,10,6,11],[6,12,6,13],[6,14,6,15],[6,16,6,17],[8,4,9,4],[8,5,9,5],[8,6,9,6],[6,42,6,43],[6,22,6,23],[6,24,6,25],[6,26,6,27],[6,28,6,29],[6,30,6,31],[6,32,6,33],[6,38,6,39],[6,40,6,41]]}
["CONSEJO DE EDUCACIÓN PRIMARIA",null,null,null,null,null,null,null,null,null,null,null,null,"ALUMNOS MATRICULADOS"]
[]
["Cuadro Nº II-2.2.5"]
[]
["ALUMNOS MATRICULADOS EN EDUCACIÓN ESPECIAL PÚBLICA POR EDADES SIMPLES Y SEXO SEGÚN DEPARTAMENTO. AÑO 2016."]
["DEPARTAMENTO","TOTAL GENERAL","TOTAL FEMENINO","TOTAL MASCULINO","EDAD"]
[null,null,null,null,"Menos de 3 años",null,"3 años",null,"4 años",null,"5 años",null,"6 años",null,"7 años",null,"8 años",null,"9 años",null,"10 años",null,"11 años",null,"12 años",null,"13 años",null,"14 años",null,"15 años",null,"16 años",null,"17 años",null,"18 años",null,"19 años",null,"20 años",null,"21 años",null,"Más de 21 años"]
[null,null,null,null,"SEXO"]
[null,null,null,null,"F","M","F","M","F","M","F","M","F","M","F","M","F","M","F","M","F","M","F","M","F","M","F","M","F","M","F","M","F","M","F","M","F","M","F","M","F","M","F","M","F","M"]
[]
["TOTAL",{"$f":"C11+D11","v":6436},{"$f":"E11+G11+I11+K11+M11+O11+Q11+S11+U11+W11+Y11+AA11+AC11+AE11+AG11+AI11+AK11+AM11+AO11+AQ11+AS11","v":2476},{"$f":"F11+H11+J11+L11+N11+P11+R11+T11+V11+X11+Z11+AB11+AD11+AF11+AH11+AJ11+AL11+AN11+AP11+AR11+AT11","v":3960},{"$f":"SUM(E12:E13)","v":5},3,8,8,17,30,23,57,82,139,136,218,{"$f":"SUM(Q12:Q13)","v":181},307,228,381,239,394,272,476,288,436,293,475,254,385,179,267,116,165,76,107,30,51,23,20,9,16,2,10,15,15]
["MONTEVIDEO",{"$f":"C12+D12","v":2593},1015,1578,2,1,6,3,10,15,10,22,35,42,56,78,61,105,100,150,87,145,103,194,118,161,125,191,91,160,74,101,52,82,39,57,17,31,16,14,7,14,0,6,6,6]
["RESTO DEL PAÍS",3843,1461,2382,{"$f":"SUM(E14:E31)","v":3},2,2,5,7,15,13,35,47,97,80,140,120,202,128,231,152,249,169,282,170,275,168,284,163,225,105,166,64,83,37,50,13,20,7,6,2,2,2,4,9,9]
["Artigas",{"$f":"C14+D14","v":181},{"$f":"E14+G14+I14+K14+M14+O14+Q14+S14+U14+W14+Y14+AA14+AC14+AE14+AG14+AI14+AK14+AM14+AO14+AQ14+AS14","v":69},{"$f":"F14+H14+J14+L14+N14+P14+R14+T14+V14+X14+Z14+AB14+AD14+AF14+AH14+AJ14+AL14+AN14+AP14+AR14+AT14","v":112},0,0,0,0,0,0,1,1,1,5,3,6,7,6,1,13,7,7,12,18,7,13,3,15,15,8,6,14,5,2,1,3,0,1,0,0,0,0,0,0,0,0]
["Canelones",712,{"$f":"E15+G15+I15+K15+M15+O15+Q15+S15+U15+W15+Y15+AA15+AC15+AE15+AG15+AI15+AK15+AM15+AO15+AQ15+AS15","v":275},{"$f":"F15+H15+J15+L15+N15+P15+R15+T15+V15+X15+Z15+AB15+AD15+AF15+AH15+AJ15+AL15+AN15+AP15+AR15+AT15","v":437},0,0,0,0,0,2,5,11,13,11,17,31,29,40,25,44,27,47,39,64,35,57,37,45,21,36,11,26,9,7,5,7,1,5,0,0,0,1,0,1,1,2]
["Cerro Largo",233,89,144,0,0,0,0,0,0,0,1,2,6,6,7,5,13,10,8,7,15,7,20,9,16,9,22,15,12,7,8,3,3,4,7,2,0,1,1,1,1,0,0,1,4]
["Colonia",203,79,124,0,0,1,0,2,1,1,2,2,4,10,4,7,8,8,5,5,16,8,9,6,16,11,14,6,16,4,14,1,10,4,4,2,1,1,0,0,0,0,0,0,0]
["Durazno",139,48,91,0,0,0,0,0,0,0,0,2,5,1,2,3,12,3,6,5,4,3,10,4,9,9,9,3,14,8,8,1,2,0,4,2,4,0,0,0,0,2,2,2,0]
["Flores",33,11,22,0,0,0,0,0,0,0,0,0,2,0,1,0,2,2,1,2,4,2,1,1,2,0,1,1,1,0,3,3,1,0,1,0,1,0,1,0,0,0,0,0,0]
["Florida",148,54,94,0,0,0,0,0,1,0,1,0,4,1,8,5,8,2,7,6,4,11,14,7,16,8,10,7,13,2,5,1,2,2,0,1,0,0,1,0,0,0,0,1,0]
["Lavalleja",159,59,100,1,0,0,1,0,0,0,1,3,9,3,3,1,4,1,10,9,7,4,11,8,4,7,11,5,11,8,9,3,12,4,6,1,1,1,0,0,0,0,0,0,0]
["Maldonado",302,127,175,0,1,0,3,1,5,null,6,5,6,7,12,9,14,11,17,18,23,20,18,16,17,12,21,9,13,9,6,6,6,1,3,1,3,1,1,0,0,0,0,1,0]
["Paysandú",210,68,142,0,0,0,0,0,3,1,1,3,4,4,13,6,12,11,20,7,21,5,14,9,13,8,17,3,9,2,5,6,8,1,1,0,0,0,0,0,0,0,0,2,1]
["Río Negro",161,61,100,0,0,0,0,1,1,1,1,1,4,6,8,7,11,3,17,6,12,3,15,9,6,8,8,7,9,4,4,4,4,1,0,0,0,0,0,0,0,0,0,0,0]
["Rivera",157,63,94,0,0,0,0,0,0,1,0,0,1,2,4,5,7,9,5,8,12,8,10,8,18,7,16,10,9,2,9,2,0,1,3,0,0,0,0,0,0,0,0,0,0]
["Rocha",239,87,152,0,1,0,0,1,0,0,2,2,12,6,13,10,18,10,18,11,16,12,19,16,17,3,16,5,5,5,6,2,2,1,2,0,1,2,1,1,0,0,1,0,2]
["Salto",305,117,188,1,0,1,1,2,0,1,4,6,8,6,6,12,19,10,22,8,18,8,17,8,19,15,23,14,23,14,20,9,6,1,1,1,1,0,0,0,0,0,0,0,0]
["San José",204,74,130,0,0,0,0,0,0,0,1,3,4,1,3,3,6,6,9,11,16,8,16,7,18,9,22,17,21,7,9,2,4,0,0,0,1,0,0,0,0,0,0,0,0]
["Soriano",186,68,118,0,0,0,0,0,2,2,2,2,5,2,8,3,8,5,13,4,13,5,13,12,15,12,16,8,9,7,9,4,2,0,1,0,1,1,1,0,0,0,0,1,0]
["Tacuarembó",190,72,118,1,0,0,0,0,0,0,1,0,6,4,9,4,11,7,12,10,11,5,10,6,13,10,14,13,8,6,8,0,10,4,5,2,0,0,0,0,0,0,0,0,0]
["Treinta y Tres",81,40,41,0,0,0,0,0,0,0,0,2,1,1,2,4,3,4,4,1,3,9,3,2,6,0,4,4,8,3,3,3,2,7,2,0,0,0,0,0,0,0,0,0,0]
["Fuente: Procesamiento propio en base a datos proporcionados por el DEE — CEIP"]

{"sheet":"II-2.2.6","index":25,"n_rows":126,"n_cols":46,"rows_kept":126,"cut":false,"hidden":false,"merged":[[0,4,1,5],[4,0,4,5],[5,0,8,0],[5,1,5,5],[6,1,8,1],[6,2,6,4],[6,5,8,5],[7,2,8,2],[7,3,8,3],[7,4,8,4]]}
["CONSEJO DE EDUCACIÓN PRIMARIA",null,null,null,"ALUMNOS MATRICULADOS"]
[]
["Cuadro Nº II-2.2.6"]
[]
["ALUMNOS MATRICULADOS EN EDUCACIÓN PRIMARIA PRIVADA POR TIPO DE EDUCACIÓN SEGÚN DEPARTAMENTO. AÑO 2016."]
["DEPARTAMENTO","TIPO DE EDUCACIÓN"]
[null,"TOTAL","EDUCACIÓN COMÚN",null,null,"EDUCACIÓN ESPECIAL"]
[null,null,"Total","Habilitados","Autorizados"]
[]
["TOTAL DEL PAÍS",{"$f":"SUM(B11:B12)","v":57130},{"$f":"+D10+E10","v":53526},{"$f":"D11+D12","v":50862},{"$f":"E11+E12","v":2664},{"$f":"F11+F12","v":3604}]
["MONTEVIDEO",{"$f":"+C11+F11","v":34583},{"$f":"+D11+E11","v":32555},30350,2205,2028,null,null,null,null,null,null,null,null,null,null,null,null,null,null,null,null,null,null,null,null,null,null,null,null,null,null,null,null,null,null,null,null,null,null,null,null,null,null,null,"MONTEVIDEO"]
["RESTO DEL PAÍS",{"$f":"+C12+F12","v":22547},{"$f":"+D12+E12","v":20971},{"$f":"SUM(D13:D30)","v":20512},{"$f":"SUM(E13:E30)","v":459},{"$f":"SUM(F13:F30)","v":1576},null,null,null,null,null,null,null,null,null,null,null,null,null,null,null,null,null,null,null,null,null,null,null,null,null,null,null,null,null,null,null,null,null,null,null,null,null,null,null,"RESTO DEL PAÍS"]
["Artigas",{"$f":"+C13+F13","v":331},{"$f":"+D13+E13","v":187},187,0,144,null,null,null,null,null,null,null,null,null,null,null,null,null,null,null,null,null,null,null,null,null,null,null,null,null,null,null,null,null,null,null,null,null,null,null,null,null,null,null,"Artigas"]
["Canelones",7789.9999999999982,{"$f":"+D14+E14","v":7703.9999999999982},7269.9999999999982,434,86,null,null,null,null,null,null,null,null,null,null,null,null,null,null,null,null,null,null,null,null,null,null,null,null,null,null,null,null,null,null,null,null,null,null,null,null,null,null,null,"Canelones"]
["Cerro Largo",626,626,626,0,0,null,null,null,null,null,null,null,null,null,null,null,null,null,null,null,null,null,null,null,null,null,null,null,null,null,null,null,null,null,null,null,null,null,null,null,null,null,null,null,"Cerro Largo"]
["Colonia",828,779,779,0,49,null,null,null,null,null,null,null,null,null,null,null,null,null,null,null,null,null,null,null,null,null,null,null,null,null,null,null,null,null,null,null,null,null,null,null,null,null,null,null,"Colonia"]
["Durazno",654,654,654,0,0,null,null,null,null,null,null,null,null,null,null,null,null,null,null,null,null,null,null,null,null,null,null,null,null,null,null,null,null,null,null,null,null,null,null,null,null,null,null,null,"Durazno"]
["Flores",263,263,263,0,0,null,null,null,null,null,null,null,null,null,null,null,null,null,null,null,null,null,null,null,null,null,null,null,null,null,null,null,null,null,null,null,null,null,null,null,null,null,null,null,"Flores"]
["Florida",347,273,273,0,74,null,null,null,null,null,null,null,null,null,null,null,null,null,null,null,null,null,null,null,null,null,null,null,null,null,null,null,null,null,null,null,null,null,null,null,null,null,null,null,"Florida"]
["Lavalleja",618,618,618,0,0,null,null,null,null,null,null,null,null,null,null,null,null,null,null,null,null,null,null,null,null,null,null,null,null,null,null,null,null,null,null,null,null,null,null,null,null,null,null,null,"Lavalleja"]
["Maldonado",4014.0000000000005,3926.0000000000005,3926.0000000000005,0,88,null,null,null,null,null,null,null,null,null,null,null,null,null,null,null,null,null,null,null,null,null,null,null,null,null,null,null,null,null,null,null,null,null,null,null,null,null,null,null,"Maldonado"]
["Paysandú",1319,1177,1177,0,142,null,null,null,null,null,null,null,null,null,null,null,null,null,null,null,null,null,null,null,null,null,null,null,null,null,null,null,null,null,null,null,null,null,null,null,null,null,null,null,"Paysandú"]
["Río Negro",721,543,526,17,178,null,null,null,null,null,null,null,null,null,null,null,null,null,null,null,null,null,null,null,null,null,null,null,null,null,null,null,null,null,null,null,null,null,null,null,null,null,null,null,"Río Negro"]
["Rivera",587,587,587,0,0,null,null,null,null,null,null,null,null,null,null,null,null,null,null,null,null,null,null,null,null,null,null,null,null,null,null,null,null,null,null,null,null,null,null,null,null,null,null,null,"Rivera"]
["Rocha",337,337,337,0,0,null,null,null,null,null,null,null,null,null,null,null,null,null,null,null,null,null,null,null,null,null,null,null,null,null,null,null,null,null,null,null,null,null,null,null,null,null,null,null,"Rocha"]
["Salto",1796,1207,1207,0,589,null,null,null,null,null,null,null,null,null,null,null,null,null,null,null,null,null,null,null,null,null,null,null,null,null,null,null,null,null,null,null,null,null,null,null,null,null,null,null,"Salto"]
["San José",738,738,730,8,0,null,null,null,null,null,null,null,null,null,null,null,null,null,null,null,null,null,null,null,null,null,null,null,null,null,null,null,null,null,null,null,null,null,null,null,null,null,null,null,"San José"]
["Soriano",680,454,454,0,226,null,null,null,null,null,null,null,null,null,null,null,null,null,null,null,null,null,null,null,null,null,null,null,null,null,null,null,null,null,null,null,null,null,null,null,null,null,null,null,"Soriano"]
["Tacuarembó",725,725,725,0,0,null,null,null,null,null,null,null,null,null,null,null,null,null,null,null,null,null,null,null,null,null,null,null,null,null,null,null,null,null,null,null,null,null,null,null,null,null,null,null,"Tacuarembó"]
["Treinta y Tres",173,173,173,0,0,null,null,null,null,null,null,null,null,null,null,null,null,null,null,null,null,null,null,null,null,null,null,null,null,null,null,null,null,null,null,null,null,null,null,null,null,null,null,null,"Treinta y Tres"]
["Fuente: Procesamiento propio en base a datos proporcionados por el D.E.E. — C.E.I.P."]
["Nota: Especial incluye la matrícula de clases especiales en escuelas comunes, "]
["      Instrucción Temprana, Educación Inicial, Preparatorio y Talleres"]
[]
[]
[]
[]
[]
[]
[]
[]
[]
[]
[]
[]
[]
[]
[]
[]
[]
[]
[]
[]
[]
[]
[]
[]
[]
[]
[]
[]
[]
[]
[]
[]
[]
[]
[]
[]
[]
[]
[]
[]
[]
[]
[]
[]
[]
[]
[]
[]
[]
[]
[]
[]
[]
[]
[]
[]
[]
[]
[]
[]
[]
[]
[]
[]
[]
[]
[]
[]
[]
[]
[]
[]
[]
["30025 "," 2163",2209]
[19484,397,1758]
[92,0,162]
[6669,344,0]
[615,0,0]
[724,0,0]
[634,0,0]
[361,0,7]
[296,0,62]
[615,0,0]
[3879,0,141]
[1175,0,276]
[428,33,149]
[673,0,7]
[413,0,87]
[1089,0,208]
[556,20,0]
[435,0,659]
[643,0,0]
[187,0,0]

{"sheet":"II-2.2.7","index":26,"n_rows":32,"n_cols":44,"rows_kept":32,"cut":false,"hidden":false,"merged":[[8,40,9,40],[8,41,9,41],[8,42,9,42],[8,43,9,43],[8,34,9,34],[8,35,9,35],[8,36,9,36],[8,37,9,37],[8,38,9,38],[8,39,9,39],[8,20,9,20],[8,33,9,33],[8,22,9,22],[8,23,9,23],[8,24,9,24],[8,25,9,25],[8,26,9,26],[8,27,9,27],[8,28,9,28],[8,29,9,29],[8,30,9,30],[8,31,9,31],[8,32,9,32],[8,4,9,4],[8,5,9,5],[8,6,9,6],[8,7,9,7],[8,8,9,8],[8,9,9,9],[6,34,6,35],[6,36,6,37],[6,38,6,39],[6,40,6,41],[8,21,9,21],[8,10,9,10],[8,11,9,11],[8,12,9,12],[8,13,9,13],[8,14,9,14],[8,15,9,15],[8,16,9,16],[8,17,9,17],[8,18,9,18],[8,19,9,19],[6,30,6,31],[6,32,6,33],[6,10,6,11],[6,12,6,13],[6,14,6,15],[6,16,6,17],[6,18,6,19],[6,20,6,21],[4,0,4,17],[0,13,1,20],[5,0,9,0],[5,1,9,1],[5,2,9,2],[5,3,9,3],[5,4,5,43],[6,4,6,5],[6,6,6,7],[6,8,6,9],[6,42,6,43],[7,4,7,43],[6,22,6,23],[6,24,6,25],[6,26,6,27],[6,28,6,29]]}
["CONSEJO DE EDUCACIÓN PRIMARIA",null,null,null,null,null,null,null,null,null,null,null,null,"ALUMNOS MATRICULADOS"]
[]
["Cuadro Nº II-2.2.7"]
[]
["ALUMNOS MATRICULADOS EN EDUCACIÓN ESPECIAL PRIVADA POR EDADES SIMPLES Y SEXO SEGÚN DEPARTAMENTO. AÑO 2016."]
["DEPARTAMENTO","TOTAL GENERAL","TOTAL MASCULINO","TOTAL FEMENINO","EDAD"]
[null,null,null,null,"Menos de 3 años",null,"3 años",null,"4 años",null,"5 años",null,"6 años",null,"7 años",null,"8 años",null,"9 años",null,"10 años",null,"11 años",null,"12 años",null,"13 años",null,"14 años",null,"15 años",null,"16 años",null,"17 años",null,"18 años",null,"19 años",null,"20 años",null,"21 años"]
[null,null,null,null,"SEXO"]
[null,null,null,null,"M","F","M","F","M","F","M","F","M","F","M","F","M","F","M","F","M","F","M","F","M","F","M","F","M","F","M","F","M","F","M","F","M","F","M","F","M","F","M","F"]
[]
["TOTAL",{"$f":"C11+D11","v":3604},{"$f":"E11+G11+I11+K11+M11+O11+Q11+S11+U11+W11+Y11+AA11+AC11+AE11+AG11+AI11+AK11+AM11+AO11+AQ11","v":1989},{"$f":"F11+H11+J11+L11+N11+P11+R11+T11+V11+X11+Z11+AB11+AD11+AF11+AH11+AJ11+AL11+AN11+AP11+AR11","v":1615},{"$f":"SUM(E12:E13)","v":13.000000000000002},7.0000000000000009,15,7.0000000000000009,38,16.999999999999996,53,33.999999999999993,132,50,127,48,141.99999999999997,77,113,82,121.00000000000001,65,117,73,123,101,76,50,98,49,93,47,77,63,60,41,70,28,31,108.99999999999999,25.999999999999996,133.00000000000006,464,534]
["MONTEVIDEO",{"$f":"C12+D12","v":2028},{"$f":"E12+G12+I12+K12+M12+O12+Q12+S12+U12+W12+Y12+AA12+AC12+AE12+AG12+AI12+AK12+AM12+AO12+AQ12","v":1065},{"$f":"F12+H12+J12+L12+N12+P12+R12+T12+V12+X12+Z12+AB12+AD12+AF12+AH12+AJ12+AL12+AN12+AP12+AR12","v":963},7.0000000000000018,5.0000000000000009,7.0000000000000009,3.0000000000000009,9.0000000000000018,12.999999999999996,20,29.999999999999993,78,18.999999999999996,79,26,84.999999999999972,40.999999999999993,69,28.999999999999996,72.000000000000014,33,75,42.999999999999993,58.000000000000007,54,41,27,35,23,38,24,31.999999999999993,24,26.000000000000004,17,28,9,11.000000000000002,87.999999999999986,10.999999999999996,115.00000000000004,284,340.00000000000006]
["RESTO DEL PAÍS",1576,924,652,{"$f":"SUM(E14:E31)","v":6},{"$f":"SUM(F14:F31)","v":2},8,4,29,4,33,{"$f":"SUM(L14:L31)","v":4},54,31,48,22,57,36,44,53,49,32,42,30,65,47,35,23,63,26,55,23,45,39,34,24,42,19,20,21,15,18,180,194]
["Artigas",144,75,69,0,0,0,0,0,0,0,0,0,0,0,0,1,0,0,0,0,0,1,0,2,3,3,4,4,0,1,2,3,4,8,0,13,4,5,1,3,2,31,49]
["Canelones",86,60,26,1,0,1,0,2,0,1,0,0,0,0,0,3,0,0,0,1,1,0,1,0,2,3,0,2,1,1,2,4,0,1,1,6,3,6,1,1,3,27,11]
["Cerro Largo",0,0,0,0,0,0,0,0,0,0,0,0,0,0,0,0,0,0,0,0,0,0,0,0,0,0,0,0,0,0,0,0,0,0,0,0,0,0,0,0,0,0,0]
["Colonia",49,27,22,0,0,0,0,1,0,1,0,0,1,3,2,3,1,1,1,0,1,0,3,2,1,2,4,1,3,2,1,6,1,1,0,1,0,1,0,0,0,2,3]
["Durazno",0,0,0,0,0,0,0,0,0,0,0,0,0,0,0,0,0,0,0,0,0,0,0,0,0,0,0,0,0,0,0,0,0,0,0,0,0,0,0,0,0,0,0]
["Flores",0,0,0,0,0,0,0,0,0,0,0,0,0,0,0,0,0,0,0,0,0,0,0,0,0,0,0,0,0,0,0,0,0,0,0,0,0,0,0,0,0,0,0]
["Florida",74,38,36,1,2,2,1,2,0,4,1,2,1,4,2,1,2,3,1,2,4,2,2,0,0,0,1,2,1,0,1,1,2,1,1,0,1,0,1,0,2,11,10]
["Lavalleja",0,0,0,0,0,0,0,0,0,0,0,0,0,0,0,0,0,0,0,0,0,0,0,0,0,0,0,0,0,0,0,0,0,0,0,0,0,0,0,0,0,0,0]
["Maldonado",88,44,44,0,0,1,0,0,0,null,1,0,0,0,1,1,2,0,2,1,2,0,1,1,1,2,2,5,3,6,2,2,3,2,1,2,3,4,6,0,3,17,11]
["Paysandú",142,83,59,0,0,0,0,2,0,3,1,0,0,1,1,2,0,1,1,1,2,1,0,2,0,7,0,7,1,5,1,6,4,6,6,3,2,0,3,0,3,36,34]
["Río Negro",178,110,68,1,0,0,2,9,1,14,0,4,2,15,4,10,11,9,23,15,5,14,6,14,14,3,0,2,0,0,0,0,0,0,0,0,0,0,0,0,0,0,0]
["Rivera",0,0,0,0,0,0,0,0,0,0,0,0,0,0,0,0,0,0,0,0,0,0,0,0,0,0,0,0,0,0,0,0,0,0,0,0,0,0,0,0,0,0,0]
["Rocha",0,0,0,0,0,0,0,0,0,0,0,0,0,0,0,0,0,0,0,0,0,0,0,0,0,0,0,0,0,0,0,0,0,0,0,0,0,0,0,0,0,0,0]
["Salto",589,373,216,3,0,4,1,13,3,9,0,42,27,21,12,34,17,26,21,26,17,23,16,41,25,13,11,34,14,38,8,17,22,9,11,9,1,2,5,3,2,6,3]
["San José",0,0,0,0,0,0,0,0,0,0,0,0,0,0,0,0,0,0,0,0,0,0,0,0,0,0,0,0,0,0,0,0,0,0,0,0,0,0,0,0,0,0,0]
["Soriano",226,114,112,0,0,0,0,0,0,1,1,6,0,4,0,2,3,4,4,3,0,1,1,3,1,2,1,6,3,2,6,6,3,6,4,8,5,2,4,8,3,50,73]
["Tacuarembó",0,0,0,0,0,0,0,0,0,0,0,0,0,0,0,0,0,0,0,0,0,0,0,0,0,0,0,0,0,0,0,0,0,0,0,0,0,0,0,0,0,0,0]
["Treinta y Tres",0,0,0,0,0,0,0,0,0,0,0,0,0,0,0,0,0,0,0,0,0,0,0,0,0,0,0,0,0,0,0,0,0,0,0,0,0,0,0,0,0,0,0]
["Fuente: Procesamiento propio en base a datos proporcionados por el DEE — CEIP"]

{"sheet":"II-2.2.8","index":27,"n_rows":24,"n_cols":15,"rows_kept":24,"cut":false,"hidden":false,"merged":[[6,11,7,12],[6,13,7,14],[8,3,8,14],[0,12,1,14],[2,0,3,1],[4,0,4,14],[5,0,9,0],[5,3,5,14],[6,1,8,2],[6,3,7,4],[6,5,7,6],[6,7,7,8],[6,9,7,10]]}
["CONSEJO DE EDUCACIÓN PRIMARIA",null,null,null,null,null,null,null,null,null,null,null,"ALUMNOS MATRICULADOS"]
[]
["Cuadro Nº II-2.2.8"]
[]
["ALUMNOS MATRICULADOS EN EDUCACIÓN PRIMARIA COMÚN POR GRADO Y FORMA DE ADMINISTRACIÓN SEGÚN EDAD. AÑO 2016."]
["EDAD",null,null,"GRADO"]
[null,"TOTAL",null,"Primero",null,"Segundo",null,"Tercero",null,"Cuarto",null,"Quinto",null,"Sexto"]
[]
[null,null,null,"FORMA DE ADMINISTRACIÓN"]
[null,"Pública","Privada","Pública","Privada","Pública","Privada","Pública","Privada","Pública","Privada","Pública","Privada","Pública","Privada"]
["TOTAL",{"$f":"SUM(B13:B22)","v":246239},{"$f":"SUM(C13:C22)","v":53526},{"$f":"SUM(D13:D22)","v":42977},{"$f":"SUM(E13:E22)","v":9334},{"$f":"SUM(F13:F22)","v":40569},9106.9999999999982,{"$f":"SUM(H13:H22)","v":40196},8707,{"$f":"SUM(J13:J22)","v":40382},8961,{"$f":"SUM(L13:L22)","v":39949},8631,{"$f":"SUM(N13:N22)","v":42166},8786]
[]
["5  años",{"$f":"+D13+F13+H13+J13+L13+N13","v":3023},{"$f":"+E13+G13+I13+K13+M13+O13","v":8113},{"$f":"'II-2.2.9'!E11+'II-2.2.9'!F11","v":3010},8113,{"$f":"'II-2.2.9'!G11+'II-2.2.9'!H11","v":4},0,{"$f":"'II-2.2.9'!I11+'II-2.2.9'!J11","v":0},0,{"$f":"'II-2.2.9'!K11+'II-2.2.9'!L11","v":2},0,{"$f":"'II-2.2.9'!M11+'II-2.2.9'!N11","v":5},0,{"$f":"'II-2.2.9'!O11+'II-2.2.9'!P11","v":2},0]
["6  años",37391,{"$f":"+E14+G14+I14+K14+M14+O14","v":8965.9999999999982},{"$f":"'II-2.2.9'!E12+'II-2.2.9'!F12","v":34918},1184,{"$f":"'II-2.2.9'!G12+'II-2.2.9'!H12","v":2468},7781.9999999999982,{"$f":"'II-2.2.9'!I12+'II-2.2.9'!J12","v":3},0,{"$f":"'II-2.2.9'!K12+'II-2.2.9'!L12","v":0},0,{"$f":"'II-2.2.9'!M12+'II-2.2.9'!N12","v":0},0,{"$f":"'II-2.2.9'!O12+'II-2.2.9'!P12","v":2},0]
["7  años",37851,8712,{"$f":"'II-2.2.9'!E13+'II-2.2.9'!F13","v":4744},35,{"$f":"'II-2.2.9'!G13+'II-2.2.9'!H13","v":30740},1271,{"$f":"'II-2.2.9'!I13+'II-2.2.9'!J13","v":2362},7406,{"$f":"'II-2.2.9'!K13+'II-2.2.9'!L13","v":3},0,{"$f":"'II-2.2.9'!M13+'II-2.2.9'!N13","v":1},0,{"$f":"'II-2.2.9'!O13+'II-2.2.9'!P13","v":1},0]
["8  años",38064,8789,{"$f":"'II-2.2.9'!E14+'II-2.2.9'!F14","v":271},2,{"$f":"'II-2.2.9'!G14+'II-2.2.9'!H14","v":6399},44.999999999999986,{"$f":"'II-2.2.9'!I14+'II-2.2.9'!J14","v":29159},1239.9999999999998,{"$f":"'II-2.2.9'!K14+'II-2.2.9'!L14","v":2232},7502,{"$f":"'II-2.2.9'!M14+'II-2.2.9'!N14","v":0},0,{"$f":"'II-2.2.9'!O14+'II-2.2.9'!P14","v":3},0]
["9  años",39201,8474,{"$f":"'II-2.2.9'!E15+'II-2.2.9'!F15","v":17},0,{"$f":"'II-2.2.9'!G15+'II-2.2.9'!H15","v":852},6.0000000000000018,{"$f":"'II-2.2.9'!I15+'II-2.2.9'!J15","v":7148},55.999999999999972,{"$f":"'II-2.2.9'!K15+'II-2.2.9'!L15","v":29015},1375,{"$f":"'II-2.2.9'!M15+'II-2.2.9'!N15","v":2167},7037,{"$f":"'II-2.2.9'!O15+'II-2.2.9'!P15","v":2},0]
["10 años",38606,8818,{"$f":"'II-2.2.9'!E16+'II-2.2.9'!F16","v":7},0,{"$f":"'II-2.2.9'!G16+'II-2.2.9'!H16","v":81},2.9999999999999978,{"$f":"'II-2.2.9'!I16+'II-2.2.9'!J16","v":1356},0.999999999999999,{"$f":"'II-2.2.9'!K16+'II-2.2.9'!L16","v":7109},65,{"$f":"'II-2.2.9'!M16+'II-2.2.9'!N16","v":27809},1488,{"$f":"'II-2.2.9'!O16+'II-2.2.9'!P16","v":2244},7261]
["11 años",39052,1527.9999999999995,{"$f":"'II-2.2.9'!E17+'II-2.2.9'!F17","v":2},0,{"$f":"'II-2.2.9'!G17+'II-2.2.9'!H17","v":14},0,{"$f":"'II-2.2.9'!I17+'II-2.2.9'!J17","v":136},2.9999999999999996,{"$f":"'II-2.2.9'!K17+'II-2.2.9'!L17","v":1770},18,{"$f":"'II-2.2.9'!M17+'II-2.2.9'!N17","v":7704},91,{"$f":"'II-2.2.9'!O17+'II-2.2.9'!P17","v":29426},1415.9999999999995]
["12 años",9947,97,{"$f":"'II-2.2.9'!E18+'II-2.2.9'!F18","v":5},0,{"$f":"'II-2.2.9'!G18+'II-2.2.9'!H18","v":4},0,{"$f":"'II-2.2.9'!I18+'II-2.2.9'!J18","v":22},0.99999999999999922,{"$f":"'II-2.2.9'!K18+'II-2.2.9'!L18","v":208},0,{"$f":"'II-2.2.9'!M18+'II-2.2.9'!N18","v":1950},10,{"$f":"'II-2.2.9'!O18+'II-2.2.9'!P18","v":7758},86]
["13 años",2626,28.999999999999996,{"$f":"'II-2.2.9'!E19+'II-2.2.9'!F19","v":0},0,{"$f":"'II-2.2.9'!G19+'II-2.2.9'!H19","v":2},0,{"$f":"'II-2.2.9'!I19+'II-2.2.9'!J19","v":8},0,{"$f":"'II-2.2.9'!K19+'II-2.2.9'!L19","v":30},1,{"$f":"'II-2.2.9'!M19+'II-2.2.9'!N19","v":273},5,{"$f":"'II-2.2.9'!O19+'II-2.2.9'!P19","v":2313},22.999999999999996]
["14 años y más",478,0,{"$f":"'II-2.2.9'!E20+'II-2.2.9'!F20","v":3},0,{"$f":"'II-2.2.9'!G20+'II-2.2.9'!H20","v":5},0,{"$f":"'II-2.2.9'!I20+'II-2.2.9'!J20","v":2},0,{"$f":"'II-2.2.9'!K20+'II-2.2.9'!L20","v":13},null,{"$f":"'II-2.2.9'!M20+'II-2.2.9'!N20","v":40},0,{"$f":"'II-2.2.9'!O20+'II-2.2.9'!P20","v":415},0]
["Fuente: Procesamiento propio en base a datos proporcionados por el D.E.E .— C.E.I.P."]
["Nota:   Primaria Pública no incluye la matrícula correspondiente a JICI "]

{"sheet":"II-2.2.9","index":28,"n_rows":22,"n_cols":16,"rows_kept":22,"cut":false,"hidden":false,"merged":[[5,14,5,15],[6,4,6,15],[0,12,1,15],[3,0,3,15],[4,0,7,0],[4,4,4,15],[5,2,6,3],[5,4,5,5],[5,6,5,7],[5,8,5,9],[5,10,5,11],[5,12,5,13]]}
["CONSEJO DE EDUCACIÓN PRIMARIA",null,null,null,null,null,null,null,null,null,null,null,"ALUMNOS MATRICULADOS"]
[]
["Cuadro Nº II-2.2.9"]
["ALUMNOS MATRICULADOS EN EDUCACIÓN PRIMARIA COMÚN PÚBLICA POR GRADO Y SEXO SEGÚN EDAD. AÑO 2016."]
["EDAD",null,null,null,"GRADO"]
[null,null,"TOTAL SEXO",null,"Primero",null,"Segundo",null,"Tercero",null,"Cuarto",null,"Quinto",null,"Sexto"]
[null,null,null,null,"SEXO"]
[null,"TOTAL","M","F","M","F","M","F","M","F","M","F","M","F","M","F"]
["TOTAL",{"$f":"+C9+D9","v":246239},{"$f":"SUM(E9+G9+I9+K9+M9+O9)","v":127012},{"$f":"+F9+H9+J9+L9+N9+P9","v":119227},{"$f":"SUM(E11:E20)","v":22572},{"$f":"SUM(F11:F20)","v":20405},20969,19600,20477,19719,20679,19703,20517,19432,21798,20368]
[]
["5  años",{"$f":"+C11+D11","v":3023},{"$f":"SUM(E11+G11+I11+K11+M11+O11)","v":1489},{"$f":"+F11+H11+J11+L11+N11+P11","v":1534},1484,1526,0,4,0,0,2,0,3,2,0,2]
["6  años",{"$f":"+C12+D12","v":37391},{"$f":"SUM(E12+G12+I12+K12+M12+O12)","v":19149},{"$f":"+F12+H12+J12+L12+N12+P12","v":18242},17931,16987,1214,1254,3,0,0,0,0,0,1,1]
["7  años",{"$f":"+C13+D13","v":37851},{"$f":"SUM(E13+G13+I13+K13+M13+O13)","v":19331},{"$f":"+F13+H13+J13+L13+N13+P13","v":18520},2981,1763,15245,15495,1104,1258,1,2,0,1,0,1]
["8  años",38064,19361,18703,162,109,3930,2469,14220,14939,1048,1184,0,0,1,2]
["9  años",{"$f":"+C15+D15","v":39201},{"$f":"SUM(E15+G15+I15+M15+K15+O15)","v":19918},{"$f":"+F15+H15+J15+N15+L15+P15","v":19283},7,10,517,335,4203,2945,14134,14881,1055,1112,2,0]
["10 años",38606,{"$f":"SUM(E16+G16+I16+M16+K16+O16)","v":19628},{"$f":"+F16+H16+J16+N16+L16+P16","v":18978},4,3,47,34,838,518,4178,2931,13510,14299,1051,1193]
["11 años",39052,20227,{"$f":"+F17+H17+J17+N17+L17+P17","v":18825},1,1,9,5,92,44,1145,625,4511,3193,14469,14957]
["12 años",9947,5979,3968,2,3,3,1,13,9,143,65,1247,703,4571,3187]
["13 años",2626,1625,1001,0,0,2,0,3,5,20,10,163,110,1437,876]
["14 años y más",478,305,173,0,3,2,3,1,1,8,5,28,12,266,149]
["Fuente: Procesamiento propio en base a datos proporcionados por el D.E.E. — C.E.I.P."]
["Nota:   Primaria Pública no incluye la matrícula correspondiente a JICI "]

{"sheet":"II-2.2.10","index":29,"n_rows":19,"n_cols":16,"rows_kept":19,"cut":false,"hidden":false,"merged":[[5,12,5,13],[5,14,5,15],[6,4,6,15],[0,12,1,15],[2,0,2,2],[3,0,3,15],[4,0,7,0],[4,4,4,15],[5,1,6,3],[5,4,5,5],[5,6,5,7],[5,8,5,9],[5,10,5,11]]}
["CONSEJO DE EDUCACIÓN PRIMARIA",null,null,null,null,null,null,null,null,null,null,null,"ALUMNOS MATRICULADOS"]
[]
["Cuadro Nº II-2.2.10"]
["ALUMNOS MATRICULADOS EN EDUCACIÓN PRIMARIA COMÚN PRIVADA POR GRADO Y SEXO SEGÚN EDAD. AÑO 2016."]
["EDAD",null,null,null,"GRADO"]
[null,"TOTAL SEXO",null,null,"Primero",null,"Segundo",null,"Tercero",null,"Cuarto",null,"Quinto",null,"Sexto"]
[null,null,null,null,"SEXO"]
[null,"TOTAL","M","F","M","F","M","F","M","F","M","F","M","F","M","F"]
["TOTAL",{"$f":"C9+D9","v":53526},{"$f":"SUM(C10:C18)","v":27144.999999999996},{"$f":"SUM(D10:D18)","v":26381},4771,4563,4681.9999999999982,4425,4402.9999999999991,4304.0000000000009,4535,4426,4398,4233,4356,4429.9999999999991]
["6  años",{"$f":"C10+D10","v":8113},{"$f":"E10+G10+I10+K10+M10+O10","v":4113},{"$f":"F10+H10+J10+L10+N10+P10","v":4000},4113,4000,0,0,0,0,0,0,0,0,0,0]
["7  años",8965.9999999999982,{"$f":"E11+G11+I11+K11+M11+O11","v":4592.9999999999982},4373,638,546,3954.9999999999982,3827,0,0,0,0,0,0,0,0]
["8  años",8712,4421.9999999999991,4290.0000000000009,20,15,694,577.00000000000011,3707.9999999999991,3698.0000000000009,0,0,0,0,0,0]
["9  años",8789,4456,4333,0,2,27.999999999999993,16.999999999999993,656,583.99999999999977,3772,3730,0,0,0,0]
["10 años",8474,4268,4206,0,0,4.0000000000000036,1.9999999999999984,36.999999999999979,18.999999999999996,707,668,3520,3517,0,0]
["11 años",8818,4421,4396.9999999999991,0,0,0.99999999999999922,1.9999999999999984,0.999999999999999,0,46,19,806,682,3567.0000000000005,3693.9999999999991]
["12 años",1527.9999999999995,798.9999999999992,729.00000000000023,0,0,0,0,0.99999999999999978,1.9999999999999998,10,8,63,28,724.9999999999992,691.00000000000023]
["13 años",97,57,40.000000000000007,0,0,0,0,0,0.99999999999999922,0,0,6,4,51,35.000000000000007]
["14 años y más",28.999999999999996,16,12.999999999999996,0,0,0,0,0,0,0,1,3,2,13,9.9999999999999964]
["Fuente: Procesamiento propio en base a datos proporcionados por el D.E.E. — C.E.I.P."]

{"sheet":"II-2.2.11","index":30,"n_rows":33,"n_cols":15,"rows_kept":33,"cut":false,"hidden":false,"merged":[[8,9,9,9],[8,10,9,10],[8,11,9,11],[8,12,9,12],[8,13,9,13],[8,4,9,4],[8,5,9,5],[8,6,9,6],[8,7,9,7],[8,8,9,8],[0,12,1,14],[4,0,4,14],[5,0,9,0],[5,1,5,14],[6,1,7,2],[6,3,6,4],[6,5,6,6],[6,7,6,8],[6,9,6,10],[6,11,6,12],[8,14,9,14],[6,13,6,14],[7,3,7,14],[8,1,9,1],[8,2,9,2],[8,3,9,3]]}
["CONSEJO DE EDUCACIÓN PRIMARIA",null,null,null,null,null,null,null,null,null,null,null,"ALUMNOS MATRICULADOS"]
[]
["Cuadro Nº II-2.2.11"]
[]
["ALUMNOS MATRICULADOS EN EDUCACIÓN PRIMARIA COMÚN POR GRADO Y FORMA DE ADMINISTRACIÓN SEGÚN DEPARTAMENTO. AÑO 2016."]
["DEPARTAMENTO","GRADO"]
[null,"TOTAL",null,"Primero",null,"Segundo",null,"Tercero",null,"Cuarto",null,"Quinto",null,"Sexto"]
[null,null,null,"FORMA DE ADMINISTRACIÓN"]
[null,"Pública","Privada","Pública","Privada","Pública","Privada","Pública","Privada","Pública","Privada","Pública","Privada","Pública","Privada"]
[]
["TOTAL",{"$f":"SUM(B12:B13)","v":246239},52880,42977,9334,40569,9107,40196,8707,40382,8315,39949,8631,42166,8786]
["MONTEVIDEO",{"$f":"+D12+F12+H12+J12+L12+N12","v":76445},{"$f":"+E12+G12+I12+K12+M12+O12","v":32555},14231,5667,12729,5554,12655,5287,12533,5450,12067,5270,12230,5327]
["RESTO DEL PAÍS",{"$f":"SUM(B14:B31)","v":169794},{"$f":"SUM(C14:C31)","v":20325},28746,3667,27840,3553,27541,3420,27849,2865,27882,3361,29936,3458.9999999999995]
["Artigas",{"$f":"+D14+F14+H14+J14+L14+N14","v":7358},{"$f":"+E14+G14+I14+K14+M14+O14","v":187},1256,29,1246,36,1239,34,1122,32,1211,25,1284,31]
["Canelones",{"$f":"+D15+F15+H15+J15+L15+N15","v":41897},{"$f":"+E15+G15+I15+K15+M15+O15","v":7704},7205,1352.0000000000002,6812,1333.0000000000002,6883,1285.0000000000002,6954,1265,6895,1237.0000000000002,7148,1231.9999999999995]
["Cerro Largo",{"$f":"+D16+F16+H16+J16+L16+N16","v":7830},626,1271,107,1268,105,1253,83,1274,121,1309,99,1455,111]
["Colonia",{"$f":"+D17+F17+H17+J17+L17+N17","v":10243},779,1753,133,1718,144,1623,117.99999999999999,1669,132,1693,139.99999999999997,1787,112]
["Durazno",4803,654,804,115,747,97,771,105,764,124,793,90,924,123]
["Flores",1915,263,318,41,301,41,313,38,300,40,312,58,371,45]
["Florida",5591,273,917,63,888,47,897,31,937,44,920,36,1032,52]
["Lavalleja",4274,618,692,91,644,100.99999999999999,681,106.00000000000001,752,96,741,114,764,110]
["Maldonado",12631,3280,2082,640,2088,669.99999999999989,2062,644,2091,null,2071,640.99999999999989,2237,684.99999999999989]
["Paysandú",10403,1177,1677,197,1643,207,1711,203,1784,194.00000000000003,1727,171,1861,205]
["Río Negro",5275,543,976,96,885,106.00000000000001,815,89,894,89,808,75.999999999999986,897,87]
["Rivera",10125,587,1762,114.99999999999999,1747,89,1555,99,1636,95,1646,96,1779,93]
["Rocha",6278,337,1142,65,1033,52,1023,47,979,48,1000,51,1101,74]
["Salto",12229,1207,2067,226,2088,207,1994,177.00000000000003,2009,182,2004,213,2067,201.99999999999997]
["San José",9453,738,1613,146,1573,117,1587,122.00000000000001,1531,137,1553,110.00000000000001,1596,106]
["Soriano",7550,454,1221,88,1224,72,1263,67,1233,87,1231,75,1378,65]
["Tacuarembó",7852,725,1280,130,1278,106.00000000000001,1259,148,1246,136,1296,101,1493,103.99999999999999]
["Treinta y Tres",4087,173,710,33,657,23,612,24,674,43,672,28,762,22]
["Fuente: Procesamiento propio en base a datos proporcionados por el DEE — CEIP"]
["Nota:   Primaria Pública no incluye la matrícula correspondiente a JICI "]

{"sheet":"II-2.2.12","index":31,"n_rows":20,"n_cols":7,"rows_kept":20,"cut":false,"hidden":false,"merged":[[19,0,19,6],[0,5,1,6],[4,0,4,6],[5,0,9,0],[5,1,5,6],[6,1,6,3],[6,4,6,6],[7,1,9,1],[7,2,7,3],[7,4,9,4],[7,5,7,6],[8,2,9,2],[8,3,9,3],[8,5,9,5],[8,6,9,6]]}
["CONSEJO DE EDUCACIÓN PRIMARIA",null,null,null,null,"RENDIMIENTO ESCOLAR"]
[]
["Cuadro Nº II-2.2.12"]
[]
["RENDIMIENTO ESCOLAR EN EDUCACIÓN PRIMARIA COMÚN PÚBLICA POR ÁREA DEMOGRÁFICA SEGÚN GRADO. AÑO 2016."]
["GRADO","RENDIMIENTO ESCOLAR"]
[null,"PROMOVIDOS",null,null,"NO PROMOVIDOS"]
[null,"TOTAL","ÁREA DEMOGRÁFICA",null,"TOTAL","ÁREA DEMOGRÁFICA"]
[null,null,"Urbana","Rural",null,"Urbana","Rural"]
[]
["TOTAL",{"$f":"+C11+D11","v":234627},{"$f":"SUM(C12:C17)","v":221099},{"$f":"SUM(D12:D17)","v":13528},{"$f":"+F11+G11","v":11612},{"$f":"SUM(F12:F17)","v":11146},{"$f":"SUM(G12:G17)","v":466}]
["Primero",{"$f":"+C12+D12","v":37766},35695,2071,{"$f":"+F12+G12","v":5211},5034,177]
["Segundo",38158,35978,2180,2411,2305,106]
["Tercero",38491,36321,2170,1705,1649,56]
["Cuarto",39263,36987,2276,1119,1075,44]
["Quinto",39197,36882,2315,752,703,49]
["Sexto",41752,39236,2516,414,380,34]
[]
["Fuente: Procesamiento propio en base a datos proporcionados por el D.E.E .— C.E.I.P."]
["Notas:\n- No incluye datos correspondientes a JICI\n- No se presenta información para la Educación Primaria Privada porque no existen establecimientos privados en el área demográfica rural"]

{"sheet":"II-2.2.13","index":32,"n_rows":34,"n_cols":7,"rows_kept":34,"cut":false,"hidden":false,"merged":[[33,0,33,6],[0,5,1,6],[4,0,4,6],[5,0,9,0],[5,1,5,6],[6,1,6,3],[6,5,6,6],[7,1,9,1],[7,2,7,3],[7,4,9,4],[7,5,7,6],[8,2,9,2],[8,3,9,3],[8,5,9,5],[8,6,9,6],[32,0,32,6]]}
["CONSEJO DE EDUCACIÓN PRIMARIA",null,null,null,null,"RENDIMIENTO ESCOLAR"]
[]
["Cuadro Nº II-2.2.13"]
[]
["RENDIMIENTO ESCOLAR EN EDUCACIÓN PRIMARIA COMÚN PÚBLICA POR  ÁREA DEMOGRÁFICA SEGÚN DEPARTAMENTO. AÑO 2016."]
["DEPARTAMENTO","RENDIMIENTO ESCOLAR"]
[null,"PROMOVIDOS",null,null,null,"NO PROMOVIDOS"]
[null,"TOTAL","ÁREA DEMOGRÁFICA",null,"TOTAL","ÁREA DEMOGRÁFICA"]
[null,null,"Urbana","Rural",null,"Urbana","Rural"]
[]
["TOTAL",{"$f":"+C11+D11","v":234627},{"$f":"SUM(C12:C13)","v":221099},{"$f":"SUM(D12:D13)","v":13528},{"$f":"+F11+G11","v":11612},{"$f":"SUM(F12:F13)","v":11146},{"$f":"SUM(G12:G13)","v":466}]
["MONTEVIDEO",{"$f":"+C12+D12","v":70641},70641,0,{"$f":"+F12+G12","v":5804},5804,0]
["RESTO DEL PAÍS",{"$f":"+C13+D13","v":163986},{"$f":"SUM(C14:C31)","v":150458},{"$f":"SUM(D14:D31)","v":13528},{"$f":"+F13+G13","v":5808},{"$f":"SUM(F14:F31)","v":5342},{"$f":"SUM(G14:G31)","v":466}]
["Artigas",{"$f":"+C14+D14","v":7320},6753,567,{"$f":"+F14+G14","v":38},35,3]
["Canelones",39599,37218,2381,2298,2196,102]
["Cerro Largo",7598,6832,766,232,199,33]
["Colonia",9977,9034,943,266,247,19]
["Durazno",4770,4363,407,33,29,4]
["Flores",1901,1709,192,14,12,2]
["Florida",5423,4641,782,168,151,17]
["Lavalleja",4173,3771,402,101,92,9]
["Maldonado",12179,11701,478,452,433,19]
["Paysandú",10057,9212,845,346,305,41]
["Río Negro",5115,4658,457,160,148,12]
["Rivera",9913,9058,855,212,190,22]
["Rocha",6125,5826,299,153,145,8]
["Salto",11724,10597,1127,505,445,60]
["San José",9154,8003,1151,299,272,27]
["Soriano",7326,6761,565,224,196,28]
["Tacuarembó",7623,6620,1003,229,179,50]
["Treinta y Tres",4009,3701,308,78,68,10]
["Fuente: Procesamiento propio en base a datos proporcionados por el D.E.E .— C.E.I.P."]
["Notas:  No incluye datos correspondientes a JICI"]
["           No se presenta información para la Educación Primaria Privada porque no existen establecimientos privados en el área demográfica rural"]

{"sheet":"II-2.2.14","index":33,"n_rows":32,"n_cols":7,"rows_kept":32,"cut":false,"hidden":false,"merged":[[31,0,31,6],[0,5,1,6],[4,0,4,6],[5,0,8,0],[5,1,5,6],[6,1,6,3],[6,4,6,6],[7,2,7,3],[7,5,7,6]]}
["CONSEJO DE EDUCACIÓN PRIMARIA",null,null,null,null,"RENDIMIENTOS ESCOLAR"]
[]
["Cuadro Nº II-2.2.14"]
[]
["RENDIMIENTO ESCOLAR EN EDUCACIÓN PRIMARIA COMÚN PÚBLICA POR SEXO SEGÚN DEPARTAMENTO. AÑO 2016."]
["DEPARTAMENTO","RENDIMIENTO ESCOLAR"]
[null,"PROMOVIDOS",null,null,"NO PROMOVIDOS"]
[null,"TOTAL","SEXO",null,"TOTAL","SEXO"]
[null,null,"M","F",null,"M","F"]
["TOTAL",{"$f":"+C10+D10","v":234627},{"$f":"SUM(C11:C12)","v":119914},{"$f":"SUM(D11:D12)","v":114713},{"$f":"+F10+G10","v":11612},{"$f":"SUM(F11:F12)","v":7098},{"$f":"SUM(G11:G12)","v":4514}]
["MONTEVIDEO",{"$f":"+C11+D11","v":70641},36214,34427,{"$f":"+F11+G11","v":5804},3481,2323]
["RESTO DEL PAÍS",163986,{"$f":"SUM(C13:C30)","v":83700},{"$f":"SUM(D13:D30)","v":80286},5808,{"$f":"SUM(F13:F30)","v":3617},{"$f":"SUM(G13:G30)","v":2191}]
["Artigas",7320,3818,3502,38,25,13]
["Canelones",39599,20177,19422,2298,1428,870]
["Cerro Largo",7598,3846,3752,232,142,90]
["Colonia",9977,5069,4908,266,163,103]
["Durazno",4770,2416,2354,33,22,11]
["Flores",1901,932,969,14,8,6]
["Florida",5423,2769,2654,168,102,66]
["Lavalleja",4173,2101,2072,101,67,34]
["Maldonado",12179,6132,6047,452,275,177]
["Paysandú",10057,5133,4924,346,214,132]
["Río Negro",5115,2585,2530,160,105,55]
["Rivera",9913,5118,4795,212,137,75]
["Rocha",6125,3120,3005,153,98,55]
["Salto",11724,6009,5715,505,320,185]
["San José",9154,4697,4457,299,179,120]
["Soriano",7326,3768,3558,224,145,79]
["Tacuarembó",7623,3914,3709,229,135,94]
["Treinta y Tres",4009,2096,1913,78,52,26]
["Fuente: Procesamiento propio en base a datos proporcionados por el D.E.E. — C.E.I.P."]
["Nota: No incluye datos correspondientes a JICI ."]

{"sheet":"II-2.2.15","index":34,"n_rows":31,"n_cols":7,"rows_kept":31,"cut":false,"hidden":false,"merged":[[0,5,1,6],[4,0,4,6],[5,0,8,0],[5,1,5,6],[6,1,6,3],[6,4,6,6],[7,1,8,1],[7,2,7,3],[7,4,8,4],[7,5,7,6]]}
["CONSEJO DE EDUCACIÓN PRIMARIA",null,null,null,null,"RENDIMIENTO ESCOLAR"]
[]
["Cuadro Nº II-2.2.15"]
[]
["RENDIMIENTO ESCOLAR EN EDUCACIÓN PRIMARIA COMÚN PRIVADA POR SEXO SEGÚN DEPARTAMENTO. AÑO 2016."]
["DEPARTAMENTO","RENDIMIENTO ESCOLAR"]
[null,"PROMOVIDOS",null,null,"NO PROMOVIDOS"]
[null,"TOTAL","SEXO",null,"TOTAL","SEXO"]
[null,null,"M","F",null,"M","F"]
["TOTAL",{"$f":"+C10+D10","v":53006},{"$f":"SUM(C11:C12)","v":26810.000000000004},{"$f":"SUM(D11:D12)","v":26195.999999999993},{"$f":"+F10+G10","v":520},{"$f":"SUM(F11:F12)","v":336},{"$f":"SUM(G11:G12)","v":184.00000000000006}]
["MONTEVIDEO",{"$f":"+C11+D11","v":32219},16315.000000000004,15903.999999999995,{"$f":"+F11+G11","v":336.00000000000006},215,121.00000000000004]
["RESTO DEL PAÍS",20787,{"$f":"SUM(C13:C30)","v":10495},{"$f":"SUM(D13:D30)","v":10292},184,{"$f":"SUM(F13:F30)","v":121},{"$f":"SUM(G13:G30)","v":63}]
["Artigas",186,109,77,1,0,1]
["Canelones",7614.9999999999982,3864.9999999999991,3749.9999999999995,89,62,26.999999999999996]
["Cerro Largo",623,298,325,3,3,0]
["Colonia",770.00000000000011,389,381.00000000000011,9,4.0000000000000009,5]
["Durazno",649,315,334,5,4,1]
["Flores",258,120,138,5,4,1]
["Florida",270,138,132,3,2,1]
["Lavalleja",614.99999999999989,303.99999999999994,310.99999999999994,3,3,0]
["Maldonado",3898.9999999999995,1989.9999999999998,1908.9999999999998,27,14.000000000000002,13]
["Paysandú",1168,583,585,9,6,3]
["Río Negro",537,278,259,6.0000000000000018,4.0000000000000009,2.0000000000000004]
["Rivera",583,291.00000000000006,291.99999999999994,4,3,1]
["Rocha",336,171,165,1,0,1]
["Salto",1199,597,602,7.9999999999999991,4.9999999999999991,3]
["San José",728,346,382,10,6,4]
["Soriano",454,245,209,0,0,0]
["Tacuarembó",724,363,361,1,1,0]
["Treinta y Tres",173,93,80,0,0,0]
["Fuente: Procesamiento propio en base a datos proporcionados por el D.E.E. — C.E.I.P."]

{"sheet":"II-2.2.16","index":35,"n_rows":34,"n_cols":5,"rows_kept":34,"cut":false,"hidden":false,"merged":[[31,0,31,3],[0,4,1,5],[4,0,4,3],[5,0,8,0],[5,2,6,3],[6,1,8,1],[7,2,8,2],[7,3,8,3]]}
["CONSEJO DE EDUCACIÓN PRIMARIA",null,null,null,"RENDIMIENTO ESCOLAR"]
[]
["Cuadro Nº II-2.2.16"]
[]
["ESTUDIANTES MATRICULADOS EGRESADOS DE EDUCACIÓN PRIMARIA COMÚN PÚBLICA POR ÁREA DEMOGRÁFICA SEGÚN DEPARTAMENTO. AÑO 2016."]
["DEPARTAMENTO",null,"ÁREA DEMOGRÁFICA"]
[null,"TOTAL"]
[null,null,"Urbana","Rural"]
[]
["TOTAL",{"$f":"+C10+D10","v":41752},{"$f":"SUM(C11:C12)","v":39236},{"$f":"SUM(D11:D12)","v":2516}]
["MONTEVIDEO",{"$f":"C11+D11","v":12042},12042,0]
["RESTO DEL PAÍS",{"$f":"+C12+D12","v":29710},{"$f":"SUM(C13:C30)","v":27194},{"$f":"SUM(D13:D30)","v":2516}]
["Artigas",{"$f":"+C13+D13","v":1281},1160,121]
["Canelones",7068,6667,401]
["Cerro Largo",1447,1289,158]
["Colonia",1786,1610,176]
["Durazno",920,848,72]
["Flores",369,326,43]
["Florida",1024,860,164]
["Lavalleja",757,696,61]
["Maldonado",2219,2134,85]
["Paysandú",1843,1685,158]
["Río Negro",895,819,76]
["Rivera",1764,1591,173]
["Rocha",1100,1047,53]
["Salto",2046,1833,213]
["San José",1586,1399,187]
["Soriano",1369,1265,104]
["Tacuarembó",1477,1265,212]
["Treinta y Tres",759,700,59]
["Fuente: Procesamiento propio en base a datos proporcionados por el D.E.E .— C.E.I.P."]
["Nota: No se presenta información para Montevideo Rural por que no existen establecimientos en  el área demográfica rural."]
["        "]
["        "]

{"sheet":"II-2.2.17","index":36,"n_rows":30,"n_cols":9,"rows_kept":30,"cut":false,"hidden":false,"merged":[[0,6,1,8],[4,0,4,8],[5,0,7,0],[5,1,7,1],[5,2,5,5],[5,6,5,8],[6,2,7,2],[6,3,6,5],[6,6,7,6],[6,7,6,8]]}
["CONSEJO DE EDUCACIÓN PRIMARIA",null,null,null,null,null,"RENDIMIENTO ESCOLAR"]
[]
["Cuadro Nº II-2.2.17"]
[]
["ESTUDIANTES MATRICULADOS EGRESADOS DE EDUCACIÓN PRIMARIA COMÚN POR FORMA DE ADMINISTRACIÓN SEGÚN DEPARTAMENTO. AÑO 2016."]
["DEPARTAMENTO","TOTAL","PÚBLICA",null,null,null,"PRIVADA"]
[null,null,"TOTAL","SEXO",null,null,"TOTAL","SEXO"]
[null,null,null,"M","M","F",null,"M","F"]
["TOTAL",{"$f":"+C9+G9","v":50520},{"$f":"+E9+F9","v":41752},null,{"$f":"SUM(E10:E11)","v":21541},{"$f":"SUM(F10:F11)","v":20211},{"$f":"+H9+I9","v":8768.0000000000036},{"$f":"SUM(H10,H11)","v":4346.0000000000009},{"$f":"SUM(I10,I11)","v":4422.0000000000018}]
["MONTEVIDEO",{"$f":"+C10+G10","v":17358},{"$f":"+E10+F10","v":12042},6560,6216,5826,{"$f":"+H10+I10","v":5316.0000000000018},2620.0000000000009,2696.0000000000014]
["RESTO DEL PAÍS",{"$f":"+C11+G11","v":33162},29710,null,{"$f":"SUM(E12:E29)","v":15325},{"$f":"SUM(F12:F29)","v":14385},3452,{"$f":"SUM(H12:H29)","v":1726.0000000000002},{"$f":"SUM(I12:I29)","v":1726}]
["Artigas",{"$f":"+C12+G12","v":1312},1281,765,672,609,31,17,14]
["Canelones",8296,7068,3826,3667,3401,1228,624.00000000000011,604]
["Cerro Largo",1558,1447,802,703,744,111,53,58]
["Colonia",1898,1786,891,900,886,112.00000000000001,48,64.000000000000014]
["Durazno",1043,920,502,463,457,123,60,63]
["Flores",412,369,192,176,193,43,19,24]
["Florida",1076,1024,502,517,507,52,26,26]
["Lavalleja",867,757,426,380,377,110,56,54.000000000000007]
["Maldonado",2904,2219,1183,1152,1067,685.00000000000011,344.00000000000011,341]
["Paysandú",2048,1843,976,963,880,205,115,90]
["Río Negro",982,895,501,446,449,87,38,49.000000000000007]
["Rivera",1857,1764,995,923,841,93,49,44]
["Rocha",1174,1100,603,573,527,74,38,36]
["Salto",2248,2046,1191,1084,962,202,97,105.00000000000001]
["San José",1691,1586,824,807,779,105,48,57]
["Soriano",1434,1369,717,705,664,65,32,33]
["Tacuarembó",1581,1477,845,809,668,104,50,54.000000000000007]
["Treinta y Tres",781,759,443,385,374,22,12,10]
["Fuente: Procesamiento propio en base a datos proporcionados por el D.E.E. — C.E.I.P."]

{"sheet":"II-2.2.18","index":37,"n_rows":34,"n_cols":5,"rows_kept":34,"cut":false,"hidden":false,"merged":[[30,0,30,4],[0,3,1,4],[4,0,4,4],[5,0,6,0],[5,1,5,2],[5,3,5,4],[29,0,29,4]]}
["CONSEJO DE EDUCACIÓN PRIMARIA",null,null,"RENDIMIENTO ESCOLAR"]
[]
["Cuadro Nº II-2.2.18"]
[]
["ASISTENCIA INSUFICIENTE Y ABANDONO INTERMITENTE DE 1º GRADO Y 1º A 6º GRADO EN EDUCACIÓN COMÚN PÚBLICA SEGÚN DEPARTAMENTO. AÑO 2016."]
["DEPARTAMENTO","ASISTENCIA INSUFICIENTE",null,"ABANDONO INTERMITENTE"]
[null,"Sólo\n1.er año","1.º a 6.º  años","Sólo\n1.er año","1.º a 6.º  años"]
["TOTAL",{"$f":"SUM(B9:B10)","v":4877},{"$f":"SUM(C9:C10)","v":18894},{"$f":"SUM(D9:D10)","v":288},{"$f":"SUM(E9:E10)","v":1210}]
["MONTEVIDEO",2520,9416,172,669]
["RESTO DEL PAÍS",{"$f":"SUM(B11:B28)","v":2357},{"$f":"SUM(C11:C28)","v":9478},{"$f":"SUM(D11:D28)","v":116},{"$f":"SUM(E11:E28)","v":541}]
["Artigas",129,572,3,17]
["Canelones",788,3081,42,186]
["Cerro Largo",85,367,0,15]
["Colonia",74,269,4,14]
["Durazno",84,369,3,16]
["Flores",20,72,2,7]
["Florida",39,205,3,12]
["Lavalleja",37,197,1,8]
["Maldonado",222,862,9,43]
["Paysandú",120,420,8,21]
["Río Negro",73,274,1,12]
["Rivera",102,489,6,36]
["Rocha",93,298,12,23]
["Salto",180,729,6,55]
["San José",138,551,6,30]
["Soriano",86,382,4,17]
["Tacuarembó",54,207,5,15]
["Treinta y Tres",33,134,1,14]
["Fuente: Procesamiento propio en base a datos proporcionados por el D.E.E. — C.E.I.P."]
["Nota: No incluye datos correspondientes a JICI ."]
[]
[]
[]
["       "]

{"sheet":"II-2.3.1 ","index":38,"n_rows":96,"n_cols":9,"rows_kept":96,"cut":false,"hidden":false,"merged":[[6,7,7,7],[6,8,7,8],[31,0,31,8],[32,0,32,8],[0,6,1,7],[4,0,4,8],[5,0,7,0],[5,2,5,8],[6,1,7,1],[6,2,7,2],[6,3,7,3],[6,4,7,4],[6,5,7,5],[6,6,7,6]]}
["CONSEJO DE EDUCACIÓN PRIMARIA",null,null,null,null,null,"PERSONAL DOCENTE"]
[]
["Cuadro Nº II-2.3.1"]
[]
["PERSONAL DOCENTE DE EDUCACIÓN PRIMARIA PÚBLICA POR TIPO DE DESEMPEÑO DOCENTE SEGÚN DEPARTAMENTO. AÑO 2016."]
["DEPARTAMENTO",null,"TIPO DE DESEMPEÑO DOCENTE"]
[null,"TOTAL","Inspección","Educación Común","Educación en Colonias","Educación Especial","Servicios Docentes Especiales","Profesores Especiales","Coordinación Apoyo"]
[]
["TOTAL",{"$f":"SUM(B11:B12)","v":19799},281,15179,39,983,208,3016,93]
[]
["MONTEVIDEO",{"$f":"SUM(C11:I11)","v":5776},102,4150,14,400,159,937,14]
["RESTO DEL PAÍS",{"$f":"SUM(B14:B31)","v":14023},179,11029,25,583,{"$f":"SUM(G14:G31)","v":49},2079,79]
[]
["Artigas",{"$f":"SUM(C14:I14)","v":675},7,515,0,24,0,126,3]
["Canelones",2828,33,2294,0,115,12,362,12]
["Cerro Largo",736,10,565,0,34,4,120,3]
["Colonia",836,11,662,0,39,3,114,7]
["Durazno",467,8,371,0,21,0,63,4]
["Flores",216,4,159,0,9,0,42,2]
["Florida",542,7,408,0,26,4,92,5]
["Lavalleja",430,6,332,0,21,4,64,3]
["Maldonado",870,11,671,15,41,7,121,4]
["Paysandú",870,10,703,0,38,5,110,4]
["Río Negro",457,6,361,0,21,1,65,3]
["Rivera",895,11,674,0,30,1,174,5]
["Rocha",554,8,418,0,30,0,94,4]
["Salto",958,13,750,9,38,1,143,4]
["San José",773,8,632,0,30,1,98,4]
["Soriano",662,9,529,0,28,2,90,4]
["Tacuarembó",827,11,656,1,23,4,128,4]
["Treinta y Tres",427,6,329,0,15,0,73,4]
["Fuente: DEE — CEIP Listado de cargos de la División Hacienda a Julio 2016"]
[]
["        "]
["        "]
[]
[]
[]
[]
[]
[]
[]
[]
[]
[]
[]
[]
[]
[]
[]
[]
[]
[]
[]
[]
[]
[]
[]
[]
[]
[]
[]
[]
[]
[]
[]
[]
[]
[]
[]
[]
[]
[]
[{"$f":"SUM(A76:A77)","v":147}]
[]
[92]
[{"$f":"SUM(A79:A96)","v":55}]
[]
[0]
[14]
[4]
[3]
[0]
[0]
[5]
[4]
[7]
[5]
[0]
[1]
[3]
[2]
[0]
[2]
[5]
[0]

{"sheet":"II-2.3.2 ","index":39,"n_rows":32,"n_cols":12,"rows_kept":32,"cut":false,"hidden":false,"merged":[[52,20,53,20],[52,21,53,21],[52,22,53,22],[49,17,49,22],[50,11,53,12],[50,13,50,22],[51,13,51,15],[51,17,53,17],[51,18,51,22],[52,13,52,14],[52,15,53,15],[52,18,53,18],[52,19,53,19],[48,20,48,22],[6,11,8,12],[6,13,6,22],[7,5,8,5],[7,6,8,6],[7,7,8,7],[7,8,8,8],[7,9,8,9],[7,10,8,10],[7,13,7,16],[7,17,8,17],[7,18,7,22],[8,13,8,14],[30,0,30,10],[42,11,42,22],[45,11,45,22],[0,9,1,10],[4,0,4,10],[5,0,8,1],[5,2,8,2],[5,3,8,3],[5,4,8,4],[5,5,5,10],[6,5,6,7],[6,8,6,10]]}
["CONSEJO DE EDUCACIÓN PRIMARIA",null,null,null,null,null,null,null,null,"PERSONAL DOCENTE"]
[]
["Cuadro Nº II-2.3.2"]
[]
["PERSONAL DOCENTE DE EDUCACIÓN PRIMARIA PRIVADA POR TIPO DE ESTABLECIMIENTO Y TIPO DE DESEMPEÑO DOCENTE SEGÚN DEPARTAMENTO. AÑO 2016."]
["  DEPARTAMENTO",null,"TOTAL","MAESTROS","PROFESORES","ESTABLECIMIENTOS"]
[null,null,null,null,null,"HABILITADOS",null,null,"AUTORIZADOS"]
[null,null,null,null,null,"Total","Maestros","Profesores","Total","Maestros","Profesores"]
[]
["TOTAL",null,{"$f":"+D10+E10","v":8033},{"$f":"+G10+J10","v":3585},{"$f":"+H10+K10","v":4448},{"$f":"+G10+H10","v":7579},{"$f":"SUM(G11:G12)","v":3402},{"$f":"SUM(H11:H12)","v":4177},{"$f":"+J10+K10","v":454},{"$f":"SUM(J11:J12)","v":183},{"$f":"SUM(K11:K12)","v":271}]
["MONTEVIDEO",null,{"$f":"+D11+E11","v":4721},{"$f":"G11+J11","v":2096},{"$f":"H11+K11","v":2625},{"$f":"+G11+H11","v":4342},1951,2391,{"$f":"+J11+K11","v":379},145,234]
["RESTO DEL PAÍS",null,{"$f":"+D12+E12","v":3312},{"$f":"G12+J12","v":1489},{"$f":"H12+K12","v":1823},{"$f":"+G12+H12","v":3237},{"$f":"SUM(G13:G30)","v":1451},{"$f":"SUM(H13:H30)","v":1786},{"$f":"+J12+K12","v":75},{"$f":"SUM(J13:J30)","v":38},{"$f":"SUM(K13:K30)","v":37}]
["Artigas",null,{"$f":"+F13+I13","v":32},17,15,{"$f":"+G13+H13","v":32},17,15,0,0,0]
["Canelones",null,1160,520,640,1093,486,607,67,34,33]
["Cerro Largo",null,90,42,48,90,42,48,0,0,0]
["Colonia",null,163,66,97,163,66,97,0,0,0]
["Durazno",null,57,37,20,57,37,20,0,0,0]
["Flores",null,56,28,28,56,28,28,0,0,0]
["Florida",null,44,24,20,44,24,20,0,0,0]
["Lavalleja",null,106,47,59,106,47,59,0,0,0," "]
["Maldonado",null,580,261,319,580,261,319,0,0,0]
["Paysandú",null,186,87,99,186,87,99,0,0]
["Río Negro",null,123,48,75,117,45,72,6,3,3]
["Rivera",null,111,50,61,111,50,61,0,0,0]
["Rocha",null,73,30,43,73,30,43,0,0,0]
["Salto",null,150,72,78,150,72,78,0,0,0]
["San José",null,126,54,72,124,53,71,2,1,1]
["Soriano",null,95,39,56,95,39,56,0,0,0]
["Tacuarembó",null,134,55,79,134,55,79,0,0,0]
["Treinta y Tres",null,26,12,14,26,12,14,0,0,0]
["Fuente: DEE — CEIP Planillas enviadas por las Inspecciones Departamentales a abril de 2011."]
["NOTA: El personal docente incluye exclusivamente docencia directa "]

{"sheet":"MEDIA BASICA ","index":40,"n_rows":118,"n_cols":2,"rows_kept":118,"cut":false,"hidden":false,"merged":[]}
[]
[]
[]
[]
[]
["Cuadro Nº II-3.1.1","ESTABLECIMIENTOS DE EDUCACIÓN MEDIA BÁSICA POR MODALIDAD Y FORMA DE ADMINISTRACIÓN SEGÚN DEPARTAMENTO. AÑO 2016."]
[""]
["Cuadro Nº II-3.1.2","ESTABLECIMIENTOS FÍSICOS DE EDUCACIÓN MEDIA POR FORMA DE ADMINISTRACIÓN SEGÚN DEPARTAMENTO. AÑO 2016."]
[""]
[""]
["Cuadro Nº II-3.2.1","ALUMNOS MATRICULADOS EN EDUCACION MEDIA BÁSICA GENERAL POR GRADO SEGÚN GRANDES ÁREAS Y FORMA DE ADMINISTRACIÓN. AÑO 2016. "]
[""]
["Cuadro Nº II-3.2.2","ALUMNOS MATRICULADOS EN EL CETP EN EDUCACIÓN MEDIA BÁSICA TECNOLÓGICA POR TIPO DE CURSO SEGÚN  GRANDES ÁREAS, DEPARTAMENTO Y SEXO. AÑO 2016. "]
[""]
["Cuadro Nº II-3.2.3","ALUMNOS MATRICULADOS EN SÉPTIMO, OCTAVO Y NOVENO GRADO DE CICLO BÁSICO RURAL POR SEXO SEGÚN DEPARTAMENTO. AÑO 2016. "]
[""]
["Cuadro Nº II-3.2.4","ALUMNOS MATRICULADOS DE EDUCACIÓN MEDIA BÁSICA GENERAL  POR GRADO Y FORMA DE ADMINISTRACIÓN SEGÚN DEPARTAMENTO AÑO 2016."]
[""]
["Cuadro Nº II-3.2.5","ALUMNOS MATRICULADOS DE EDUCACIÓN MEDIA BÁSICA PRIVADA  POR GRADO Y SEXO SEGÚN DEPARTAMENTO. AÑO 2016."]
[""]
["Cuadro Nº II-3.2.6","ALUMNOS MATRICULADOS DE EDUCACIÓN MEDIA BÁSICA PÚBLICA  POR GRADO Y SEXO SEGÚN DEPARTAMENTO. AÑO 2016."]
[""]
["Cuadro Nº II-3.2.7","ALUMNOS MATRICULADOS EN EDUCACIÓN TÉCNICA MEDIA BÁSICA POR TIPO DE CURSO SEGÚN EDAD. AÑO 2016."]
[""]
["Cuadro Nº II-3.2.8"," ALUMNOS MATRICULADOS EN EL CETP EN EDUCACIÓN MEDIA BÁSICA POR TIPO DE CURSO SEGÚN SECTORES DE ESTUDIO. AÑO 2016."]
[""]
[""]
["Cuadro Nº II-3.3.1","PERSONAL DOCENTE Y HORAS DOCENTES DEL CES EN EDUACIÓN MEDIA BÁSICA GENERAL POR TITULACIÓN SEGÚN ASIGNATURAS. AÑO 2016. "]
[""]
["Cuadro Nº II-3.3.2","PERSONAL DOCENTE DEL CETP EN EDUCACIÓN MEDIA BÁSICA TECNOLÓGICA POR TIPO DE CURSO. AÑO 2016. "]
[]
[""]
["Cuadro Nº II-3.4.1","GRUPOS DEL CES EN EDUCACIÓN MEDIA BÁSICA GENERAL  COMPARADOS CON EL TOTAL DE GRUPOS EN EDUCACIÓN MEDIA GENERAL SEGÚN GRANDES ÁREAS Y FORMA DE ADMINISTRACIÓN. AÑO 2016. "]
[""]
[""]
[""]
[""]
[""]
[""]
[""]
[""]
[""]
[""]
[""]
[""]
[""]
[""]
[""]
[""]
[""]
[""]
[""]
[""]
[""]
[""]
[""]
[""]
[""]
[""]
[""]
[""]
[""]
[""]
[""]
[""]
[""]
[""]
[""]
[""]
[""]
[""]
[""]
[""]
[""]
[""]
[""]
[""]
[""]
[""]
[""]
[""]
[""]
[""]
[""]
[""]
[""]
[""]
[""]
[""]
[""]
[{"$f":"MID(B63,1,20)","v":""}]
[""]
[""]
[""]
[""]
[""]
[""]
[""]
[""]
[{"$f":"MID(B72,1,20)","v":""}]
[""]
[""]
[""]
[""]
[""]
[""]
[""]
[""]
[""]
[""]
[""]
[""]
[""]
[""]
[""]
[""]
[""]
[""]

{"sheet":"II-3.1.1 ","index":41,"n_rows":38,"n_cols":14,"rows_kept":38,"cut":false,"hidden":false,"merged":[[9,11,14,11],[11,3,13,4],[11,5,13,6],[37,0,42,10],[0,9,2,10],[5,0,5,10],[6,0,14,0],[6,3,6,13],[7,1,14,1],[7,2,14,2],[7,3,7,9],[7,12,7,13],[8,3,8,13],[9,3,10,6],[10,12,13,13],[9,7,14,7],[9,8,13,9],[9,10,14,10]]}
["CONSEJO DE EDUCACIÓN INICIAL Y PRIMARIA (CEIP), ",null,null,null,null,null,null,null,null,"ESTABLECIMIENTOS"]
["CONSEJO DE EDUCACIÓN SECUNDARIA (CES) Y CONSEJO DE EDUCACIÓN TÉCNICO PROFESIONAL (UTU)"]
[]
["Cuadro Nº II-3.1.1"]
[]
["ESTABLECIMIENTOS DE EDUCACIÓN MEDIA BÁSICA POR MODALIDAD Y FORMA DE ADMINISTRACIÓN SEGÚN DEPARTAMENTO. AÑO 2016."]
["DEPARTAMENTO",null,null,"MODALIDAD"]
[null,"TOTAL GENERAL","TOTAL LICEOS PÚBLICOS","CES",null,null,null,null,null,null,"CEIP",null,"CETP"]
[null,null,null,"FORMA DE ADMINISTRACIÓN"]
[null,null,null,"LICEOS PÚBLICOS",null,null,null,"TOTAL LICEOS PRIVADOS","Liceos Privados",null,"Escuelas con Ciclo Básico Rural","TOTAL ESCUELAS DE CBT Y TÈCNICA"]
[null,null,null,null,null,null,null,null,null,null,null,null,"Escuelas de CBT y Técnica"]
[null,null,null,"Diurnos Oficiales",null,"Extra Edad Oficiales (Nocturno Y Diurno)"]
[]
[]
[null,null,null,"Ciclo Básico","C.Básico y Bachillerato","Ciclo Básico","C.Básico y Bachillerato",null,"Ciclo Básico","C.Básico y Bachillerato",null,null,"Escuelas de CBT y Técnica","Reparticiones"]
["TOTAL",{"$f":"C16+H16+K16+L16","v":770},{"$f":"SUM(C17,C18)","v":333},{"$f":"D17+D18","v":100},{"$f":"E17+E18","v":154},{"$f":"F17+F18","v":15},{"$f":"G17+G18","v":64},{"$f":"SUM(I16:J16)","v":181},{"$f":"I17+I18","v":25},{"$f":"J17+J18","v":156},{"$f":"K17+K18","v":52},{"$f":"M16+N16","v":204},{"$f":"M17+M18","v":111},{"$f":"N17+N18","v":93}]
["MONTEVIDEO",{"$f":"C17+H17+K17+L17","v":212},{"$f":"SUM(D17:G17)","v":74},45,10,3,16,{"$f":"SUM(I17:J17)","v":103},13,90,0,{"$f":"M17+N17","v":35},21,14]
["RESTO DEL PAÍS",{"$f":"C18+H18+K18+L18","v":558},{"$f":"SUM(C19:C36)","v":259},{"$f":"SUM(D19:D36)","v":55},{"$f":"SUM(E19:E36)","v":144},{"$f":"SUM(F19:F36)","v":12},{"$f":"SUM(G19:G36)","v":48},{"$f":"SUM(I18:J18)","v":78},{"$f":"SUM(I19:I36)","v":12},{"$f":"SUM(J19:J36)","v":66},{"$f":"SUM(K19:K36)","v":52},169,{"$f":"SUM(M19:M36)","v":90},{"$f":"SUM(N19:N36)","v":79}]
["Artigas",24,{"$f":"SUM(D19:G19)","v":11},3,7,0,1,{"$f":"SUM(I19:J19)","v":2},0,2,3,8,4,4]
["Canelones",125,64,12,31,6,15,{"$f":"SUM(I20:J20)","v":26},6,20,0,35,17,18]
["Cerro Largo",28,10,1,7,0,2,3,0,3,4,11,5,6]
["Colonia*",27,17,2,10,0,5,1,1,0,null,9,9,0]
["Durazno",19,8,2,5,0,1,2,0,2,1,8,3,5]
["Flores",11,4,1,2,0,1,2,0,2,1,4,2,2]
["Florida",24,12,2,9,0,1,2,0,2,2,8,2,6]
["Lavalleja",19,9,2,6,1,0,2,1,1,2,6,2,4]
["Maldonado",44,17,4,8,1,4,12,1,11,4,11,7,4]
["Paysandú",32,13,5,7,0,1,2,0,2,9,8,4,4]
["Río Negro",21,9,3,4,0,2,2,0,2,5,5,3,2]
["Rivera",33,14,4,7,2,1,5,2,3,4,10,5,5]
["Rocha",23,13,3,7,0,3,2,0,2,3,5,5,0]
["Salto",30,12,1,9,1,1,5,0,5,0,13,4,9]
["San José",29,13,2,6,1,4,3,0,3,7,6,6,0]
["Soriano",20,11,3,5,0,3,1,0,1,1,7,6,1]
["Tacuarembó",30,14,3,9,0,2,4,1,3,4,8,2,6]
["Treinta y Tres",19,8,2,5,0,1,2,0,2,2,7,4,3]
["Fuente: D.E.- C.E.S ."]
["Notas:\n1- Los establecimientos considerados en el Tipo de Educación Escuelas con Ciclo Básico Rural ya fueron considerados en los totales de establecimientos de Educación Primaria por lo cual, si bien se presentan en la columna  correspondiente, no participan en el “Total” del presente cuadro.\n2- En un mismo establecimiento de UTU coexisten  ofertas educativas de diferentes niveles. Los establecimientos que se consideraron en este cuadro son aquellos en los que se dictan cursos clasificados como de EDUCACIÓN MEDIA BÁSICA."]

{"sheet":"II-3.1.2 ","index":42,"n_rows":33,"n_cols":7,"rows_kept":33,"cut":false,"hidden":false,"merged":[[31,0,31,5],[32,0,32,5],[0,6,0,7],[4,0,4,5],[5,0,8,0],[5,2,5,5],[6,1,8,1],[6,2,6,3],[7,2,7,5]]}
["CONSEJO DE EDUCACIÓN INICIAL Y PRIMARIA (CEIP), ",null,null,null,null,null,"ESTABLECIMIENTOS"]
["CONSEJO DE EDUCACIÓN SECUNDARIA (CES) Y CONSEJO DE EDUCACIÓN TÉCNICO PROFESIONAL (UTU)"]
["Cuadro Nº II-3.1.2"]
[]
["ESTABLECIMIENTOS FÍSICOS DE EDUCACIÓN MEDIA POR FORMA DE ADMINISTRACIÓN SEGÚN DEPARTAMENTO. AÑO 2016."]
["DEPARTAMENTO",null,"MODALIDAD"]
[null,"TOTAL GENERAL","CES",null,"CEIP","CETP"]
[]
[null,null,"LICEOS PÚBLICOS","LICEOS PRIVADOS","Escuelas con Ciclo Básico Rural","Escuelas de CBT y Técnica."]
["TOTAL",{"$f":"B11+B12","v":792},{"$f":"C11+C12","v":299},{"$f":"D11+D12","v":190},{"$f":"E11+E12","v":58},{"$f":"F11+F12","v":245}]
["MONTEVIDEO",{"$f":"SUM(C11:F11)","v":239},75,110,0,54]
["RESTO DEL PAÍS",{"$f":"SUM(C12:F12)","v":553},{"$f":"SUM(C13:C30)","v":224},{"$f":"SUM(D13:D30)","v":80},{"$f":"SUM(E13:E30)","v":58},{"$f":"SUM(F13:F30)","v":191}]
["Artigas",{"$f":"C13+D13+E13+F13","v":24},12,1,3,8]
["Canelones",116,51,27,0,38]
["Cerro Largo",26,8,3,4,11]
["Colonia",34,14,1,6,13]
["Durazno",20,8,2,1,9]
["Flores",10,3,2,1,4]
["Florida",25,12,2,2,9]
["Lavalleja",19,8,2,2,7]
["Maldonado",44,13,13,4,14]
["Paysandú",38,14,3,9,12]
["Río Negro",20,8,2,5,5]
["Rivera",33,13,5,4,11]
["Rocha",21,11,2,3,5]
["Salto",30,11,5,0,14]
["San José",27,9,3,7,8]
["Soriano",18,9,1,1,7]
["Tacuarembó",30,13,4,4,9]
["Treinta y Tres",18,7,2,2,7]
["Fuente: C.E.S  - CETP- CEIP"]
["Nota: 1- A diferencia del cuadro anterior II-3.1.1, el presente consolida la cantidad de establecimientos físicos con independencia del nivel educativo al cual son dirigidos los programas de estudios impartidos. En el caso del CETP debe considerarse que además de Educación Media se dictan programas dirigidos a Educación Terciaria No Universitaria y Educación de Jóvenes y Adultos. "]
["2- Dentro de la cantidad de establecimientos declarados por UTU en este apartado se encuentran 106 reparticiones (Montevideo=18; Resto del País=88). Son localizaciones en las cuales se imparten cursos administrados por el CETP-UTU. Estos locales no forman parte de los activos de ANEP. "]

{"sheet":"II-3.2.1 ","index":43,"n_rows":27,"n_cols":5,"rows_kept":27,"cut":false,"hidden":false,"merged":[[24,0,24,4],[0,3,1,5],[4,0,4,4],[5,0,7,0],[5,2,6,4],[6,1,7,1]]}
["CONSEJO DE EDUCACIÓN SECUNDARIA",null,null,"ALUMNOS MATRICULADOS"]
[]
["Cuadro Nº II-3.2.1"]
[]
["ALUMNOS MATRICULADOS EN EDUCACION MEDIA BÁSICA GENERAL POR GRADO SEGÚN GRANDES ÁREAS Y FORMA DE ADMINISTRACIÓN. AÑO 2016."]
["GRANDES ÁREAS Y FORMA DE ADMINISTRACIÓN",null,"GRADO"]
[null,"TOTAL"]
[null,null,"PRIMERO","SEGUNDO","TERCERO"]
["TOTAL DEL PAÍS",{"$f":"C9+D9+E9","v":148486},{"$f":"C14+C19","v":52597},47984,47905]
["MEDIA BÁSICA PÚBLICA",122764,43791,39624,39349]
["  Diurna",107392,40145,35317,31930]
["  Nocturna",15372,3646,4307,7419]
["MEDIA BÁSICA PRIVADA",25722,8806,8360,8556]
["TOTAL MONTEVIDEO",54108,{"$f":"C15+C18","v":19495},{"$f":"D15+D18","v":17399},{"$f":"E15+E18","v":17214}]
["MEDIA BÁSICA PÚBLICA",37572,{"$f":"C16+C17","v":13734},{"$f":"D16+D17","v":12053},{"$f":"E16+E17","v":11785}]
["  Diurna",32468,12581,10559,9328]
["  Nocturna",5104,1153,1494,2457]
["MEDIA BÁSICA PRIVADA",16536,5761,5346,5429]
["TOTAL RESTO DEL PAÍS",94378,{"$f":"C20+C23","v":33102},{"$f":"D20+D23","v":30585},{"$f":"E20+E23","v":30691}]
["MEDIA  BÁSICA PÚBLICA",85192,{"$f":"C21+C22","v":30057},{"$f":"D21+D22","v":27571},{"$f":"E21+E22","v":27564}]
["  Diurna",74924,27564,24758,22602]
["  Nocturna",10268,2493,2813,4962]
["MEDIA BÁSICA PRIVADA",9186,3045,3014,3127]
["Fuente: D.E. — C.E.S."]
["Nota: La referencia \"Privada\", (incluye los Habilitados \"Liceo Naval\" y \"Liceo Militar\"), se corresponde con la de \"Liceos Habilitados\" presente en ediciones anteriores del Anuario Estadístico del MEC."]
[]
["        "]

{"sheet":"II-3.2.2","index":44,"n_rows":35,"n_cols":20,"rows_kept":35,"cut":false,"hidden":false,"merged":[[9,17,12,17],[9,18,9,19],[10,18,10,19],[11,18,12,18],[11,19,12,19],[9,14,12,14],[9,15,9,16],[10,15,10,16],[11,15,12,15],[11,16,12,16],[10,12,10,13],[11,3,12,3],[11,4,12,4],[11,6,12,6],[11,7,12,7],[11,9,12,9],[11,10,12,10],[11,12,12,12],[11,13,12,13],[0,7,1,9],[5,0,6,8],[8,0,12,0],[8,1,12,1],[8,3,8,13],[9,2,12,2],[9,3,9,4],[9,5,12,5],[9,6,9,7],[9,8,12,8],[9,9,9,10],[9,11,12,11],[9,12,9,13],[10,3,10,4],[10,6,10,7],[10,9,10,10]]}
["CONSEJO DE EDUCACIÓN TÉCNICO PROFESIONAL (U.T.U.)",null,null,null,null,null,null,"ALUMNOS MATRICULADOS"]
[]
[]
[]
["Cuadro II-3.2.2."]
["ALUMNOS MATRICULADOS EN EL CETP EN EDUCACIÓN MEDIA BÁSICA TECNOLÓGICA POR TIPO DE CURSO SEGÚN  GRANDES ÁREAS, DEPARTAMENTO Y SEXO. AÑO 2016."]
[]
[]
["GRANDES ÁREAS,DEPARTAMENTO  Y SEXO ","TOTAL ",null,"EDUCACIÓN MEDIA BÁSICA TECNOLÓGICA "]
[null,null,"TOTAL ","Articulación Ed.Media Básica",null,"TOTAL","C. B. T. Agrario",null,"TOTAL","Ciclo Básico Tecnológico",null,"TOTAL ","Formación Profesional Básica 2007",null,"TOTAL ","Articulación otras",null,"TOTAL ","Programa Centros Educ.Comunitarios "]
[null,null,null,"Sexo",null,null,"Sexo",null,null,"Sexo",null,null,"Sexo",null,null,"Sexo",null,null,"Sexo"]
[null,null,null,"M","F",null,"M","F",null,"M","F",null,"M","F",null,"M","F",null,"M","F"]
[]
["TOTAL ",{"$f":"C14+F14+I14+L14+O14+R14","v":32185},{"$f":"SUM(C15:C16)","v":1112},486,626,1936,{"$f":"G15+G16","v":1347},{"$f":"H15+H16","v":589},16472,9693,6779,11790,7254,4536,{"$f":"P14+Q14","v":340},187,153,{"$f":"S14+T14","v":535},350,185]
["Montevideo",{"$f":"C15+F15+I15+L15+O15+R15","v":6985},{"$f":"+D15+E15","v":271},146,125,{"$f":"+G15+H15","v":155},102,53,{"$f":"+J15+K15","v":2744},1641,1103,{"$f":"+M15+N15","v":3324},1981,1343,{"$f":"P15+Q15","v":76},33,43,{"$f":"S15+T15","v":415},263,152]
["Resto del País ",25200,{"$f":"SUM(C17:C34)","v":841},340,501,1781,1245,536,13728,8052,5676,8466,5273,3193,{"$f":"P16+Q16","v":264},{"$f":"SUM(P17:P34)","v":154},{"$f":"SUM(Q17:Q34)","v":110},120,{"$f":"SUM(S17:S34)","v":87},{"$f":"SUM(T17:T34)","v":33}]
["Artigas",1216,{"$f":"+D17+E17","v":38},22,16,{"$f":"+G17+H17","v":43},30,13,{"$f":"+J17+K17","v":740},457,283,{"$f":"+M17+N17","v":358},180,178,37,9,28,0,0,0]
["Canelones",5694,280,114,166,84,53,31,2654,1532,1122,2629,1551,1078,47,23,24,0,0,0]
["Cerro Largo",1580,70,24,46,106,74,32,970,567,403,434,262,172,0,0,0,0,0,0]
["Colonia",1687,58,23,35,107,83,24,1176,698,478,329,206,123,17,12,5,0,0,0]
["Durazno",1233,0,0,0,152,99,53,788,463,325,293,181,112,0,0,0,0,0,0]
["Flores",217,0,0,0,0,0,0,80,80,null,137,94,43,0,0,0,0,0,0]
["Florida",697,34,16,18,0,0,0,279,163,116,367,217,150,17,13,4,0,0,0]
["Lavalleja",573,25,8,17,111,76,35,140,75,65,297,174,123,0,0,0,0,0,0]
["Maldonado",1714,46,25,21,69,39,30,1062,604,458,417,272,145,0,0,0,120,87,33]
["Paysandú",1717,0,0,0,310,206,104,769,475,294,581,410,171,57,43,14,0,0,0]
["Rio Negro",807,0,0,0,44,40,4,480,294,186,260,179,81,23,16,7,0,0,0]
["Rivera",1228,0,0,0,235,181,54,570,359,211,405,287,118,18,10,8,0,0,0]
["Rocha",782,29,14,15,51,38,13,421,225,196,281,180,101,0,0,0,0,0,0]
["Salto",1396,125,49,76,169,106,63,692,370,322,384,241,143,26,14,12,0,0,0]
["San José",1623,52,18,34,91,69,22,1153,654,499,327,210,117,0,0,0,0,0,0]
["Soriano",1523,57,17,40,104,83,21,959,553,406,403,279,124,0,0,0,0,0,0]
["Tacuarembó",998,27,10,17,15,9,6,540,333,207,416,249,167,0,0,0,0,0,0]
["Treinta y Tres",515,0,0,0,90,59,31,255,150,105,148,101,47,22,14,8,0,0,0]
["Fuente: Procesamiento propio en base a datos proporcionados por el D.E. - CETP  (U.T.U) ."]

{"sheet":"II-3.2.3","index":45,"n_rows":36,"n_cols":13,"rows_kept":36,"cut":false,"hidden":false,"merged":[[0,8,1,13],[5,0,5,12],[6,0,11,0],[6,1,9,3],[6,4,6,12],[7,4,7,12],[8,4,8,6],[8,7,8,9],[8,10,8,12],[9,4,9,6],[10,1,11,1],[10,2,11,2],[10,3,11,3],[10,12,11,12],[9,7,9,9],[9,10,9,12],[10,4,11,4],[10,5,11,5],[10,9,11,9],[10,10,11,10],[10,11,11,11],[10,6,11,6],[10,7,11,7],[10,8,11,8]]}
["CONSEJO DE EDUCACIÓN PRIMARIA",null,null,null,null,null,null,null,"ALUMNOS MATRICULADOS"]
[]
["Cuadro Nº II-3.2.3"]
[]
[]
["ALUMNOS MATRICULADOS EN SÉPTIMO, OCTAVO Y NOVENO GRADO DE CICLO BÁSICO RURAL POR SEXO SEGÚN DEPARTAMENTO. AÑO 2016."]
["DEPARTAMENTO","TOTAL",null,null,"CICLO BÁSICO RURAL"]
[null,null,null,null,"GRADO"]
[null,null,null,null,"SÉPTIMO",null,null,"OCTAVO",null,null,"NOVENO"]
[null,null,null,null,"SEXO",null,null,"SEXO",null,null,"SEXO"]
[null,"T","M","F","T","M","F","T","M","F","T","M","F"]
[]
["TOTAL",{"$f":"B14+B15","v":1583},{"$f":"F13+I13+L13","v":840},743,{"$f":"F13+G13","v":573},{"$f":"F14+F15","v":318},{"$f":"G14+G15","v":255},{"$f":"I13+J13","v":522},{"$f":"I14+I15","v":274},{"$f":"J14+J15","v":248},{"$f":"L13+M13","v":488},{"$f":"L14+L15","v":248},{"$f":"M14+M15","v":240}]
["MONTEVIDEO",0,0,0,{"$f":"F14+G14","v":0},null,null,{"$f":"I14+J14","v":0},null,null,{"$f":"L14+M14","v":0}]
["RESTO DEL PAÍS",{"$f":"E15+H15+K15","v":1583},840,{"$f":"G15+J15+M15","v":743},{"$f":"F15+G15","v":573},{"$f":"SUM(F16:F33)","v":318},{"$f":"SUM(G16:G33)","v":255},{"$f":"I15+J15","v":522},{"$f":"SUM(I16:I33)","v":274},{"$f":"SUM(J16:J33)","v":248},{"$f":"L15+M15","v":488},{"$f":"SUM(L16:L33)","v":248},{"$f":"SUM(M16:M33)","v":240}]
["Artigas",127,70,57,{"$f":"F16+G16","v":35},19,16,38,22,16,54,29,25]
["Canelones",{"$f":"E17+H17+K17","v":0},{"$f":"F17+I17+L17","v":0},{"$f":"G17+J17+M17","v":0},0,0,0,0,0,0,0,0,0]
["Cerro Largo",87,43,44,41,18,23,26,16,10,20,9,11]
["Colonia",171,94,77,50,30,20,62,34,28,59,30,29]
["Durazno",31,16,15,16,11,5,7,3,4,8,2,6]
["Flores",13,7,6,4,1,3,5,3,2,4,3,1]
["Florida",38,32,23,22,14,8,16,6,10,null,12,5]
["Lavalleja",67,41,26,29,21,8,25,13,12,13,7,6]
["Maldonado",58,32,26,17,9,8,16,9,7,25,14,11]
["Paysandú",288,144,144,116,57,59,98,52,46,74,35,39]
["Río Negro",98,46,52,43,22,21,22,11,11,33,13,20]
["Rivera",96,47,49,30,15,15,32,17,15,34,15,19]
["Rocha",75,44,31,29,17,12,28,16,12,18,11,7]
["Salto",0,0,0,0,0,0,0,0,0,0,0,0]
["San José",178,100,78,50,30,20,66,33,33,62,37,25]
["Soriano",61,33,28,29,21,8,16,6,10,16,6,10]
["Tacuarembó",119,66,53,41,22,19,47,27,20,31,17,14]
["Treinta y Tres",59,25,34,21,11,10,18,6,12,20,8,12]
["Fuente: DE — CES"]
[]
["Nota: No se tienen datos por sexo"]

{"sheet":"II-3.2.4","index":46,"n_rows":33,"n_cols":7,"rows_kept":33,"cut":false,"hidden":false,"merged":[[0,4,1,6],[4,0,4,6],[6,0,9,0],[6,1,6,6],[7,1,7,2],[7,3,7,4],[7,5,7,6],[8,1,8,6]]}
["CONSEJO DE EDUCACIÓN SECUNDARIA",null,null,null,"ALUMNOS MATRICULADOS"]
[]
["Cuadro Nº II-3.2.4"]
[]
["ALUMNOS MATRICULADOS DE EDUCACIÓN MEDIA BÁSICA GENERAL  POR GRADO Y FORMA DE ADMINISTRACIÓN SEGÚN DEPARTAMENTO. AÑO 2016."]
[]
["DEPARTAMENTO","GRADO"]
[null,"PRIMERO",null,"SEGUNDO",null,"TERCERO"]
[null,"FORMA DE ADMINISTRACIÓN"]
[null,"Públicos","Privados","Públicos","Privados","Públicos","Privados"]
["TOTAL",{"$f":"B12+B13","v":43791},8806,39624,8360,{"$f":"F12+F13","v":39349},8556]
["MONTEVIDEO",13734,5761,12053,5346,11785,5429]
["RESTO DEL PAÍS",{"$f":"SUM(B14:B31)","v":30057},3045,27571,3014,27564,3127]
["Artigas",1176,29,1171,15,1223,19]
["Canelones",7961,1113,7117,1106,7109,1159]
["Cerro Largo",1156,128,1084,129,1157,129]
["Colonia",1644,22,1572,29,1546,10]
["Durazno",738,102,776,95,737,92]
["Flores",407,52,397,57,339,42]
["Florida",899,66,846,64,838,85]
["Lavalleja",871,52,786,60,762,51]
["Maldonado",2322,430,2313,456,2245,493]
["Paysandú",1582,206,1378,191,1421,204]
["Río Negro",784,48,759,42,743,46]
["Rivera",2120,62,1769,84,1790,101]
["Rocha",1200,56,1114,61,1245,60]
["Salto ",1821,262,1868,236,1749,232]
["San José",1597,126,1292,151,1359,131]
["Soriano",1337,72,1074,57,1108,65]
["Tacuarembó",1633,139,1492,105,1493,134]
["Treinta y Tres",809,80,763,76,700,74]
["Fuente: DE — CES"]
["Nota: Incluye la matrícula correspondiente a los liceos de cuarto turno (nocturnos). "]

{"sheet":"II-3.2.5","index":47,"n_rows":32,"n_cols":7,"rows_kept":32,"cut":false,"hidden":false,"merged":[[3,0,3,6],[5,0,8,0],[5,1,5,6],[6,1,6,2],[6,3,6,4],[6,5,6,6],[7,1,7,6]]}
["CONSEJO DE EDUCACIÓN SECUNDARIA"]
["Cuadro Nº II-3.2.5"]
[]
["ALUMNOS MATRICULADOS DE EDUCACIÓN MEDIA BÁSICA PRIVADA  POR GRADO Y SEXO SEGÚN DEPARTAMENTO. AÑO 2016."]
[]
["DEPARTAMENTO","GRADO"]
[null,"PRIMERO",null,"SEGUNDO",null,"TERCERO"]
[null,"SEXO"]
[null,"Mujeres","Varones","Mujeres","Varones","Mujeres","Varones"]
["TOTAL",{"$f":"B11+B12","v":4378},4393,4237,4087,4295,4210]
["MONTEVIDEO",2875,2849,2673,2642,2702,2693]
["RESTO DEL PAÍS",{"$f":"SUM(B13:B30)","v":1503},1544,1564,1445,1593,1517]
["Artigas",15,14,9,6,11,8]
["Canelones",555,558,575,531,600,559]
["Cerro Largo",54,74,65,64,68,61]
["Colonia",9,13,16,13,4,6]
["Durazno",45,57,48,47,43,49]
["Flores",28,24,38,19,23,19]
["Florida",33,33,39,25,47,38]
["Lavalleja",30,22,24,36,23,28]
["Maldonado",190,240,237,219,231,262]
["Paysandú",101,113,91,100,91,113]
["Río Negro",20,28,21,21,26,20]
["Rivera",25,31,32,47,49,35]
["Rocha",30,26,29,32,33,27]
["Salto ",146,116,129,107,125,107]
["San José",72,54,82,69,66,65]
["Soriano",32,40,33,24,37,28]
["Tacuarembó",76,63,54,51,76,58]
["Treinta y Tres",42,38,42,34,40,34]
["Fuente: DE — CES"]
["Nota: Las diferencias con la matrícula de otros cuadros se debe a la ausencia de información sobre sexo en colegios de Montevideo, Paysandù y Rivera."]

{"sheet":"II-3.2.6","index":48,"n_rows":32,"n_cols":7,"rows_kept":32,"cut":false,"hidden":false,"merged":[[3,0,3,6],[5,0,8,0],[5,1,5,6],[6,1,6,2],[6,3,6,4],[6,5,6,6],[7,1,7,6]]}
["CONSEJO DE EDUCACIÓN SECUNDARIA"]
["Cuadro Nº II-3.2.6"]
[]
["ALUMNOS MATRICULADOS DE EDUCACIÓN MEDIA BÁSICA PÚBLICA  POR GRADO Y SEXO SEGÚN DEPARTAMENTO. AÑO 2016."]
[]
["DEPARTAMENTO","GRADO"]
[null,"PRIMERO",null,"SEGUNDO",null,"TERCERO"]
[null,"SEXO"]
[null,"Mujeres","Varones","Mujeres","Varones","Mujeres","Varones"]
["TOTAL",{"$f":"B11+B12","v":19924},20221,18715,16602,16804,15126]
["MONTEVIDEO",6254,6327,5558,5001,4831,4497]
["RESTO DEL PAÍS",{"$f":"SUM(B13:B30)","v":13670},{"$f":"SUM(C13:C30)","v":13894},13157,11601,11973,10629]
["Artigas",563,584,598,515,561,527]
["Canelones",3506,3676,3244,3061,2978,2645]
["Cerro Largo",569,527,536,469,522,444]
["Colonia",776,716,724,639,659,557]
["Durazno",337,316,367,297,345,247]
["Flores",189,174,192,159,155,114]
["Florida",449,434,423,397,394,376]
["Lavalleja",400,429,375,338,344,331]
["Maldonado",1085,1040,1066,1040,966,914]
["Paysandú",743,770,723,574,686,538]
["Río Negro",372,373,378,310,343,272]
["Rivera",914,975,835,725,747,704]
["Rocha",531,533,515,449,474,483]
["Salto ",824,924,909,840,792,781]
["San José",689,694,593,473,475,439]
["Soriano",620,578,543,411,510,392]
["Tacuarembó",755,789,746,619,713,605]
["Treinta y Tres",348,362,390,285,309,260]
["Fuente: DE — CES"]
["Nota: No incluye la matrícula correspondiente a los liceos de cuarto turno (nocturnos)"]

{"sheet":"II-3.2.7","index":49,"n_rows":21,"n_cols":8,"rows_kept":21,"cut":false,"hidden":false,"merged":[[20,0,20,4],[0,4,1,5],[4,0,4,3],[6,0,7,0],[6,1,7,1],[6,2,6,5]]}
["CONSEJO DE EDUCACIÓN TÉCNICO PROFESIONAL (U.T.U.)",null,null,null,"ALUMNOS MATRICULADOS"]
[]
["Cuadro Nº II-3.2.7"]
[]
["ALUMNOS MATRICULADOS EN EDUCACIÓN TÉCNICA MEDIA BÁSICA POR TIPO DE CURSO SEGÚN EDAD. AÑO 2016."]
[]
["EDAD","TOTAL","TIPO DE CURSO"]
[null,null,"Articulación Educación Media Básica","C.T.B Agrario","Ciclo Básico Tecnológico","Formación Profesional Básica\nPlan 2007","Articulación Otras","Programas Centros educ. comunitarios "]
["TOTAL",{"$f":"C9+D9+E9+F9+G9+H9","v":32250},{"$f":"SUM(C10:C20)","v":1112},340,1936,16537,11790,535]
["11 y 12 años ",{"$f":"C10+D10+E10+F10+G10+H10","v":3617},0,0,431,3158,4,24]
["13 años ",5696,0,0,641,4954,26,75]
["14 años ",6344,0,24,523,4805,856,136]
["15 años ",5262,0,78,215,2259,2562,148]
["16 años ",4592,3,89,94,956,3331,119]
["17 años ",3115,6,68,22,304,2683,32]
["18 años ",1342,64,25,6,64,1182,1]
["19 años ",520,63,14,4,17,422,0]
["20 a 24 años ",757,272,27,0,18,440,0]
["25 a 29 años ",291,173,7,0,2,109,0]
["30 años y más ",714,531,8,0,0,175,0]
["Fuente : Procesamiento propio en base a datos proporcionados por el D.E.-CETP (U.T.U.) "]

{"sheet":"II-3.2.8 ","index":50,"n_rows":36,"n_cols":8,"rows_kept":36,"cut":false,"hidden":false,"merged":[[35,0,35,4],[0,2,1,3],[6,1,7,1],[5,0,5,5],[6,2,6,7],[6,0,8,0]]}
["CONSEJO DE EDUCACIÓN TÉCNICO PROFESIONAL (U.T.U.)",null,"ALUMNOS MATRICULADOS"]
[]
[]
["Cuadro Nº II-3.2.8."]
[]
["ALUMNOS MATRICULADOS EN EL CETP EN EDUCACIÓN MEDIA BÁSICA POR TIPO DE CURSO SEGÚN SECTORES DE ESTUDIO. AÑO 2016."]
["SECTORES DE ESTUDIO","TOTAL","TIPO DE CURSO"]
[null,null,"Articulación Educación Media","CTB AGRARIO ","Ciclo Básico Tecnológico","Formación Profesional Básica Plan 2007","Articulación Otras","Programas Centros educ. Comuniotarios "]
[]
["Prog. Ciclo Básico. Educación Media",{"$f":"C10+D10+E10+F10+G10+H10","v":32250},{"$f":"SUM(C11:C31)","v":1112},{"$f":"SUM(D11:D31)","v":1936},{"$f":"SUM(E11:E31)","v":16537},{"$f":"SUM(F11:F33)","v":11790},{"$f":"SUM(G11:G33)","v":340},{"$f":"SUM(H11:H33)","v":535}]
["Agropecuario",{"$f":"C11+D11+E11+F11+G11+H11","v":209},0,0,0,209,0,0]
["Artes Escénicas",49,0,0,0,49,0,0]
["Comunicación",329,0,0,0,329,0,0]
["Construcción y Arquitectura",470,0,0,0,434,36,0]
["Deporte y afines",34,0,0,0,0,34,0]
["Deporte y Afines",1186,0,0,0,1186,0,0]
["Electricidad y Electrónica",1265,0,0,0,1262,3,0]
["Gastronomía",1984,0,0,0,1948,36,0]
["Gráficos",45,0,0,0,45,0,0]
["Hipica",62,0,0,0,62,0,0]
["Hortifruticultura y Jardinería",122,0,0,0,122,0,0]
["Informática",1218,0,0,0,1218,0,0]
["Madera y Muebles",1170,0,0,0,1164,6,0]
["Mantenimiento y Rep. de Vehículos",1173,0,0,0,1173,0,0]
["Metal - Mecánica",488,0,0,0,488,0,0]
["Producción de Alimentos",359,0,0,0,359,0,0]
["Programa Articulación Rumbo y Otras",1313,1112,0,0,0,201,0]
["Programa Ciclo Básico Agrario",1936,0,1936,0,0,0,0]
["Programa Educación Media Básica",16537,0,0,16537,0,0,0]
["Química, Termodinámica y Agroener.",609,0,0,0,74,0,535]
["Sector no especificado",0,0,0,0,0,0,0]
["Servicios Personales",1455,0,0,0,1435,20,0]
["Textil y Confección de Vestimenta",237,0,0,0,233,4]
[]
[]
["Fuente : Procesamiento propio en base a datos proporcionados por el D.E.-CETP (U.T.U.) "]

{"sheet":"II-3.3.1 ","index":51,"n_rows":51,"n_cols":7,"rows_kept":51,"cut":false,"hidden":false,"merged":[[0,5,1,6],[4,0,4,6],[6,0,7,0],[6,1,7,1],[6,2,6,3],[6,4,7,4],[6,5,6,6]]}
["CONSEJO DE EDUCACIÓN SECUNDARIA",null,null,null,null,"PERSONAL DOCENTE"]
[]
["Cuadro Nº II-3.3.1."]
[]
["PERSONAL DOCENTE Y HORAS DOCENTES DEL CES EN EDUACIÓN MEDIA BÁSICA GENERAL POR TITULACIÓN SEGÚN ASIGNATURAS. AÑO 2016."]
[]
["ASIGNATURAS","TOTAL DOCENTES","PERSONAL DOCENTE",null,"TOTAL HORAS ","HORAS DOCENTES"]
[null,null,"Titulados","No Titulados",null,"Titulados","No Titulados"]
["TOTAL",{"$f":"SUM(C9:D9)","v":16722},{"$f":"SUM(C10:C47)","v":9473},{"$f":"SUM(D10:D47)","v":7249},{"$f":"SUM(F9:G9)","v":236411},{"$f":"SUM(F10:F47)","v":141115},{"$f":"SUM(G10:G47)","v":95296}]
["ACT.ADAPTADAS AL MEDIO AMBIENT",66,11,55,674,98,576]
["ALEMÁN",7,0,7,156,0,156]
["ASTRONOMÍA",193,56,137,2447,636,1811]
["BIOLOGÍA",1421,1068,353,17810,14773,3037]
["CONTABILIDAD",3,1,2,11,2,9]
["DIBUJO",845,496,349,12983,8529,4454]
["DIRECTOR DE COROS",138,73,65,1884,1100,784]
["ECONOMÍA",1,0,1,1,0,1]
["ED.SOCIAL Y CÍVICA DERECHO",{"$f":"SUM(C18:D18)","v":536},436,100,{"$f":"SUM(F18:G18)","v":4549},3924,625]
["EDUCACIÓN FÍSICA",1166,954,212,16305,14239,2066]
["EDUCACIÓN MUSICAL",593,135,458,9000,2208,6792]
["EDUCADOR PARA LA SEXUALIDAD",46,35,11,500,380,120]
["ESPACIO CURRICULAR ABIERTO",669,236,433,5494,1867,3627]
["ESTUDIOS ECONÓMICOS Y SOCIALES",0,0,0,0,0,0]
["EXPRESIÓN CORPORAL Y DANZA",5,1,4,43,9,34]
["EXPRESIÓN CORPORAL Y TEATRO",4,0,4,20,0,20]
["FILOSOFÍA",428,305,123,4782,3682,1100]
["FÍSICA",656,277,379,8273,4001,4272]
["FRANCÉS",54,15,39,1153,318,835]
["GEOGRAFÍA",899,667,232,13258,10827,2431]
["GEOLOGÍA",3,3,0,28,28,0]
["HISTORIA",1578,1271,307,19978,17367,2611]
["IDIOMA ESPAÑOL",1209,820,389,19958,14436,5522]
["INFORMÁTICA",902,146,756,14293,2166,12127]
["INGLÉS",1377,524,853,23800,10491,13309]
["ITALIANO",63,19,44,1190,370,820]
["LABORATORIO DE INFORMÁTICA",376,68,308,6382,952,5430]
["LENG.COM.Y MED.AUDIOVISUALES",7,1,6,83,16,67]
["LENGUA DE SEÑAS",12,2,10,243,47,196]
["LITERATURA",873,657,216,11210,9088,2122]
["MANUALIDADES",1,0,1,6,0,6]
["MATEMÁTICA",1610,622,988,28784,12407,16377]
["PIANISTA ACOMPAÑANTE",119,50,69,1373,659,714]
["PORTUGUÉS",{"$f":"SUM(C43:D43)","v":80},30,50,{"$f":"SUM(F43:G43)","v":1185},495,690]
["QUÍMICA",779,494,285,8540,6000,2540]
["REC.NATUR.Y PAISAJE AGRARIO",0,0,0,0,0,0]
["TALLER EXPR.PLÁSTICA-ARTÍSTICA",1,0,1,3,0,3]
["TEATRO",2,0,2,12,0,12]
["Fuente: Departamento de Estadística — C.E.S."]
["Nota: Los docentes que dictan más de una asignatura son considerados como personas distintas en cada asignatura."]
["En 2019 la DIEE de la ANEP corrigió el dato"]
["Datos verificados por la DIEE de la ANEP en 2019."]

{"sheet":"II-3.3.2","index":52,"n_rows":15,"n_cols":5,"rows_kept":15,"cut":false,"hidden":false,"merged":[[0,4,1,5],[4,0,4,3],[5,0,6,0],[5,1,6,1]]}
["CONSEJO DE EDUCACIÓN TÉCNICO PROFESIONAL (U.T.U.)",null,null,null,"PERSONAL DOCENTE"]
[]
["Cuadro Nº II-3.3.2."]
[]
["PERSONAL DOCENTE DEL CETP EN EDUCACIÓN MEDIA BÁSICA TECNOLÓGICA POR TIPO DE CURSO. AÑO 2016."]
["EDUCACIÓN MEDIA BÁSICA","TOTAL"]
[]
[]
["TOTAL",{"$f":"SUM(B10:B13)","v":7216}]
["Ciclo Básico Tecnológico",3952]
["Ciclo Básico Tecnológico Agrario","S/D"]
["Formación Profesional Básica Plan 2007",2854]
["Articulación Educ.Media Básica",410]
["Fuente: U.T.U. División Informática."]
["Nota: publicamos último dato disponible correspondiente al año 2015"]

{"sheet":"II-3.4.1","index":53,"n_rows":26,"n_cols":4,"rows_kept":26,"cut":false,"hidden":false,"merged":[[26,0,26,2],[0,3,1,4],[4,0,4,2],[5,0,8,0],[5,1,6,2],[7,1,8,1],[7,2,8,2],[7,3,8,3]]}
["CONSEJO DE EDUCACIÓN SECUNDARIA",null,null,"GRUPOS"]
[]
["Cuadro Nº II-3.4.1."]
[]
["GRUPOS DEL CES EN EDUCACIÓN MEDIA BÁSICA GENERAL  COMPARADOS CON EL TOTAL DE GRUPOS EN EDUCACIÓN MEDIA GENERAL SEGÚN GRANDES ÁREAS Y FORMA DE ADMINISTRACIÓN. AÑO 2016."]
["GRANDES ÁREAS Y FORMA DE ADMINISTRACIÓN","FORMA DE ADMINISTRACIÓN"]
[]
[null,"Grupos en Educación Media Básica General ","Total de grupos en Educación Media General","Promedio alumnos por grupo de Media Básica"]
[]
["TOTAL DEL PAÍS",{"$f":"B15+B20","v":5648},{"$f":"C15+C20","v":10286},{"$f":"'II-3.2.1 '!B9/'II-3.4.1'!B10","v":26.290014164305948}]
["MEDIA BÁSICA PÚBLICA",{"$f":"B12+B13","v":4560},{"$f":"C12+C13","v":8035},{"$f":"'II-3.2.1 '!B10/'II-3.4.1'!B11","v":26.921929824561403}]
["  Diurna",{"$f":"B17+B22","v":4080},{"$f":"C17+C22","v":6833},{"$f":"'II-3.2.1 '!B11/'II-3.4.1'!B12","v":26.321568627450979}]
["  Cuarto Turno",480,{"$f":"C18+C23","v":1202},{"$f":"'II-3.2.1 '!B12/'II-3.4.1'!B13","v":32.024999999999999}]
["MEDIA BÁSICA PRIVADA",1088,2251,{"$f":"'II-3.2.1 '!B13/'II-3.4.1'!B14","v":23.641544117647058}]
["TOTAL MONTEVIDEO",{"$f":"B16+B19","v":1989},{"$f":"C16+C19","v":3775},{"$f":"'II-3.2.1 '!B14/'II-3.4.1'!B15","v":27.203619909502262}]
["MEDIA BÁSICA PÚBLICA",{"$f":"B17+B18","v":1314},{"$f":"C17+C18","v":2281},{"$f":"'II-3.2.1 '!B15/'II-3.4.1'!B16","v":28.593607305936072}]
["  Diurna",1169,{"$f":"B17+'II-4.4.1'!B15","v":1831},{"$f":"'II-3.2.1 '!B16/'II-3.4.1'!B17","v":27.774165953806673}]
["  Cuarto Turno",145,{"$f":"B18+'II-4.4.1'!B16","v":450},{"$f":"'II-3.2.1 '!B17/'II-3.4.1'!B18","v":35.200000000000003}]
["MEDIA BÁSICA  PRIVADA",675,1494,{"$f":"'II-3.2.1 '!B18/'II-3.4.1'!B19","v":24.497777777777777}]
["TOTAL RESTO DEL PAÍS",{"$f":"B21+B24","v":3659},{"$f":"C21+C24","v":6511},{"$f":"'II-3.2.1 '!B19/'II-3.4.1'!B20","v":25.793386171084997}]
["MEDIA BÁSICA PÚBLICA",{"$f":"B22+B23","v":3246},{"$f":"C22+C23","v":5754},{"$f":"'II-3.2.1 '!B20/'II-3.4.1'!B21","v":26.245224892174985}]
["  Diurna",2911,{"$f":"B22+'II-4.4.1'!B20","v":5002},{"$f":"'II-3.2.1 '!B21/'II-3.4.1'!B22","v":25.738234283751289}]
["  Cuarto Turno",335,{"$f":"B23+'II-4.4.1'!B21","v":752},{"$f":"'II-3.2.1 '!B22/'II-3.4.1'!B23","v":30.650746268656718}]
["MEDIA  BÁSICA PRIVADA",413,757,{"$f":"'II-3.2.1 '!B23/'II-3.4.1'!B24","v":22.242130750605327}]
[]
["Fuente: D.E. — C.E.S."]

{"sheet":"MEDIA SUPERIOR ","index":54,"n_rows":143,"n_cols":2,"rows_kept":143,"cut":false,"hidden":false,"merged":[]}
[]
[]
[]
[]
[]
[]
[]
["Cuadro Nº II-4.1.1","ESTABLECIMIENTOS DE EDUCACIÓN MEDIA SUPERIOR POR MODALIDAD Y FORMA DE ADMINISTRACIÓN SEGÚN DEPARTAMENTO. AÑO 2016. "]
[""]
[""]
["Cuadro Nº II-4.2.1","ALUMNOS MATRICULADOS  DEL CES  EN EDUCACIÓN MEDIA SUPERIOR  GENERAL POR GRADO SEGÚN GRANDES ÁREAS Y FORMA DE ADMINISTRACIÓN. AÑO 2016. "]
[""]
["Cuadro Nº II-4.2.2","ALUMNOS MATRICULADOS EN EL CETP EN EDUCACIÓN MEDIA SUPERIOR TECNOLÓGICA POR TIPO DE CURSO SEGÚN GRANDES ÁREAS, DEPARTAMENTO Y SEXO. AÑO 2016. "]
[""]
["Cuadro Nº II-4.2.3","ALUMNOS MATRICULADOS EN EL CETP EN EDUCACIÓN MEDIA SUPERIOR POR TIPO DE CURSO SEGÚN EDAD. AÑO 2016. "]
[""]
["Cuadro Nº II-4.2.4","ALUMNOS MATRICULADOS EN EL CETP EN EDUCACIÓN MEDIA SUPERIOR TECNOLÓGICA POR TIPO DE CURSO SEGÚN SECTORES DE ESTUDIO. AÑO 2016. "]
[""]
["Cuadro Nº II-4.2.5","ALUMNOS MATRICULADOS EN EL CES EN EDUCACIÓN MEDIA SUPERIOR GENERAL POR GRADO Y FORMA DE ADMINISTRACIÓN SEGÚN DEPARTAMENTO. AÑO 2016. "]
[""]
["Cuadro Nº II-4.2.6","ALUMNOS MATRICULADOS EN EL CES EN QUINTO GRADO DE EDUCACIÓN MEDIA GENERAL PÚBLICA POR PLAN Y ORIENTACIÓN SEGÚN DEPARTAMENTO. AÑO 2016. "]
[""]
["Cuadro Nº II-4.2.7","ALUMNOS MATRICULADOS EN EL CES EN QUINTO GRADO DE EDUCACIÓN MEDIA SUPERIOR DE EDUCACIÓN SECUNDARIA PRIVADA POR ORIENTACIÓN SEGÚN DEPARTAMENTO. AÑO 2016. "]
[""]
["Cuadro Nº II-4.2.8","ALUMNOS MATRICULADOS EN EL CES EN SEXTO GRADO DE EDUCACIÓN MEDIA GENERAL PÚBLICA POR PLAN Y OPCIÓN SEGÚN DEPARTAMENTO. AÑO 2016. "]
[""]
["Cuadro Nº II-4.2.9","ALUMNOS MATRICULADOS EN EL CES EN SEXTO GRADO DE EDUCACIÓN MEDIA GENERAL PRIVADA POR OPCIÓN SEGÚN DEPARTAMENTO. AÑO 2016."]
[""]
["Cuadro Nº II-4.2.10","ALUMNOS MATRICULADOS DE EDUCACIÓN MEDIA SUPERIOR PRIVADA  POR GRADO Y SEXO SEGÚN DEPARTAMENTO. AÑO 2016"]
[""]
["Cuadro Nº II-4.2.11","ALUMNOS MATRICULADOS DE EDUCACIÓN MEDIA SUPERIOR PRIVADA  POR GRADO Y SEXO SEGÚN DEPARTAMENTO. AÑO 2016."]
[""]
[""]
["Cuadro Nº II-4.3.1","PERSONAL DOCENTE Y HORAS DOCENTES DEL CES EN EDUCACIÓN MEDIA SUPERIOR GENERAL PÚBLICA POR CONDICIÓN DE TITULACIÓN. AÑO 2016."]
[""]
["Cuadro Nº II-4.3.2","PERSONAL DOCENTE DEL CETP EN EDUCACIÓN MEDIA SUPERIOR TECNOLÓGICA POR TIPO DE CURSO. AÑO 2016."]
[""]
[""]
["Cuadro Nº II-4.4.1","GRUPOS DE EDUCACIÓN MEDIA SUPERIOR GENERAL COMPARADOS CON EL TOTAL DE AMBOS CICLOS SEGÚN GRANDES ÁREAS Y FORMA DE ADMINISTRACIÓN. AÑO 2016."]
[""]
[""]
[""]
[""]
[""]
[""]
[""]
[""]
[""]
[""]
[""]
[""]
[""]
[""]
[""]
[""]
[""]
[""]
[""]
[""]
[""]
[""]
[""]
[""]
[""]
[""]
[""]
[""]
[""]
[""]
[""]
[""]
[""]
[""]
[""]
[""]
[""]
[""]
[""]
[""]
[""]
[""]
[""]
[""]
[""]
[""]
[""]
[""]
[""]
[""]
[""]
[""]
[""]
[""]
[""]
[""]
[""]
[""]
[""]
[""]
[""]
[""]
[""]
[""]
[""]
[""]
[""]
[{"$f":"MID(B70,1,20)","v":""}]
[""]
[""]
[""]
[""]
[""]
[""]
[""]
[""]
[""]
[""]
[""]
[""]
[""]
[""]
[""]
[""]
[""]
[""]
[""]
[""]
[""]
[""]
[""]
[""]
[""]
[""]
[""]
[""]
[""]
[""]
[""]
[""]
[""]
[""]
[""]
[""]

{"sheet":"II-4.1.1 ","index":55,"n_rows":39,"n_cols":13,"rows_kept":39,"cut":false,"hidden":false,"merged":[[0,7,1,9],[4,0,4,10],[5,0,13,0],[5,2,5,12],[6,1,13,1],[6,3,6,9],[6,10,6,12],[7,3,7,10],[8,2,13,2],[8,3,9,6],[37,0,37,12],[38,0,39,12],[8,7,13,7],[8,8,12,9],[8,10,13,10],[9,11,12,12],[10,3,12,4],[10,5,12,6]]}
["CONSEJO DE EDUCACIÓN SECUNDARIA (CES) Y CONSEJO DE EDUCACIÓN TÉCNICO PROFESIONAL (UTU)",null,null,null,null,null,null,"ESTABLECIMIENTOS"]
[]
["Cuadro Nº II-4.1.1"]
[]
["ESTABLECIMIENTOS DE EDUCACIÓN MEDIA SUPERIOR POR MODALIDAD Y FORMA DE ADMINISTRACIÓN SEGÚN DEPARTAMENTO. AÑO 2016."]
["DEPARTAMENTO",null,"MODALIDAD"]
[null,"TOTAL GENERAL",null,"CES",null,null,null,null,null,null,"CETP"]
[null,null,null,"FORMA DE ADMINISTRACIÓN"]
[null,null,"TOTAL LICEOS PÚBLICOS","LICEOS PÚBLICOS",null,null,null,"TOTAL LICEOS PRIVADOS","Liceos Privados",null,"TOTAL ESCUELAS DE CBT Y TÉCNICA"]
[null,null,null,null,null,null,null,null,null,null,null,"Escuelas de CBT y Técnica."]
[null,null,null,"Diurnos Oficiales",null,"Extra Edad Oficiales (Nocturno Y Diurno)"]
[]
[]
[null,null,null,"Bachillerato","C.Básico y Bachillerato","Bachillerato","C.Básico y Bachillerato",null,"Bachillerato","C.Básico y Bachillerato",null,"Escuelas de CBT y Técnica.","Reparticiones"]
["TOTAL",{"$f":"C15+H15+K15","v":616},{"$f":"SUM(D15:G15)","v":298},{"$f":"D16+D17","v":42},{"$f":"E16+E17","v":154},{"$f":"F16+F17","v":38},{"$f":"G16+G17","v":64},{"$f":"SUM(I15:J15)","v":164},{"$f":"I16+I17","v":8},{"$f":"J16+J17","v":156},{"$f":"L15+M15","v":154},{"$f":"L16+L17","v":127},{"$f":"M16+M17","v":27}]
["MONTEVIDEO",{"$f":"C16+H16+K16","v":188},{"$f":"SUM(D16:G16)","v":57},17,10,14,16,96,6,90,{"$f":"L16+M16","v":35},31,4]
["RESTO DEL PAÍS",428,{"$f":"SUM(C18:C35)","v":241},{"$f":"SUM(D18:D35)","v":25},{"$f":"SUM(E18:E35)","v":144},{"$f":"SUM(F18:F35)","v":24},{"$f":"SUM(G18:G35)","v":48},68,{"$f":"SUM(I18:I35)","v":2},{"$f":"SUM(J18:J35)","v":66},119,{"$f":"SUM(L18:L35)","v":96},{"$f":"SUM(M18:M35)","v":23}]
["Artigas",19,{"$f":"SUM(D18:G18)","v":11},2,7,1,1,2,0,2,6,4,2]
["Canelones",101,58,8,31,4,15,21,1,20,22,17,5]
["Cerro Largo",18,9,0,7,0,2,3,0,3,6,5,1]
["Colonia",33,20,2,10,3,5,0,0,0,13,10,3]
["Durazno",11,9,1,5,2,1,2,0,2,null,4,1]
["Flores",9,4,0,2,1,1,2,0,2,3,2,1]
["Florida",19,13,1,9,2,1,2,0,2,4,3,1]
["Lavalleja",12,7,0,6,1,0,1,0,1,4,3,1]
["Maldonado",33,13,1,8,0,4,12,1,11,8,7,1]
["Paysandú",21,11,2,7,1,1,2,0,2,8,6,2]
["Río Negro",13,8,1,4,1,2,2,0,2,3,3,0]
["Rivera",20,11,2,7,1,1,3,0,3,6,5,1]
["Rocha",19,12,1,7,1,3,2,0,2,5,5,0]
["Salto",25,14,1,9,3,1,5,0,5,6,4,2]
["San José",22,12,1,6,1,4,3,0,3,7,6,1]
["Soriano",18,11,1,5,2,3,1,0,1,6,6,0]
["Tacuarembó",19,12,1,9,0,2,3,0,3,4,3,1]
["Treinta y Tres",11,6,0,5,0,1,2,0,2,3,3,0]
[]
["Fuente: D.E.- C.E.S ."]
["Nota: 1- Los establecimientos considerados en el Tipo de Educación Escuelas con \"Ciclo Básico Rural” ya fueron considerados en los totales de establecimientos de Educación Primaria por lo cual, si bien se presentan en la columna  correspondiente, no participan en el “Total” del presente cuadro."]
["2- En un mismo establecimiento del CETP coexisten cursos de distintos nivel edcuativo. En este cuadro se exponen las escuelas que dictan cursos de EDUCACIÓN MEDIA SUPERIOR. Se incluyeron reparticiones (localizaciones) que no son establecimientos de activos de ANEP. "]

{"sheet":"II-4.2.1 ","index":56,"n_rows":29,"n_cols":5,"rows_kept":29,"cut":false,"hidden":false,"merged":[[24,0,24,4],[0,2,1,4],[0,7,1,7],[4,0,4,4],[5,0,7,0],[5,1,7,1],[5,2,6,4]]}
["CONSEJO DE EDUCACIÓN SECUNDARIA",null,"ALUMNOS MATRICULADOS"]
[]
["Cuadro Nº II-4.2.1"]
[]
["ALUMNOS MATRICULADOS  DEL CES  EN EDUCACIÓN MEDIA SUPERIOR  GENERAL POR GRADO SEGÚN GRANDES ÁREAS Y FORMA DE ADMINISTRACIÓN. AÑO 2016."]
["GRANDES ÁREAS Y FORMA DE ADMINISTRACIÓN","TOTAL","GRADO"]
[]
[null,null,"CUARTO","QUINTO","SEXTO"]
["TOTAL DEL PAÍS",{"$f":"C9+D9+E9","v":120525},{"$f":"C10+C13","v":44904},{"$f":"D10+D13","v":42319},{"$f":"E10+E13","v":33302}]
["MEDIA SUPERIOR PÚBLICA ",{"$f":"C10+D10+E10","v":103751},{"$f":"C11+C12","v":37880},{"$f":"D11+D12","v":37123},{"$f":"E11+E12","v":28748}]
["  Diurna",{"$f":"C11+D11+E11","v":69365},{"$f":"C16+C21","v":27606},23696,18063]
["  Cuarto Turno",34386,10274,13427,10685]
["MEDIA SUPERIOR PRIVADA",16774,7024,5196,4554]
["TOTAL MONTEVIDEO",46867,{"$f":"C15+C18","v":16735},{"$f":"D15+D18","v":16675},{"$f":"E15+E18","v":13457}]
["MEDIA SUPERIOR PÚBLICA ",34535,{"$f":"C16+C17","v":11884},{"$f":"D16+D17","v":12758},{"$f":"E16+E17","v":9893}]
["  Diurna",20128,7869,7073,5186]
["  Cuarto Turno",14407,4015,5685,4707]
["MEDIA SUPERIOR PRIVADA ",12332,4851,3917,3564]
["TOTAL RESTO DEL PAÍS",73658,{"$f":"C20+C23","v":28169},{"$f":"D20+D23","v":25644},{"$f":"E20+E23","v":19845}]
["MEDIA SUPERIOR PÚBLICA ",69216,{"$f":"C21+C22","v":25996},{"$f":"D21+D22","v":24365},{"$f":"E21+E22","v":18855}]
["  Diurna",49237,19737,16623,12877]
["  Cuarto Turno",19979,6259,7742,5978]
["MEDIA SUPERIOR PRIVADA ",4442,2173,1279,990]
["Fuente: DE — CES"]
["Nota: La referencia \"Privada\" (incluye los Habilitados \"Liceo Naval\" y \"Liceo Militar\"), se corresponde con la de \"Liceos Habilitados\" presente en ediciones anteriores del Anuario Estadístico del MEC"]
["       "]
["        "]
["        "]
["        "]

{"sheet":"II-4.2.2 ","index":57,"n_rows":35,"n_cols":31,"rows_kept":35,"cut":false,"hidden":false,"merged":[[34,0,34,19],[0,7,1,7],[0,10,0,13],[5,0,10,0],[5,1,10,1],[5,2,8,3],[7,4,10,4],[7,5,7,6],[8,8,8,9],[8,11,8,12],[4,0,4,21],[9,5,10,5],[9,6,10,6],[7,7,10,7],[7,8,7,9],[7,10,10,10],[5,4,5,21],[9,20,10,20],[9,21,10,21],[7,19,10,19],[7,20,7,21],[8,17,8,18],[8,20,8,21],[7,17,7,18],[9,17,10,17],[9,18,10,18],[7,13,10,13],[32,0,32,12],[8,5,8,6],[33,0,33,21],[6,4,6,21],[9,2,10,2],[9,3,10,3],[7,14,7,15],[8,14,8,15],[7,16,9,16],[7,11,7,12],[7,22,9,22],[7,23,7,24],[8,23,8,24],[9,23,10,23],[9,24,10,24],[7,25,9,25],[7,26,7,27],[8,26,8,27],[9,26,10,26],[9,27,10,27],[9,30,10,30],[9,29,10,29],[8,29,8,30],[7,29,7,30],[7,28,9,28]]}
["CONSEJO DE EDUCACIÓN TÉCNICO PROFESIONAL (U.T.U.)",null,null,null,null,null,null,null,null,null,"ALUMNOS MATRICULADOS"]
[]
["Cuadro Nº II-4.2.2"]
[]
["ALUMNOS MATRICULADOS EN EL CETP EN EDUCACIÓN MEDIA SUPERIOR TECNOLÓGICA POR TIPO DE CURSO SEGÚN GRANDES ÁREAS, DEPARTAMENTO Y SEXO. AÑO 2016"]
["GRANDES ÁREAS,DEPARTAMENTO Y SEXO ","TOTAL","TOTAL ",null,"Tipo de curso"]
[null,null,null,null,"EDUACIÓN MEDIA SUPERIOR TECONOLOGICA "]
[null,null,null,null,"TOTAL ","Bachillerato Figari",null,"TOTAL ","Bachillerato Profesional Trayectos",null,"TOTAL ","Curso Técnico",null,null,"E. M. P. Especialización",null,"TOTAL ","Educación Media Profesional",null,"TOTAL","Educación Media Tecnológica",null,"TOTAL","Tecnologica Finest",null,"TOTAL","Formación Profesional Superior",null,"TOTAL","BACHILLERATO PROFESIONAL "]
[null,null,null,null,null,"Sexo",null,null,null,null,null,"Sexo",null,null,"Sexo",null,null,"Sexo",null,null,"Sexo",null,null,"Sexo",null,null,"Sexo",null,null,"Sexo"]
[null,null,"F","M",null,"F","M",null,"F","M",null,"F","M",null,"F","M",null,"F","M",null,"F","M"]
[null,null,null,null,null,null,null,null,"Count","Count",null,"Count","Count",null,null,null,null,"Count","Count",null,"Count","Count"]
["TOTAL ",{"$f":"C12+D12","v":45180},{"$f":"F12+I12+L12+O12+R12+U12+X12+AA12+AD12","v":18568},{"$f":"G12+J12+M12+P12+S12+V12+Y12+AB12+AE12","v":26612},{"$f":"F12+G12","v":366},{"$f":"F13+F14","v":220},{"$f":"G13+G14","v":146},{"$f":"I12+J12","v":1315},{"$f":"I13+I14","v":298},{"$f":"J13+J14","v":1017},{"$f":"L12+M12","v":375},{"$f":"L13+L14","v":356},{"$f":"M13+M14","v":19},{"$f":"O12+P12","v":6},{"$f":"O13+O14","v":4},{"$f":"P13+P14","v":2},{"$f":"R12+S12","v":14144},{"$f":"R13+R14","v":6277},{"$f":"S13+S14","v":7867},{"$f":"U12+V12","v":28699},{"$f":"U13+U14","v":11368},{"$f":"V13+V14","v":17331},{"$f":"X12+Y12","v":104},{"$f":"X13+X14","v":33},{"$f":"Y13+Y14","v":71},{"$f":"AA12+AB12","v":18},{"$f":"AA13+AA14","v":6},{"$f":"AB13+AB14","v":12},{"$f":"AD12+AE12","v":153},{"$f":"AD13+AD14","v":6},{"$f":"AE13+AE14","v":147}]
["Montevideo",{"$f":"C13+D13","v":18609},{"$f":"F13+I13+L13+O13+R13+U13+X13+AA13+AD13","v":6929},{"$f":"G13+J13+M13+P13+S13+V13+Y13+AB13+AE13","v":11680},300,174,126,{"$f":"I13+J13","v":562},115,447,{"$f":"L13+M13","v":375},356,19,{"$f":"O13+P13","v":6},4,2,{"$f":"R13+S13","v":5942},2473,3469,{"$f":"U13+V13","v":11221},3786,7435,{"$f":"X13+Y13","v":32},9,23,{"$f":"AA13+AB13","v":18},6,12,153,6,147]
["RESTO DEL PAÍS",26571,11639,14932,{"$f":"F14+G14","v":66},{"$f":"SUM(F15:F32)","v":46},{"$f":"SUM(G15:G32)","v":20},753,{"$f":"SUM(I15:I32)","v":183},{"$f":"SUM(J15:J32)","v":570},0,{"$f":"SUM(L15:L32)","v":0},{"$f":"SUM(M15:M32)","v":0},0,{"$f":"SUM(O15:O32)","v":0},{"$f":"SUM(P15:P32)","v":0},8202,{"$f":"SUM(R15:R32)","v":3804},{"$f":"SUM(S15:S32)","v":4398},17478,{"$f":"SUM(U15:U32)","v":7582},{"$f":"SUM(V15:V32)","v":9896},72,{"$f":"SUM(X15:X32)","v":24},{"$f":"SUM(Y15:Y32)","v":48},0,{"$f":"SUM(AA15:AA32)","v":0},0,0,0,0]
["Artigas",1700,899,801,{"$f":"F15+G15","v":22},12,10,{"$f":"I15+J15","v":43},9,34,{"$f":"L15+M15","v":0},0,0,{"$f":"O15+P15","v":0},0,0,{"$f":"R15+S15","v":744},396,348,{"$f":"U15+V15","v":891},482,409,{"$f":"X15+Y15","v":0},0,0,{"$f":"AA15+AB15","v":0},0,0,0,0,0]
["Canelones",5408,2524,2884,{"$f":"F16+G16","v":0},0,0,{"$f":"I16+J16","v":104},32,72,{"$f":"L16+M16","v":0},0,0,{"$f":"O16+P16","v":0},0,0,{"$f":"R16+S16","v":1749},913,836,{"$f":"U16+V16","v":3543},1576,1967,{"$f":"X16+Y16","v":12},3,9,{"$f":"AA16+AB16","v":0},0,0,0,0,0]
["Cerro Largo",1217,559,658,0,0,0,29,7,22,0,0,0,0,0,0,366,198,168,822,354,468,0,0,0,0,0,0,0,0,0]
["Colonia",1826,756,1070,0,0,0,79,30,49,0,0,0,0,0,0,590,256,334,1157,470,687,0,0,0,0,0,0,0,0,0]
["Durazno",713,328,385,0,0,0,0,0,0,0,0,0,0,0,0,59,20,39,654,308,346,0,0,0,0,0,0,0,0,0]
["Flores",257,123,134,0,0,0,11,2,9,0,0,0,0,0,0,11,6,5,235,115,120,0,0,0,0,0,0,0,0,0]
["Florida",809,387,422,0,0,0,0,0,0,0,0,0,0,0,0,146,101,45,631,272,359,32,14,18,0,0,0,0,0,0]
["Lavalleja",647,298,349,0,0,0,24,6,18,null,0,0,0,0,0,329,148,181,294,144,150,0,0,0,0,0,0,0,0,0]
["Maldonado",2197,867,1330,0,0,0,120,34,86,0,0,0,0,0,0,826,356,470,1242,475,767,9,2,7,0,0,0,0,0,0]
["Paysandú",1927,700,1227,0,0,0,45,9,36,0,0,0,0,0,0,329,161,168,1545,528,1017,8,2,6,0,0,0,0,0,0]
["Rio Negro",910,343,567,0,0,0,16,0,16,0,0,0,0,0,0,183,56,127,711,287,424,0,0,0,0,0,0,0,0,0]
["Rivera",1286,561,725,44,34,10,9,5,4,0,0,0,0,0,0,202,97,105,1031,425,606,0,0,0,0,0,0,0,0,0]
["Rocha",679,335,344,0,0,0,13,0,13,0,0,0,0,0,0,299,118,181,367,217,150,0,0,0,0,0,0,0,0,0]
["Salto",2223,910,1313,0,0,0,130,30,100,0,0,0,0,0,0,769,337,432,1313,540,773,11,3,8,0,0,0,0,0,0]
["San José",1242,575,667,0,0,0,39,11,28,0,0,0,0,0,0,589,243,346,614,321,293,0,0,0,0,0,0,0,0,0]
["Soriano",1474,628,846,0,0,0,21,0,21,0,0,0,0,0,0,418,174,244,1035,454,581,0,0,0,0,0,0,0,0,0]
["Tacuarembó",1435,589,846,0,0,0,59,7,52,0,0,0,0,0,0,422,144,278,954,438,516,0,0,0,0,0,0,0,0,0]
["Treinta y Tres",621,257,364,0,0,0,11,1,10,0,0,0,0,0,0,171,80,91,439,176,263,0,0,0,0,0,0,0,0,0]
["Fuente : Procesamiento propio en base a datos proporcionados por el D.E. _ CETP (U.T.U. ) "]
["Nota: Los matriculados en Formación Profesional Superior, potencialmente son estudiantes de Educación Media Superior, ya que con el curso de Articulación correspondiente adquieren continuidad educativa a  nivel tericiario. "]
["En Educación Media Tecnológica se sumaron 4 mujeres y 13 hombres en Florida que corresponden al curso Educación Media Tecnológica Fines."]

{"sheet":"II-4.2.3 ","index":58,"n_rows":25,"n_cols":12,"rows_kept":25,"cut":false,"hidden":false,"merged":[[23,0,23,10],[0,11,1,12],[4,0,4,11],[5,0,8,0],[5,1,8,1],[5,2,6,10],[7,2,7,10]]}
["CONSEJO DE EDUCACIÓN TÉCNICO PROFESIONAL (U.T.U.)",null,null,null,null,null,null,null,null,null,null,"ALUMNOS MATRICULADOS"]
[]
["Cuadro Nº II-4.2.3"]
[]
["ALUMNOS MATRICULADOS EN EL CETP EN EDUCACIÓN MEDIA SUPERIOR POR TIPO DE CURSO SEGÚN EDAD. AÑO 2016."]
["EDAD ","TOTAL ","TIPO DE CURSO "]
[]
[null,null,"EDUCACIÓN MEDIA SUPERIOR TECNOLÓGICA "]
[null,null,"Bachillerato Profesional Trayectos ","Bachillerato Figari","Bachillerato Profesional","Curso Técnico","E. M. P. Especialización","Educación Media Profesional","Educación Media Tecnológica","Tecnológica Finest","Formación Profesional Superior"]
["TOTAL ",{"$f":"C10+D10+E10++F10+G10+H10+I10+J10+K10","v":45180},{"$f":"SUM(C11:C21)","v":153},{"$f":"SUM(D11:D21)","v":366},1315,375,6,14144,28699,{"$f":"SUM(J11:J21)","v":104},18]
["11 y 12 años ",{"$f":"C11+D11+E11++F11+G11+H11+I11+J11+K11","v":3},0,0,0,0,0,1,2,0,0]
["13 años ",0,0,0,0,0,0,0,0,0,0]
["14 años",26,0,0,0,0,0,2,24,0,0]
["15 años",3692,0,15,0,15,2,710,2950,0,0]
["16 años",6341,0,37,2,28,2,1522,4749,0,1]
["17 años",7511,0,51,189,34,1,1842,5392,1,1]
["18años",5934,0,33,209,55,0,1674,3958,2,3]
["19años",4273,0,31,181,55,0,1363,2631,10,2]
["20 a 24 años",9428,6,76,360,109,1,3466,5373,31,6]
["25 a 29 años",3849,40,39,153,43,0,1569,1980,21,4]
["30 años y más",4123,107,84,221,36,0,1995,1640,39,1]
[]
["Fuente: Procesamiento propio en base a datos proporcionados por el D.E. - CETP (U.T.U)"]
["Nota: Los cursos de Articulación no corresponden estrictamente a Educación Media Superior. El curso de Articulación brinda la posibilidad de adquirir el nivel educativo para Terciario. De esta manera se entiende que su inclusión en Educación Media Superior parece más apropiada que su inclusión en nivel terciario dentro de la oferta educativa del CEPT. "]
["En Educación Media Tecnológica se sumaron 17 estudiantes que corresponden al curso Educación Media Tecnológica Fines."]

{"sheet":"II-4.2.4 ","index":59,"n_rows":35,"n_cols":11,"rows_kept":35,"cut":false,"hidden":false,"merged":[[4,0,4,10],[5,0,6,0],[5,1,6,1],[5,2,5,8],[33,0,33,10]]}
["CONSEJO DE EDUCACIÓN TÉCNICO PROFESIONAL (U.T.U.)",null,null,null,null,null,null,null,null,"ALUMNOS MATRICULADOS"]
[]
["Cuadro Nº II-4.2.4."]
[]
["ALUMNOS MATRICULADOS EN EL CETP EN EDUCACIÓN MEDIA SUPERIOR TECNOLÓGICA POR TIPO DE CURSO SEGÚN SECTORES DE ESTUDIO. AÑO 2016."]
["SECTORES DE ESTUDIO ","TOTAL","EDUCACIÓN MEDIA SUPERIOR TECNOLÓGICA"]
[null,null,"BACHILLERATO PROFESIONAL TRAYECTOS","Bachillerato Figari","Bachillerato Profesional","Curso Técnico","E. M. P. Especialización","Educación Media Profesional","Educación Media Tecnológica","Tecnológica Finest","Formación Profesional Superior"]
["TOTAL",{"$f":"C8+D8+E8+F8+G8+H8+I8+J8+K8","v":45180},{"$f":"SUM(C9:C32)","v":153},{"$f":"SUM(D9:D32)","v":366},1315,375,6,14144,28699,104,18]
["Agropecuario",{"$f":"C9+D9+E9+F9+G9+H9+I9+J9+K9","v":2439},0,0,47,0,0,265,2127,0,0]
["Artes y Artesanías",330,0,330,0,0,0,0,0,0,0]
["Cerámica",36,0,36,0,0,0,0,0,0,0]
["Comercio y Administración",11280,0,0,0,0,0,3325,7955,0,0]
["Comunicación",205,19,0,0,0,0,0,186,0,0]
["Construcción y Arquitectura",2219,0,0,88,0,6,508,1617,0,0]
["Deporte y Afines",5501,0,0,0,0,0,166,5335,0,0]
["Electricidad y Electrónica",5730,134,0,378,0,0,2141,3077,0,0]
["Forestal",42,0,0,0,0,0,42,0,0,0]
["Gastronomía",2918,0,0,424,0,0,2494,0,0,0]
["Gráficos",112,0,0,0,0,0,0,94,0,18]
["Hortifruticultura y Jardinería",56,0,0,13,0,0,43,0,0,0]
["Hotelería",61,0,0,0,0,0,61,0,0,0]
["Informática",5884,0,0,44,0,0,336,5504,0]
["Madera y Muebles",760,0,0,64,0,0,696,0,0,0]
["Mant. Rep. y Serv. a la Producción",137,0,0,24,0,0,113,0,0,0]
["Mantenimiento y Rep. de Vehículos",2064,0,0,188,0,0,1481,395,0,0]
["Metal - Mecánica",995,0,0,29,0,0,425,541,0,0]
["Nautica y Pesca",129,0,0,16,0,0,113,0,0,0]
["Protección al Medio Ambiente",37,0,0,0,0,0,37,0,0,0]
["Química, Termodinámica y Agroener.",834,0,0,0,0,0,153,577,104,0]
["Servicios Personales",1714,0,0,0,161,0,1553,0,0,0]
["Textil y Confección de Vestimenta",406,0,0,0,214,0,192,0,0,0]
["Turismo",1291,0,0,0,0,0,0,1291,0,0]
["Fuente: D.E.- CETP (U.T.U.) "]
["Nota: Los cursos de Articulación no corresponden estrictamente a Educación Media Superior. El curso de Articulación brinda la posibilidad de adquirir el nivel educativo para Terciario. De esta manera se entiende que su inclusión en Educación Media Superior parece más apropiada que su inclusión en nivel terciario dentro de la oferta educativa del CETP. "]
["En Educación Media Tecnológica se sumaron 17 estudiantes que corresponden al curso Educación Media Tecnológica Finest y sector de estudio Química, Termodinámica y Agroenergía"]

{"sheet":"II-4.2.5","index":60,"n_rows":32,"n_cols":7,"rows_kept":32,"cut":false,"hidden":false,"merged":[[31,0,31,6],[0,4,1,6],[4,0,4,6],[5,0,8,0],[5,1,5,6],[6,1,6,2],[6,3,6,4],[6,5,6,6],[7,1,7,6]]}
["CONSEJO DE EDUCACIÓN SECUNDARIA",null,null,null,"ALUMNOS MATRICULADOS"]
[]
["Cuadro Nº II-4.2.5."]
[]
["ALUMNOS MATRICULADOS EN EL CES EN EDUCACIÓN MEDIA SUPERIOR GENERAL POR GRADO Y FORMA DE ADMINISTRACIÓN SEGÚN DEPARTAMENTO. AÑO 2016."]
["DEPARTAMENTO","GRADO"]
[null,"CUARTO",null,"QUINTO",null,"SEXTO"]
[null,"FORMA DE ADMINISTRACIÓN"]
[null,"Públicos","Privados","Públicos","Privados","Públicos","Privados"]
["TOTAL",{"$f":"SUM(B11:B12)","v":37880},7024,37123,5196,{"$f":"SUM(F11:F12)","v":28748},4554]
["MONTEVIDEO",11884,4851,12758,3917,9893,3564]
["RESTO DEL PAÍS",{"$f":"SUM(B13:B30)","v":25996},2173,24365,1279,{"$f":"SUM(F13:F30)","v":18855},990]
["Artigas",1094,7,1021,0,747,0]
["Canelones",6646,756,5864,464,4453,374]
["Cerro Largo",1192,85,1086,62,855,52]
["Colonia",1343,0,1298,0,1109,0]
["Durazno",663,45,685,0,557,0]
["Flores",309,36,336,0,250,0]
["Florida",778,78,781,34,597,23]
["Lavalleja",720,25,820,16,613,11]
["Maldonado",2177,411,2279,402,1808,285]
["Paysandú",1278,157,1331,112,982,87]
["Río Negro",658,35,560,0,471,0]
["Rivera",1599,51,1401,21,1136,4]
["Rocha",1248,37,1144,0,843,0]
["Salto ",1622,176,1587,59,1314,66]
["San José",1442,76,1407,40,887,33]
["Soriano",1018,66,944,0,866,0]
["Tacuarembó",1398,90,1167,69,888,55]
["Treinta y Tres",811,42,654,0,479,0]
["Fuente: DE — CES"]
["Nota:  La referencia \"Privados\" (incluye los Habilitados \"Liceo Naval\" y \"Liceo Militar\"), se corresponde con la de \"Liceos Habilitados\" presente en ediciones anteriores del Anuario Estadístico del MEC"]

{"sheet":"II-4.2.6","index":61,"n_rows":32,"n_cols":11,"rows_kept":32,"cut":false,"hidden":false,"merged":[[6,2,9,2],[6,6,9,6],[0,4,1,4],[0,7,1,9],[4,0,4,17],[5,0,9,0],[5,1,9,1],[5,3,5,10],[6,3,6,5],[8,8,9,8],[7,3,9,3],[6,7,6,10],[8,9,9,9],[8,10,9,10],[8,7,9,7],[7,5,9,5],[7,4,9,4]]}
["CONSEJO DE EDUCACIÓN SECUNDARIA",null,null,null,null,null,null,"ALUMNOS MATRICULADOS"]
[]
["Cuadro Nº II-4.2.6"]
[]
["ALUMNOS MATRICULADOS EN EL CES EN QUINTO GRADO DE EDUCACIÓN MEDIA GENERAL PÚBLICA POR PLAN Y ORIENTACIÓN SEGÚN DEPARTAMENTO. AÑO 2016."]
["DEPARTAMENTO","TOTAL GENERAL"]
[null,null,"TOTAL PLAN 94","ORIENTACIÓN  PLAN / 94",null,null,"TOTAL PLAN 06","ORIENTACIÓN  PLAN / REFORMULACIÓN 2006"]
[null,null,null,"2º H","2º B","2º C"]
[null,null,null,null,null,null,null,"DivHum","DivBiol","DivCient","DivArt"]
[]
["TOTAL",{"$f":"SUM(C11+G11)","v":36954},{"$f":"SUM(D11:F11)","v":13427},{"$f":"SUM(D12:D13)","v":7694},4890,843,{"$f":"SUM(H11:K11)","v":23527},{"$f":"SUM(H12:H13)","v":9267},{"$f":"SUM(I12:I13)","v":8847},{"$f":"SUM(J12:J13)","v":3400},{"$f":"SUM(K12:K13)","v":2013}]
["MONTEVIDEO",12758,5685,3246,1938,501,7073,2698,2264,1156,955]
["RESTO DEL PAÍS",24196,7742,{"$f":"SUM(D14:D31)","v":4448},2952,342,16454,{"$f":"SUM(H14:H31)","v":6569},{"$f":"SUM(I14:I31)","v":6583},{"$f":"SUM(J14:J31)","v":2244},{"$f":"SUM(K14:K31)","v":1058}]
["Artigas",1021,241,152,81,8,780,330,340,81,29]
["Canelones",5864,2189,1337,689,163,3675,1394,1279,627,375]
["Cerro Largo",1086,320,188,132,0,766,349,297,70,50]
["Colonia",1298,469,258,211,0,829,285,299,178,67]
["Durazno",685,185,115,70,0,500,207,201,63,29]
["Flores",336,100,42,58,0,236,65,104,54,13]
["Florida",781,223,121,102,0,558,228,229,64,37]
["Lavalleja",820,121,69,52,0,699,337,262,71,29]
["Maldonado",2110,671,370,255,46,1439,630,580,229]
["Paysandú",1331,469,221,217,31,862,295,439,97,31]
["Río Negro",560,186,114,72,0,374,155,155,38,26]
["Rivera",1401,278,189,68,21,1123,543,430,93,57]
["Rocha",1144,444,251,193,0,700,260,291,84,65]
["Salto ",1587,341,183,133,25,1246,521,538,122,65]
["San José",1407,666,314,304,48,741,234,337,121,49]
["Soriano",944,308,216,92,0,636,220,250,115,51]
["Tacuarembó",1167,291,182,109,0,876,360,373,86,57]
["Treinta y Tres",654,240,126,114,0,414,156,179,51,28]
["Fuente: DE — CES"]

{"sheet":"II-4.2.7 ","index":62,"n_rows":36,"n_cols":7,"rows_kept":36,"cut":false,"hidden":false,"merged":[[10,4,11,4],[10,5,11,5],[10,6,11,6],[0,5,1,7],[4,0,4,10],[6,0,6,7],[8,0,11,0],[8,1,11,1],[8,2,8,6],[8,9,11,10],[9,2,9,5],[10,2,11,2],[10,3,11,3]]}
["CONSEJO DE EDUCACIÓN SECUNDARIA",null,null,null,null,"ALUMNOS MATRICULADOS"]
[]
["Cuadro Nº II-4.2.7"]
[]
[]
[]
["ALUMNOS MATRICULADOS EN EL CES EN QUINTO GRADO DE EDUCACIÓN MEDIA SUPERIOR DE EDUCACIÓN SECUNDARIA PRIVADA POR ORIENTACIÓN SEGÚN DEPARTAMENTO. AÑO 2016."]
[]
["DEPARTAMENTO","TOTAL","QUINTO GRADO DE EDUCACIÓN MEDIA GENERAL"]
[null,null,"ORIENTACIÓN Planes 86+93+2006",null,null,null,"OTROS (*)"]
[null,null,"Humanística","Biológica","Científica","Artístico","BINT y/o BICUL"]
[]
["TOTAL",{"$f":"C13+D13+E13+F13+G13","v":5196},{"$f":"C14+C15","v":1654},{"$f":"D14+D15","v":1489},{"$f":"E14+E15","v":1576},{"$f":"F14+F15","v":325},{"$f":"G14+G15","v":152}]
["MONTEVIDEO",{"$f":"C14+D14+E14+F14+G14","v":3917},1250,1007,1233,275,152]
["RESTO DEL PAÍS",1279,{"$f":"SUM(C16:C33)","v":404},{"$f":"SUM(D16:D33)","v":482},{"$f":"SUM(E16:E33)","v":343},{"$f":"SUM(F16:F33)","v":50},{"$f":"SUM(G16:G33)","v":0}]
["Artigas",0,0,0,0,0,0]
["Canelones",464,150,153,127,34,0]
["Cerro Largo",62,20,22,20,0,0]
["Colonia",0,0,0,0,0,0]
["Durazno",0,0,0,0,0,0]
["Flores",0,0,0,0,0,0]
["Florida",34,10,13,11,0,0]
["Lavalleja",16,7,9,0,0,0]
["Maldonado",402,138,143,105,16,0]
["Paysandú",112,31,54,27,0,0]
["Río Negro",0,0,0,0,0,0]
["Rivera",21,8,8,5,0,0]
["Rocha",0,0,0,0,0,0]
["Salto ",59,12,28,19,0,0]
["San José",40,10,19,11,0,0]
["Soriano",0,0,0,0,0,0]
["Tacuarembó",69,18,33,18,0,0]
["Treinta y Tres",0,0,0,0,0,0]
["Fuente: DE — CES"]
["Nota:   Otros (*) Corresponde a los cursos de Bachillerato Internacional y"]
["        Bachillerato Bicultural"]

{"sheet":"II-4.2.8","index":63,"n_rows":33,"n_cols":17,"rows_kept":33,"cut":false,"hidden":false,"merged":[[8,11,10,11],[8,12,10,12],[8,13,10,13],[8,14,10,14],[8,15,10,15],[0,3,1,4],[6,0,10,0],[6,1,10,1],[6,3,7,8],[8,3,10,3],[8,4,10,4],[8,5,10,5],[5,2,5,16],[6,2,10,2],[8,10,10,10],[8,6,10,6],[8,7,10,7],[8,8,10,8],[6,10,7,16],[8,16,10,16],[6,9,10,9]]}
["CONSEJO DE EDUCACIÓN SECUNDARIA",null,null,"ALUMNOS MATRICULADOS"]
[]
["Cuadro Nº II-4.2.8",null,"VOLVER"]
[]
["ALUMNOS MATRICULADOS EN EL CES EN SEXTO GRADO DE EDUCACIÓN MEDIA GENERAL PÚBLICA POR PLAN Y OPCIÓN SEGÚN DEPARTAMENTO. AÑO 2016."]
[null,null,"SEXTO GRADO"]
["DEPARTAMENTO","TOTAL GENERAL","TOTAL Plan 94","O P C I Ó N   P L A N /  94",null,null,null,null,null,"Total Plan Ref. 06","O P C I Ó N      P L A N  / R E F O R M U L A C I Ó N  2006"]
[]
[null,null,null,"3º DER","3º ECO","3º AGR","3º MED","3º ARQ","3º ING",null,"Social Humanístico","Social Economía","Ciencias Agrarias","Ciencias Biológicas","Física Matemática","Matemática Diseño","Arte y Expresión"]
[]
[]
["TOTAL",{"$f":"SUM(C12+J12)","v":28527},{"$f":"SUM(D12:I12)","v":10685},{"$f":"D13+D14","v":5131},732,111,4025,168,518,{"$f":"SUM(K12:Q12)","v":17842},{"$f":"K13+K14","v":5870},{"$f":"L13+L14","v":1796},521,6141,1430,693,1391]
["MONTEVIDEO",9893,4707,2128,512,34,1570,119,344,{"$f":"SUM(K13:Q13)","v":5186},1604,706,78,1509,435,261,593]
["RESTO DEL PAÍS",18634,5978,{"$f":"SUM(D15:D32)","v":3003},220,77,2455,49,174,{"$f":"SUM(J15:J32)","v":12656},{"$f":"SUM(K15:K32)","v":4266},{"$f":"SUM(L15:L32)","v":1090},443,4632,995,432,798]
["Artigas",747,160,81,null,null,79,null,null,{"$f":"SUM(K15:Q15)","v":587},226,38,15,235,38,7,28]
["Canelones",4453,1679,889,86,24,593,24,63,2774,867,294,64,901,292,115,241]
["Cerro Largo",855,250,131,null,null,119,null,null,605,256,34,23,204,28,13,47]
["Colonia",1109,382,174,24,null,184,null,null,727,206,96,44,205,73,49,54]
["Durazno",557,162,90,null,null,72,null,null,395,138,37,17,134,26,20,23]
["Flores",250,79,39,null,null,40,null,null,171,46,12,13,54,24,6,16]
["Florida",597,135,64,null,null,71,null,null,462,185,27,9,167,33,23,18]
["Lavalleja",392,98,56,null,null,42,null,null,294,null,51,10,163,31,10,29]
["Maldonado",1808,579,261,37,28,195,25,33,1229,452,110,40,392,87,44,104]
["Paysandú",982,346,142,26,12,166,null,null,636,201,43,32,283,32,25,20]
["Río Negro",471,155,81,6,null,68,null,null,316,93,17,18,131,33,null,24]
["Rivera",1136,211,136,null,null,60,null,15,925,399,51,26,350,52,21,26]
["Rocha",843,347,176,null,null,171,null,null,496,156,53,13,210,19,12,33]
["Salto ",1314,331,158,17,13,118,null,25,983,372,45,14,439,66,19,28]
["San José",887,426,178,14,null,202,null,32,461,144,43,8,169,53,17,27]
["Soriano",866,260,133,10,null,111,null,6,606,170,50,53,218,46,29,40]
["Tacuarembó",888,221,125,null,null,96,null,null,667,241,61,27,253,41,18,26]
["Treinta y Tres",479,157,89,null,null,68,null,null,322,114,28,17,124,21,4,14]
["Fuente: DE — CES"]

{"sheet":"II-4.2.9 ","index":64,"n_rows":30,"n_cols":10,"rows_kept":30,"cut":false,"hidden":false,"merged":[[29,0,29,5],[30,0,30,5],[0,3,1,3],[0,4,1,5],[4,0,4,9],[5,0,6,0],[5,1,6,1],[5,2,5,8]]}
["CONSEJO DE EDUCACIÓN SECUNDARIA",null,null,null,"ALUMNOS MATRICULADOS"]
[]
["Cuadro Nº II-4.2.9"]
[]
["ALUMNOS MATRICULADOS EN EL CES EN SEXTO GRADO DE EDUCACIÓN MEDIA GENERAL PRIVADA POR OPCIÓN SEGÚN DEPARTAMENTO. AÑO 2016."]
["DEPARTAMENTO","TOTAL"," TODOS LOS PLANES OPCIÓN SEXTO GRADO",null,null,null,null,null,null,"Otros (*)"]
[null,null,"Social Humanístico","Social Economía","Ciencias Agrarias","Ciencias Biológicas","Física Matemática","Matemática Diseño","Arte y Expresión","B.INT.y/o BICUL."]
["TOTAL",{"$f":"SUM(C8:J8)","v":4554},{"$f":"C9+C10","v":936},{"$f":"D9+D10","v":907},175,1067,774,332,256,107]
["MONTEVIDEO",{"$f":"SUM(C9:J9)","v":3564},747,740,96,759,633,268,214,107]
["RESTO DEL PAÍS",990,{"$f":"SUM(C11:C28)","v":189},{"$f":"SUM(D11:D28)","v":167},79,308,141,64,42,0]
["Artigas",0,0,0,0,0,0,0,0,0]
["Canelones",374,64,86,27,102,50,23,22,0]
["Cerro Largo",52,6,9,13,8,9,7,0,0]
["Colonia",0,0,0,0,0,0,0,0,0]
["Durazno",0,0,0,0,0,0,0,0,0]
["Flores",0,0,0,0,0,0,0,0,0]
["Florida",23,0,0,5,11,5,2,0,0]
["Lavalleja",11,11,0,0,0,0,0,0,0]
["Maldonado",285,58,46,8,90,37,26,20,0]
["Paysandú",87,23,10,8,31,15,0,0,0]
["Río Negro",0,0,0,0,0,0,0,0,0]
["Rivera",4,0,0,0,0,4,0,0,0]
["Rocha",0,0,0,0,0,0,0,0,0]
["Salto ",66,14,5,2,25,14,6,0,0]
["San José",33,4,5,4,18,2,0,0,0]
["Soriano",0,0,0,0,0,0,0,0,0]
["Tacuarembó",55,9,6,12,23,5,0,0,0]
["Treinta y Tres",0,0,0,0,0,0,0,0,0]
["Fuente D.E - CES"]
["Nota: Otros (*) Corresponde a los cursos de Bachillerato Internacional y Bachillerato Bicultural. "]

{"sheet":"II-4.2.10","index":65,"n_rows":33,"n_cols":7,"rows_kept":33,"cut":false,"hidden":false,"merged":[[4,0,4,6],[6,0,9,0],[6,1,6,6],[7,1,7,2],[7,3,7,4],[7,5,7,6],[8,1,8,6]]}
["CONSEJO DE EDUCACIÓN SECUNDARIA"]
[]
["Cuadro Nº II-4.2.10"]
[]
["ALUMNOS MATRICULADOS DE EDUCACIÓN MEDIA SUPERIOR PRIVADA  POR GRADO Y SEXO SEGÚN DEPARTAMENTO. AÑO 2016."]
[]
["DEPARTAMENTO","GRADO"]
[null,"CUARTO",null,"QUINTO",null,"SEXTO"]
[null,"SEXO"]
[null,"Mujeres","Varones","Mujeres","Varones","Mujeres","Varones"]
["TOTAL",{"$f":"B12+B13","v":3628},3331,2620,2458,2359,2111]
["MONTEVIDEO",2516,2270,1988,1866,1858,1673]
["RESTO DEL PAÍS",{"$f":"SUM(B14:B31)","v":1112},1061,632,592,501,438]
["Artigas",3,4,0,0,0,0]
["Canelones",385,371,238,226,212,162]
["Cerro Largo",39,46,31,31,25,27]
["Colonia",0,0,0,0,0,0]
["Durazno",22,23,0,0,0,0]
["Flores",15,21,0,0,0,0]
["Florida",42,36,17,17,9,14]
["Lavalleja",14,11,8,8,8,3]
["Maldonado",195,216,202,200,142,143]
["Paysandú",89,68,36,21,20,16]
["Río Negro",22,13,0,0,0,0]
["Rivera",29,22,9,12,1,3]
["Rocha",19,18,0,0,0,0]
["Salto ",90,86,36,23,40,26]
["San José",41,35,16,24,15,18]
["Soriano",41,25,0,0,0,0]
["Tacuarembó",46,44,39,30,29,26]
["Treinta y Tres",20,22,0,0,0,0]
["Fuente: DE — CES"]
["Nota: Las diferencias con la matrícula de otros cuadros se debe a la ausencia de información sobre sexo en colegios de Montevideo, Maldonado, Paysandú y Rivera."]

{"sheet":"II-4.2.11","index":66,"n_rows":33,"n_cols":7,"rows_kept":33,"cut":false,"hidden":false,"merged":[[4,0,4,6],[6,0,9,0],[6,1,6,6],[7,1,7,2],[7,3,7,4],[7,5,7,6],[8,1,8,6]]}
["CONSEJO DE EDUCACIÓN SECUNDARIA"]
[]
["Cuadro Nº II-4.2.11"]
[]
["ALUMNOS MATRICULADOS DE EDUCACIÓN MEDIA SUPERIOR PÚBLICA  POR GRADO Y SEXO SEGÚN DEPARTAMENTO. AÑO 2016."]
[]
["DEPARTAMENTO","GRADO"]
[null,"CUARTO",null,"QUINTO",null,"SEXTO"]
[null,"SEXO"]
[null,"Mujeres","Varones","Mujeres","Varones","Mujeres","Varones"]
["TOTAL",{"$f":"B12+B13","v":15956},11650,14319,9377,11095,6968]
["MONTEVIDEO",4577,3292,4196,2877,3195,1991]
["RESTO DEL PAÍS",{"$f":"SUM(B14:B31)","v":11379},8358,10123,6500,7900,4977]
["Artigas",550,375,512,268,368,219]
["Canelones",2837,2072,2188,1487,1691,1083]
["Cerro Largo",496,394,458,308,369,236]
["Colonia",551,424,507,322,439,288]
["Durazno",294,191,296,204,228,167]
["Flores",108,99,114,122,94,77]
["Florida",353,242,334,224,272,190]
["Lavalleja",356,273,439,260,292,223]
["Maldonado",881,807,962,646,736,493]
["Paysandú",665,377,580,282,440,196]
["Río Negro",281,208,238,136,210,106]
["Rivera",762,552,690,433,575,350]
["Rocha",432,404,379,321,283,213]
["Salto ",841,576,778,468,613,370]
["San José",555,374,470,271,294,167]
["Soriano",399,276,390,246,387,219]
["Tacuarembó",677,480,545,331,418,249]
["Treinta y Tres",341,234,243,171,191,131]
["Fuente: DE — CES"]
["Nota: No incluye la matrícula correspondiente a los liceos de cuarto turno (nocturnos)"]

{"sheet":"II-4.3.1 ","index":67,"n_rows":51,"n_cols":7,"rows_kept":51,"cut":false,"hidden":false,"merged":[[0,5,1,6],[0,7,1,7],[4,0,4,6],[6,0,7,0],[6,1,7,1],[6,2,6,3],[6,4,7,4],[6,5,6,6]]}
["CONSEJO DE EDUCACIÓN SECUNDARIA",null,null,null,null,"PERSONAL DOCENTE"]
[]
["Cuadro Nº II-4.3.1"]
[]
["PERSONAL DOCENTE Y HORAS DOCENTES DEL CES EN EDUCACIÓN MEDIA SUPERIOR GENERAL PÚBLICA POR CONDICIÓN DE TITULACIÓN. AÑO 2016."]
[]
["ASIGNATURAS","TOTAL DOCENTES","PERSONAL DOCENTE",null,"TOTAL HORAS ","HORAS DOCENTES"]
[null,null,"Titulados","No Titulados",null,"Titulados","No Titulados"]
["TOTAL",{"$f":"SUM(C9:D9)","v":8225},{"$f":"SUM(C10:C48)","v":5706},{"$f":"SUM(D10:D48)","v":2519},{"$f":"SUM(F9:G9)","v":103302},{"$f":"SUM(F10:F48)","v":76177},{"$f":"SUM(G10:G48)","v":27125}]
["ACT.ADAPTADAS AL MEDIO AMBIENT",{"$f":"+C10+D10","v":0},0,0,{"$f":"+F10+G10","v":0},0,0]
["ALEMÁN",0,0,0,0,0,0]
["ASTRONOMÍA",28,6,22,156,32,124]
["BIOLOGÍA",708,580,128,8992,7672,1320]
["DIBUJO",390,250,140,3778,2549,1229]
["DIRECTOR DE COROS",20,11,9,222,126,96]
["ECONOMÍA",140,78,62,1069,516,553]
["ED.SOCIAL Y CÍVICA DERECHO",729,600,129,8328,7418,910]
["EDUCACIÓN FÍSICA",198,170,28,1679,1470,209]
["EDUCACIÓN MUSICAL",105,43,62,906,347,559]
["EDUCADOR PARA LA SEXUALIDAD",191,157,34,2445,2000,445]
["EDUCADOR SOCIAL",0,0,0,0,0,0]
["ESPACIO CURRICULAR ABIERTO",3,2,1,40,30,10]
["ESTUDIOS ECONÓMICOS Y SOCIALES",231,199,32,1541,1344,197]
["EXPRESIÓN CORPORAL Y DANZA",46,4,42,339,36,303]
["EXPRESIÓN CORPORAL Y TEATRO",55,12,43,332,98,234]
["FACILITADOR PROCES",0,0,0,0,0,0]
["FILOSOFÍA",621,455,166,7724,5979,1745]
["FÍSICA",565,355,210,8428,5779,2649]
["FRANCÉS",1,0,1,20,0,20]
["GEOGRAFÍA",222,171,51,1795,1428,367]
["GEOLOGÍA",8,3,5,35,12,23]
["HISTORIA",710,614,96,8732,7756,976]
["IDIOMA ESPAÑOL",31,20,11,450,302,148]
["INFORMÁTICA",49,11,38,676,160,516]
["INGLÉS",604,274,330,8021,4225,3796]
["ITALIANO",78,26,52,1069,428,641]
["LABORATORIO DE INFORMÁTICA",23,5,18,288,60,228]
["LENG.COM.Y MED.AUDIOVISUALES",44,9,35,246,30,216]
["LENGUA DE SEÑAS",7,1,6,111,20,91]
["LITERATURA",696,560,136,8522,7247,1275]
["MANUALIDADES",0,0,0,0,0,0]
["MATEMÁTICA",1050,637,413,18338,12383,5955]
["PIANISTA ACOMPAÑANTE",13,7,6,114,70,44]
["PORTUGUÉS",0,0,0,0,0,0]
["QUÍMICA",{"$f":"+C45+D45","v":558},404,154,{"$f":"+F45+G45","v":8431},6506,1925]
["REC.NATUR.Y PAISAJE AGRARIO",48,32,16,140,82,58]
["TALLER EXPR.PLÁSTICA-ARTÍSTICA",0,0,0,0,0,0]
["TEATRO",53,10,43,335,72,263]
["Fuente: Departamento de Estadística — CES"]
["Nota: Los docentes que dictan más de una asignatura son considerados como personas distintas en cada asignatura"]
["Datos verificados por la DIEE de la ANEP en 2019."]

{"sheet":"II-4.3.2","index":68,"n_rows":21,"n_cols":5,"rows_kept":21,"cut":false,"hidden":false,"merged":[[0,4,1,5],[0,7,1,7],[4,0,4,3],[5,0,6,0],[5,1,6,1],[0,0,0,2]]}
["CONSEJO DE EDUCACIÓN TÉCNICO PROFESIONAL (U.T.U.)",null,null,null,"PERSONAL DOCENTE"]
[]
["Cuadro Nº II-4.3.2"]
[]
["PERSONAL DOCENTE DEL CETP EN EDUCACIÓN MEDIA SUPERIOR TECNOLÓGICA POR TIPO DE CURSO. AÑO 2016."]
["EDUCACIÓN MEDIA SUPERIOR TECNOLÓGICA","TOTAL"]
[]
["TOTAL",{"$f":"SUM(B9:B18)","v":14851}]
["Bachillerato Figari",150]
["Bachillerato Profesional",777]
["Educación Media Profesional",2948]
["Educación Media Prof. De Especialización",4]
["Educación Media Tecnológica",4802]
["EMS",6012]
["Articulación a Nivel Terciario",2]
["Curso Técnico",93]
["Tutorias",6]
["Educación Media Tecnológica Fin.",57]
["Fuente: U.T.U. División Informática."]
["Nota: publicamos último dato disponible correspondiente al año 2015"]
["Los cursos EMP Especialización, fueron reubicados en el  Nivel Superior de Formación Profesional.  "]

{"sheet":"II-4.4.1","index":69,"n_rows":28,"n_cols":4,"rows_kept":28,"cut":false,"hidden":false,"merged":[[0,2,1,3],[0,7,1,7],[4,0,4,2],[5,0,6,0],[23,0,23,2]]}
["CONSEJO DE EDUCACIÓN SECUNDARIA",null,"GRUPOS"]
[]
["Cuadro Nº II-4.4.1"]
[]
["GRUPOS DE EDUCACIÓN MEDIA SUPERIOR GENERAL COMPARADOS CON EL TOTAL DE AMBOS CICLOS SEGÚN GRANDES ÁREAS Y FORMA DE ADMINISTRACIÓN. AÑO 2016."]
[null,"FORMA DE ADMINISTRACIÓN"]
[null,"Grupos en Educación Media Superior General","Total de Grupos en Educación Media General","Promedio de alumnos por grupo de Media Superior"]
["TOTAL DEL PAÍS",{"$f":"B9+B12","v":4638},{"$f":"C9+C12","v":10286},{"$f":"'II-4.2.1 '!B9/'II-4.4.1'!B8","v":25.986416558861578}]
["EDUCACIÓN MEDIA SUPERIOR PÚBLICA",{"$f":"B10+B11","v":3475},{"$f":"C10+C11","v":8035},{"$f":"'II-4.2.1 '!B10/'II-4.4.1'!B9","v":29.856402877697843}]
["  Diurna",{"$f":"B15+B20","v":2753},6833,{"$f":"'II-4.2.1 '!B11/'II-4.4.1'!B10","v":25.196149654921904}]
["  Nocturna",722,1202,{"$f":"'II-4.2.1 '!B12/'II-4.4.1'!B11","v":47.626038781163437}]
["EDUCACIÓN MEDIA SUPERIOR PRIVADA",1163,2251,{"$f":"'II-4.2.1 '!B13/'II-4.4.1'!B12","v":14.423043852106622}]
["TOTAL MONTEVIDEO",{"$f":"B14+B17","v":1786},{"$f":"C14+C17","v":3775},{"$f":"'II-4.2.1 '!B14/'II-4.4.1'!B13","v":26.241321388577827}]
["EDUCACIÓN MEDIA SUPERIOR PÚBLICA",{"$f":"B15+B16","v":967},{"$f":"C15+C16","v":2281},{"$f":"'II-4.2.1 '!B15/'II-4.4.1'!B14","v":35.713547052740431}]
["  Diurna",662,{"$f":"'II-3.4.1'!C17","v":1831},{"$f":"'II-4.2.1 '!B16/'II-4.4.1'!B15","v":30.404833836858007}]
["  Nocturna",305,{"$f":"'II-3.4.1'!C18","v":450},{"$f":"'II-4.2.1 '!B17/'II-4.4.1'!B16","v":47.236065573770489}]
["EDUCACIÓN MEDIA SUPERIOR PRIVADA",819,1494,{"$f":"'II-4.2.1 '!B18/'II-4.4.1'!B17","v":15.057387057387057}]
["TOTAL RESTO DEL PAÍS",{"$f":"B19+B22","v":2852},{"$f":"C19+C22","v":6511},{"$f":"'II-4.2.1 '!B19/'II-4.4.1'!B18","v":25.82678821879383}]
["EDUCACIÓN MEDIA SUPERIOR PÚBLICA",{"$f":"B20+B21","v":2508},{"$f":"C20+C21","v":5754},{"$f":"'II-4.2.1 '!B20/'II-4.4.1'!B19","v":27.598086124401913}]
["  Diurna",2091,{"$f":"'II-3.4.1'!C22","v":5002},{"$f":"'II-4.2.1 '!B21/'II-4.4.1'!B20","v":23.547106647537063}]
["  Nocturna",417,{"$f":"'II-3.4.1'!C23","v":752},{"$f":"'II-4.2.1 '!B22/'II-4.4.1'!B21","v":47.911270983213427}]
["EDUCACIÓN MEDIA SUPERIOR PRIVADA",344,757,{"$f":"'II-4.2.1 '!B23/'II-4.4.1'!B22","v":12.912790697674419}]
["Fuente: DE — CES"]
["Nota: El “Total de ambos Ciclos” presenta de manera agregada la cantidad  total de grupos con que cuente Educación Secundaria y es el resultado de adicionar al total de Grupos del presente cuadro (Ciclo Superior de Educación Secundaria), el total de los grupos presentados en el Cuadro II-3.4.1 (Ciclo Básico de Educación Secundaria)"]
["       "]
["        "]
["        "]
["        "]

{"sheet":"TERCIARIA NO UNIVERSITARIA","index":70,"n_rows":112,"n_cols":2,"rows_kept":112,"cut":false,"hidden":false,"merged":[]}
[]
[]
[]
[]
[]
[]
[]
["Cuadro II-5.1.1","MATRÍCULA Y PERSONAL DOCENTE POR SEXO SEGÚN GRANDES ÁREAS, DEPARTAMENTOS E INSTITUCIONES. AÑO 2016. "]
[""]
[]
["Cuadro II-5.2.1","ALUMNOS INGRESADOS, MATRICULADOS Y EGRESADOS EN NIVEL TERCIARIO NO UNIVERSITARIO DEL ÁREA SEGURIDAD Y DEFENSA POR SEXO SEGÚN INSTITUCIÓN Y CARRERA. AÑO 2016. "]
[""]
["Cuadro II-5.2.2 ","ALUMNOS INGRESADOS, MATRICULADOS Y EGRESADOS EN OTRAS OFERTAS DE NIVEL TERCIARIO NO UNIVERSITARIO POR SEXO SEGÚN INSTITUCIÓN Y CARRERA. AÑO 2016. "]
[""]
[]
["Cuadro II-5.3.1","PERSONAL ACADÉMICO DE NIVEL TERCIARIO NO UNIVERSITARIO DEL ÁREA SEGURIDAD Y DEFENSA POR CARGA HORARIA, SEXO, SEGÚN INSTITUCIÓN Y FORMACIÓN. AÑO 2016. "]
[""]
["Cuadro II-5.3.2","PERSONAL ACADÉMICO DE NIVEL TERCIARIO NO UNIVERSITARIO POR CARGA HORARIA SEMANAL, SEXO, SEGÚN INSTITUCIÓN Y FORMACIÓN . AÑO 2016. "]
[]
[]
[]
[]
[]
[]
[]
[]
[]
[]
[]
[]
[{"$f":"MID(B19,1,20)","v":""}]
[""]
[""]
[""]
[""]
[""]
[""]
[""]
[""]
[""]
[""]
[""]
[""]
[""]
[""]
[""]
[""]
[""]
[""]
[""]
[""]
[""]
[""]
[""]
[""]
[""]
[""]
[""]
[""]
[""]
[""]
[""]
[""]
[""]
[""]
[""]
[""]
[""]
[""]
[""]
[""]
[""]
[""]
[""]
[""]
[""]
[""]
[""]
[""]
[""]
[""]
[""]
[""]
[""]
[{"$f":"MID(B73,1,20)","v":""}]
[""]
[""]
[""]
[""]
[""]
[""]
[""]
[""]
[""]
[""]
[""]
[""]
[""]
[""]
[""]
[""]
[""]
[""]
[""]
[""]
[""]
[""]
[""]
[""]
[""]
[""]
[""]

{"sheet":"II-5.1.1  ","index":71,"n_rows":51,"n_cols":7,"rows_kept":51,"cut":false,"hidden":false,"merged":[[53,0,54,5],[0,3,1,4],[4,0,4,4],[5,0,9,0],[5,1,9,1],[5,2,5,3],[5,4,9,4],[6,2,7,3],[8,2,9,2],[8,3,9,3],[50,0,50,4]]}
["OFERTAS TERCIARIAS NO UNIVERSITARIAS",null,null,"INSTITUCIONES"]
[]
["Cuadro Nº II-5.1.1"]
[]
["MATRÍCULA Y PERSONAL DOCENTE POR SEXO SEGÚN GRANDES ÁREAS, DEPARTAMENTOS E INSTITUCIONES. AÑO 2016."]
["GRANDES ÁREAS / DEPARTAMENTO / INSTITUCIÓN","TOTAL","MATRICULA",null,"DOCENTES"]
[null,null,"SEXO"]
[]
[null,null,"M","F"]
[]
["TOTAL",{"$f":"+B13+B22","v":11547},{"$f":"+C13+C22","v":7039},{"$f":"+D13+D22","v":4508},{"$f":"+E13+E22","v":2151}]
[]
["MONTEVIDEO",{"$f":"+C13+D13","v":7743},{"$f":"SUM(C15:C20)","v":4740},{"$f":"SUM(D15:D20)","v":3003},{"$f":"SUM(E15:E20)","v":1387}]
[]
["ESCUELA NAVAL",{"$f":"C15+D15","v":136},107,29,132,null,{"$f":"F13:I18","v":0}]
["ESCUELA NACIONAL DE POLICÍA*",{"$f":"C16+D16","v":322},239,83,53]
["ESCUELA MILITAR",285,240,45,78]
["ESCUELA MILITAR DE AERONÁUTICA",122,105,17,80]
["EMAD",102,35,67,62]
["UTU",{"$f":"+C20+D20","v":6776},4014,2762,982]
[]
["RESTO DEL PAÍS",{"$f":"SUM(B24:B41)","v":3804},{"$f":"SUM(C24:C41)","v":2299},{"$f":"SUM(D24:D41)","v":1505},{"$f":"SUM(E24:E41)","v":764}]
[]
["Artigas",{"$f":"C24+D24","v":121},47,74,38]
["Canelones",{"$f":"C25+D25","v":280},128,152,93]
["Cerro Largo",178,92,86,30]
["Colonia",207,95,112,64]
["Durazno",47,20,27,4]
["Flores",133,102,31,13]
["Florida",132,77,55,31]
["Lavalleja",0,0,0,5]
["Maldonado",327,221,106,57]
["Paysandú",862,585,277,135]
["Río Negro",102,36,66,31]
["Rivera",571,342,229,49]
["Rocha",21,10,11,11]
["Salto",366,293,73,101]
["San José",60,45,15,24]
["Soriano",172,106,66,51]
["Tacuarembó",190,77,113]
["Treinta y Tres",35,23,12,27]
["Fuente: "]
["           D.E - UTU-"]
["           Secretaría General EMAD"]
["          Gestión Educativa - Escuela Naval"]
["          Jefatura de Estudios - Escuela Nacional de Policía "]
["          Escuela Militar"]
["          Departamento de Bedelía - Escuela Militar de Aeronáutica"]
["          Instituto Militar de Estudios Superiores"]
[]
["* Los datos corresponden al curso de Cadetes de 1°,2° y3°"]

{"sheet":"II-5.2.1","index":72,"n_rows":33,"n_cols":10,"rows_kept":33,"cut":false,"hidden":false,"merged":[[7,5,7,6],[7,8,7,9],[33,0,33,9],[34,0,34,9],[0,6,1,9],[4,0,4,9],[6,0,8,0],[6,1,8,1],[6,2,6,3],[6,4,8,4],[6,5,6,6],[6,7,8,7],[6,8,6,9],[7,2,7,3]]}
["OFERTAS TERCIARIAS NO UNIVERSITARIAS DEL ÁREA SEGURIDAD Y DEFENSA",null,null,null,null,null,"ALUMNOS MATRICULADOS"]
[]
["Cuadro Nº II-5.2.1"]
[]
["ALUMNOS INGRESADOS, MATRICULADOS Y EGRESADOS EN NIVEL TERCIARIO NO UNIVERSITARIO DEL ÁREA SEGURIDAD Y DEFENSA POR SEXO SEGÚN INSTITUCIÓN Y CARRERA. AÑO 2016."]
[]
["INSTITUCION / CARRERA","TOTAL","INGRESADOS",null,"TOTAL","MATRICULADOS",null,"TOTAL","EGRESADOS"]
[null,null,"SEXO",null,null,"SEXO",null,null,"SEXO"]
[null,null,"M","F",null,"M","F",null,"M","F"]
["TOTAL",{"$f":"D10+C10","v":341},{"$f":"+C12+C16+C19+C23","v":265},{"$f":"+D12+D16+D19+D23","v":76},{"$f":"G10+F10","v":865},{"$f":"+F12+F16+F19+F23","v":691},{"$f":"+G12+G16+G19+G23","v":174},{"$f":"J10+I10","v":208},{"$f":"+I12+I16+I19+I23","v":164},{"$f":"+J12+J16+J19+J23","v":44}]
[]
["ESCUELA NAVAL",{"$f":"SUM(B13:B14)","v":54},40,14,136,107,29,24,18,6]
["Marina de Guerra",{"$f":"SUM(C13:D13)","v":40},26,14,{"$f":"SUM(F13:G13)","v":89},63,26,{"$f":"SUM(I13:J13)","v":11},6,5]
["Marina Mercante",{"$f":"SUM(C14:D14)","v":14},14,0,{"$f":"SUM(F14:G14)","v":47},44,3,{"$f":"SUM(I14:J14)","v":13},12,1]
[]
["ESCUELA NACIONAL DE POLICÍA",{"$f":"+C16+D16","v":112},{"$f":"+C17","v":85},{"$f":"+D17","v":27},{"$f":"+F16+G16","v":322},{"$f":"+F17","v":239},{"$f":"+G17","v":83},{"$f":"+I16+J16","v":113},{"$f":"+I17","v":82},{"$f":"+J17","v":31}]
["Curso de Cadetes (1º,2º y 3er.año)",{"$f":"SUM(C17:D17)","v":112},85,27,{"$f":"SUM(F17:G17)","v":322},239,83,{"$f":"SUM(I17:J17)","v":113},82,31]
[]
["ESCUELA MILITAR",{"$f":"SUM(C19:D19)","v":105},{"$f":"C20+C21","v":81},{"$f":"D20+D21","v":24},{"$f":"SUM(F19:G19)","v":285},{"$f":"F20+F21","v":240},{"$f":"G20+G21","v":45},{"$f":"SUM(I19:J19)","v":71},{"$f":"I20+I21","v":64},{"$f":"J20+J21","v":7}]
["Alférez de Cuerpo de Comando",{"$f":"+C20+D20","v":92},71,21,{"$f":"+F20+G20","v":264},225,39,{"$f":"SUM(I20:J20)","v":63},59,4]
["Alférez de Apoyo de Servicios y Combate",{"$f":"+C21+D21","v":13},10,3,{"$f":"+F21+G21","v":21},15,6,{"$f":"SUM(I21:J21)","v":8},5,3]
[]
["ESCUELA MILITAR DE AERONÁUTICA ",{"$f":"SUM(C23:D23)","v":70},{"$f":"SUM(C24:C29)","v":59},{"$f":"SUM(D24:D29)","v":11},{"$f":"SUM(F23:G23)","v":122},{"$f":"SUM(F24:F29)","v":105},{"$f":"SUM(G24:G29)","v":17},{"$f":"SUM(I23:J23)","v":0},{"$f":"SUM(I24:I29)","v":0},{"$f":"SUM(J24:J29)","v":0}]
["Aspirantes",{"$f":"+C24+D24","v":70},59,11,{"$f":"+F24+G24","v":70},59,11,{"$f":"SUM(I24:J24)","v":0},0,0]
["Cadetes 1º",{"$f":"+C25+D25","v":0},0,0,{"$f":"+F25+G25","v":12},9,3,0,0,0]
["Cadetes 2º  (Aviadores)",0,0,0,11,11,0,0,0,0]
["Cadetes 2º  (Navegantes)",0,0,0,6,5,1,0,0,0]
["Cadetes 3º  (Aviadores)",0,0,0,18,17,1,0,0,0]
["Cadetes 3º  (Navegantes)",0,0,0,5,4,1,0,0,0]
[]
[]
["Fuentes: Escuela Nacional de Policía "]
["Dirección de Formación. Ministerio de Defensa Nacional"]

{"sheet":"II-5.2.2","index":73,"n_rows":95,"n_cols":10,"rows_kept":95,"cut":false,"hidden":false,"merged":[[7,9,8,9],[0,6,1,9],[4,0,4,9],[5,0,8,0],[5,1,8,1],[5,2,5,3],[5,4,8,4],[5,5,5,6],[5,7,8,7],[5,8,5,9],[6,2,6,3],[6,5,6,6],[6,8,6,9],[7,2,8,2],[7,3,8,3],[7,5,8,5],[7,6,8,6],[7,8,8,8]]}
["OTRAS OFERTAS TERCIARIAS NO UNIVERSITARIAS",null,null,null,null,null,"ALUMNOS MATRICULADOS"]
[]
["Cuadro Nº II-5.2.2"]
[]
["ALUMNOS INGRESADOS, MATRICULADOS Y EGRESADOS EN OTRAS OFERTAS DE NIVEL TERCIARIO NO UNIVERSITARIO POR SEXO SEGÚN INSTITUCIÓN Y CARRERA. AÑO 2016."]
["INSTITUCION / CARRERA","TOTAL","INGRESADOS",null,"TOTAL","MATRICULADOS",null,"TOTAL","EGRESADOS"]
[null,null,"SEXO",null,null,"SEXO",null,null,"SEXO"]
[null,null,"M","F",null,"M","F",null,"M","F"]
[]
["EMAD Margarita Xirgu",{"$f":"C10+D10","v":41},{"$f":"C11+C12","v":13},{"$f":"D11+D12","v":28},{"$f":"F10+G10","v":102},{"$f":"F11+F12","v":35},{"$f":"G11+G12","v":67},{"$f":"I10+J10","v":19},{"$f":"I11+I12","v":2},{"$f":"J11+J12","v":17}]
["Carrera de actuación",{"$f":"C11+D11","v":20},9,11,{"$f":"F11+G11","v":63},24,39,{"$f":"I11+J11","v":12},1,11]
["Carrera de diseño teatral",{"$f":"C12+D12","v":21},4,17,{"$f":"F12+G12","v":39},11,28,{"$f":"I12+J12","v":7},1,6]
[]
["CETP (UTU) ","-","-","-",{"$f":"+F14+G14","v":10580},{"$f":"SUM(F15:F91)","v":6313},{"$f":"SUM(G15:G91)","v":4267},"-","-","-"]
["ADMINISTRACIÓN","-","-","-",{"$f":"+F15+G15","v":294},76,218,"-","-","-"]
["ADMINISTRACIÓN PÚBLICA","-","-","-",21,4,17,"-","-","-"]
["AERONÁUTICA","-","-","-",35,32,3,"-","-","-"]
["AGRÓNICA ÉNFASIS AGRÍCOLA","-","-","-",21,21,0,"-","-","-"]
["ANALISTA EN MARKETING","-","-","-",149,54,95,"-","-","-"]
["ÁREA ELECTROTÉCNIA ELECTRÓNICA","-","-","-",236,217,19,"-","-","-"]
["AREA OPTATIVA D. GRÁFICO COM.VISUAL","-","-","-",273,99,174,"-","-","-"]
["ARTICULACIÓN TECNÓLOGO QUÍMICO","-","-","-",84,25,59,"-","-","-"]
["AUDIOVISUALES","-","-","-",112,70,42,"-","-","-"]
["AUTOTRÓNICA LAB. S. DE CONTROL","-","-","-",57,57,0,"-","-","-"]
["BIOTECNOLOGÍA INDUSTRIAL","-","-","-",37,13,24,"-","-","-"]
["COM. SOCIAL OP. PRENSA","-","-","-",48,19,29,"-","-","-"]
["COM. SOCIAL OP. RADIODIFUSIÓN","-","-","-",86,39,47,"-","-","-"]
["COM. SOCIAL OP. RR.PP.","-","-","-",46,13,33,"-","-","-"]
["COM. SOCIAL OP.TELEVISIÓN","-","-","-",34,18,16,"-","-","-"]
["COM.SOCIAL OP. PUBLICIDAD","-","-","-",59,23,36,"-","-","-"]
["COMPONENTE OPCIONAL CTT LOGÍSTICA","-","-","-",263,134,129,"-","-","-"]
["CONSERV. GESTION AREAS NATUR","-","-","-",51,23,28,"-","-","-"]
["CONSTRUCCIÓN","-","-","-",176,128,48,"-","-","-"]
["CONSTRUCCIÓN DE OBRA CIVIL","-","-","-",53,29,24,"-","-","-"]
["CONTROL AMBIENTAL","-","-","-",281,107,174,"-","-","-"]
["CORREDOR DE SEGUROS","-","-","-",42,26,16,"-","-","-"]
["D. ITINERARIO TURÍSTICO SOSTENIBLE","-","-","-",128,34,94,"-","-","-"]
["DEPORTES NAUTICOS","-","-","-",51,40,11,"-","-","-"]
["DISEÑO GRÁFICO EN COM. VISUAL","-","-","-",311,118,193,"-","-","-"]
["ELECTRÓNICA","-","-","-",283,274,9,"-","-","-"]
["ELECTROTÉCNIA","-","-","-",728,705,23,"-","-","-"]
["ENERGIA EÓLICA","-","-","-",12,11,1,"-","-","-"]
["ENERGIA SOLAR FOTOVOLTAICA","-","-","-",29,21,8,"-","-","-"]
["ENOLOGÍA MÓDULO ENOLÓGICO II","-","-","-",8,5,3,"-","-","-"]
["ENOLOGÍA MÓDULO VITIVINÍCOLA","-","-","-",8,6,2,"-","-","-"]
["ENOLOGÍA PASANTÍA PROYECTO FINAL","-","-","-",8,4,4,"-","-","-"]
["FORESTAL","-","-","-",35,23,12,"-","-","-"]
["GASTRONOMIA - BINACIONAL","-","-","-",26,8,18,"-","-","-"]
["GESTIÓN DE ALOJAMIENTO","-","-","-",30,9,21,"-","-","-"]
["GESTIÓN EMPRESAS TURÍSTICAS","-","-","-",55,15,40,"-","-","-"]
["GESTIÓN HUMANA","-","-","-",50,9,41,"-","-","-"]
["INDUSTRIAS LÁCTEAS","-","-","-",55,37,18,"-","-","-"]
["INFOGRAFÍA DE ARQUITECTURA","-","-","-",86,34,52,"-","-","-"]
["INFORMÁTICA PARA INTERNET","-","-","-",124,82,42,"-","-","-"]
["INMOBILIARIO (OPERADOR)","-","-","-",54,29,25,"-","-","-"]
["INSTALACIONES ELÉCTRICAS","-","-","-",56,55,1,"-","-","-"]
["INSTALACIONES SANITARIAS","-","-","-",46,44,2,"-","-","-"]
["INSTRUMENTACIÓN Y CONTROL","-","-","-",45,41,4,"-","-","-"]
["LOGÍSTICA","-","-","-",494,246,248,"-","-","-"]
["LOGÍSTICA - BINACIONAL","-","-","-",34,11,23,"-","-","-"]
["MANTENIMIENTO MECÁNICO INDUSTRIAL","-","-","-",74,70,4,"-","-","-"]
["MAQUINISTA NAVAL","-","-","-",148,146,2,"-","-","-"]
["MECATRÓNICA - INT. AUT. Y CONTROL","-","-","-",7,7,0,"-","-","-"]
["MECATRÓNICA - MANT. ELECTROMECÁNICO","-","-","-",5,5,0,"-","-","-"]
["MOTORES DE COMBUSTIÓN INTERNA","-","-","-",18,18,0,"-","-","-"]
["NAUTICA Y PESCA","-","-","-",13,12,1,"-","-","-"]
["ÓPTICO","-","-","-",135,54,81,"-","-","-"]
["ORGANIZACION DE EVENTOS","-","-","-",98,17,81,"-","-","-"]
["PREVENCIONISTA","-","-","-",945,498,447,"-","-","-"]
["PREVENCIONISTA  SEMIPRESENCIAL","-","-","-",379,177,202,"-","-","-"]
["PREVENCIONISTA EN SEG.INDUSTRIAL","-","-","-",659,358,301,"-","-","-"]
["PRODUCCIÓN AGRICOLA GANADERA","-","-","-",311,218,93,"-","-","-"]
["PRODUCCIÓN AGROPECUARIA FAMILIAR","-","-","-",22,10,12,"-","-","-"]
["PRODUCTOS EN GEMAS","-","-","-",23,8,15,"-","-","-"]
["RECREACION","-","-","-",263,113,150,"-","-","-"]
["REDES","-","-","-",217,198,19,"-","-","-"]
["REDES Y COMUNICACIONES ÓPTICAS","-","-","-",55,54,1,"-","-","-"]
["REMATADOR","-","-","-",113,73,40,"-","-","-"]
["REMATADOR - OP. INMOBILIARIO","-","-","-",{"$f":"+F79+G79","v":129},71,58,"-","-","-"]
["S. P. ARROZ PASTURAS - BINACIONAL","-","-","-",14,10,4,"-","-","-"]
["SECRETARIADO BILINGÜE - INGLÉS","-","-","-",36,4,32,"-","-","-"]
["SISTEMAS DE PROD. ARROZ-PASTURAS","-","-","-",5,3,2,"-","-","-"]
["SISTEMAS ENERGÍAS RENOVABLES","-","-","-",111,73,38,"-","-","-"]
["TECNICO EN COMUNICACIÓN SOCIAL","-","-","-",317,127,190,"-","-","-"]
["TECNÓLOGO CÁRNICO","-","-","-",33,11,22,"-","-","-"]
["TECNÓLOGO EN INFORMÁTICA","-","-","-",476,414,62,"-","-","-"]
["TECNÓLOGO MADERA","-","-","-",47,31,16,"-","-","-"]
["TECNÓLOGO MECÁNICO","-","-","-",322,300,22,"-","-","-"]
["TECNÓLOGO QUÍMICO","-","-","-",349,108,241,"-","-","-"]
["TELECOMUNICACIONES","-","-","-",42,37,5,"-","-","-"]
[]
[]
["Fuente: "]
["           D.E - UTU-"]
["           Secretaría General EMAD"]

{"sheet":"II-5.3.1","index":74,"n_rows":38,"n_cols":11,"rows_kept":38,"cut":false,"hidden":false,"merged":[[42,0,42,10],[0,4,1,6],[4,0,4,10],[5,0,8,0],[5,1,8,1],[5,2,5,10],[6,2,8,2],[6,3,6,4],[6,5,8,5],[6,6,6,7],[6,8,8,8],[6,9,6,10],[7,3,7,4],[7,6,7,7],[7,9,7,10],[41,0,41,10]]}
["OFERTAS TERCIARIAS NO UNIVERSITARIAS DEL ÁREA SEGURIDAD Y DEFENSA",null,null,null,"PERSONAL ACADÉMICO"]
[]
["Cuadro Nº II-5.3.1"]
[]
["PERSONAL ACADÉMICO DE NIVEL TERCIARIO NO UNIVERSITARIO DEL ÁREA SEGURIDAD Y DEFENSA POR CARGA HORARIA, SEXO, SEGÚN INSTITUCIÓN Y FORMACIÓN. AÑO 2016."]
["INSTITUCIONES / FORMACIÓN","TOTAL","HORAS SEMANALES"]
[null,null,"Total","20 horas o menos",null,"Total","Entre 21 y 30 horas",null,"Total","31 horas y más"]
[null,null,null,"SEXO",null,null,"SEXO",null,null,"SEXO"]
[null,null,null,"M","F",null,"M","F",null,"M","F"]
["TOTAL",{"$f":"C10+F10+I10","v":352},{"$f":"D10+E10","v":343},{"$f":"D12+D18+D24+D30","v":269},{"$f":"E12+E18+E24+E30","v":74},{"$f":"G10+H10","v":1},{"$f":"G12+G18+G24+G30","v":0},{"$f":"H12+H18+H24+H30","v":1},{"$f":"J10+K10","v":8},{"$f":"J12+J18+J24+J30","v":4},{"$f":"K12+K18+K24+K30","v":4}]
[]
["ESCUELA NAVAL",{"$f":"C12+F12+I12","v":132},{"$f":"D12+E12","v":132},{"$f":"SUM(D13:D16)","v":115},{"$f":"SUM(E13:E16)","v":17},{"$f":"G12+H12","v":0},{"$f":"SUM(G13:G16)","v":0},{"$f":"SUM(H13:H16)","v":0},{"$f":"J12+K12","v":0},{"$f":"SUM(J13:J16)","v":0},{"$f":"SUM(K13:K16)","v":0}]
["  Sin formación de grado completa",{"$f":"C13+F13+I13","v":0},{"$f":"D13+E13","v":0},0,0,{"$f":"G13+H13","v":0},0,0,{"$f":"J13+K13","v":0},0,0]
["  Con formación de grado",122,{"$f":"D14+E14","v":122},112,10,{"$f":"G14+H14","v":0},0,0,{"$f":"J14+K14","v":0},0,0]
["  Con postgrado de especialización o maestría",1,{"$f":"D15+E15","v":1},1,0,0,0,0,{"$f":"J15+K15","v":0},0,0]
["  Con doctorado",9,{"$f":"D16+E16","v":9},2,7,{"$f":"G16+H16","v":0},0,0,{"$f":"J16+K16","v":0},0,0]
[]
["ESCUELA NACIONAL DE POLICÍA",{"$f":"C18+F18+I18","v":53},{"$f":"D18+E18","v":53},{"$f":"SUM(D19:D22)","v":40},{"$f":"SUM(E19:E22)","v":13},{"$f":"G18+H18","v":0},{"$f":"SUM(G19:G22)","v":0},{"$f":"SUM(H19:H22)","v":0},{"$f":"J18+K18","v":0},{"$f":"SUM(J19:J22)","v":0},{"$f":"SUM(K19:K22)","v":0}]
["  Sin formación de grado completa",{"$f":"C19+F19+I19","v":0},{"$f":"D19+E19","v":0},0,0,{"$f":"G19+H19","v":0},0,0,{"$f":"J19+K19","v":0},0,0]
["  Con formación de grado",{"$f":"C20+F20+I20","v":44},{"$f":"D20+E20","v":44},36,8,{"$f":"G20+H20","v":0},0,0,{"$f":"J20+K20","v":0},0,0]
["  Con postgrado de especialización o maestría",{"$f":"C21+F21+I21","v":1},{"$f":"D21+E21","v":1},1,0,{"$f":"G21+H21","v":0},0,0,{"$f":"J21+K21","v":0},0,0]
["  Con doctorado",{"$f":"C22+F22+I22","v":8},{"$f":"D22+E22","v":8},3,5,{"$f":"G22+H22","v":0},0,0,{"$f":"J22+K22","v":0},0]
[]
["ESCUELA MILITAR",{"$f":"C24+F24+I24","v":87},{"$f":"D24+E24","v":78},{"$f":"SUM(D25:D28)","v":56},{"$f":"SUM(E25:E28)","v":22},{"$f":"G24+H24","v":1},{"$f":"SUM(G25:G28)","v":0},{"$f":"SUM(H25:H28)","v":1},{"$f":"J24+K24","v":8},{"$f":"SUM(J25:J28)","v":4},{"$f":"SUM(K25:K28)","v":4}]
["  Sin formación de grado completa",{"$f":"C25+F25+I25","v":13},{"$f":"D25+E25","v":13},3,10,{"$f":"G25+H25","v":0},0,0,{"$f":"J25+K25","v":0},0,0]
["  Con formación de grado",{"$f":"C26+F26+I26","v":69},{"$f":"D26+E26","v":62},51,11,{"$f":"G26+H26","v":1},0,1,{"$f":"J26+K26","v":6},3,3]
["  Con postgrado de especialización o maestría",5,3,2,1,{"$f":"G27+H27","v":0},0,0,{"$f":"J27+K27","v":2},1,1]
["  Con doctorado",0,0,0,0,{"$f":"G28+H28","v":0},0,0,{"$f":"J28+K28","v":0},0,0]
[]
["ESCUELA MILITAR DE AERONÁUTICA",{"$f":"C30+F30+I30","v":80},{"$f":"D30+E30","v":80},{"$f":"SUM(D31:D34)","v":58},{"$f":"SUM(E31:E34)","v":22},{"$f":"G30+H30","v":0},{"$f":"SUM(G31:G34)","v":0},{"$f":"SUM(H31:H34)","v":0},{"$f":"J30+K30","v":0},{"$f":"SUM(J31:J34)","v":0},{"$f":"SUM(K31:K34)","v":0}]
["  Sin formación de grado completa",{"$f":"C31+F31+I31","v":43},{"$f":"D31+E31","v":43},37,6,{"$f":"G31+H31","v":0},0,0,{"$f":"J31+K31","v":0},0,0]
["  Con formación de grado",37,37,21,16,0,0,0,0,0,0]
["  Con postgrado de especialización o maestría",0,0,0,0,0,0,0,0,0,0]
["  Con doctorado",0,0,0,0,0,0,0,0,0,0]
[]
[]
["Fuentes: Escuela Nacional de Policía "]
["Dirección de Formación. Ministerio de Defensa Nacional"]

{"sheet":"II-5.3.2","index":75,"n_rows":16,"n_cols":11,"rows_kept":16,"cut":false,"hidden":false,"merged":[[6,9,6,10],[7,3,7,4],[7,6,7,7],[7,9,7,10],[0,2,1,4],[4,0,4,10],[5,0,8,0],[5,1,8,1],[5,2,5,10],[6,2,8,2],[6,3,6,4],[6,5,8,5],[6,6,6,7],[6,8,8,8]]}
["OTRAS OFERTAS TERCIARIAS NO UNIVERSITARIAS ",null,"PERSONAL ACADÉMICO"]
[]
["Cuadro Nº II-5.3.2"]
[]
["PERSONAL ACADÉMICO DE NIVEL TERCIARIO NO UNIVERSITARIO POR CARGA HORARIA SEMANAL, SEXO, SEGÚN INSTITUCIÓN Y FORMACIÓN. AÑO 2016."]
["INSTITUCIONES / FORMACIÓN","TOTAL","HORAS SEMANALES"]
[null,null,"Total","20 horas o menos",null,"Total","Entre 21 y 30 horas",null,"Total","31 horas y más"]
[null,null,null,"SEXO",null,null,"SEXO",null,null,"SEXO"]
[null,null,null,"M","F",null,"M","F",null,"M","F"]
["EMAD Margarita Xirgu",{"$f":"C10+F10+I10","v":60},{"$f":"D10+E10","v":60},{"$f":"SUM(D11:D14)","v":33},{"$f":"SUM(E11:E14)","v":27},{"$f":"G10+H10","v":0},{"$f":"SUM(G11:G14)","v":0},{"$f":"SUM(H11:H14)","v":0},{"$f":"J10+K10","v":0},{"$f":"SUM(J11:J14)","v":0},{"$f":"SUM(K11:K14)","v":0}]
["  Sin formación de grado completa",{"$f":"C11+F11+I11","v":38},{"$f":"D11+E11","v":38},22,16,{"$f":"G11+H11","v":0},0,0,{"$f":"J11+K11","v":0},0,0]
["  Con formación de grado",{"$f":"C12+F12+I12","v":22},{"$f":"D12+E12","v":22},11,11,{"$f":"G12+H12","v":0},0,0,{"$f":"J12+K12","v":0},0,0]
["  Con postgrado de especialización o maestría",{"$f":"C13+F13+I13","v":0},0,0,0,{"$f":"G13+H13","v":0},0,0,{"$f":"J13+K13","v":0},0,0]
["  Con doctorado",0,0,0,0,{"$f":"G14+H14","v":0},0,0,{"$f":"J14+K14","v":0},0,0]
["Fuente: "]
["          Secretaría General - EMAD"]

{"sheet":"FORMACIÓN EN EDUCACIÓN  ","index":76,"n_rows":43,"n_cols":2,"rows_kept":43,"cut":false,"hidden":false,"merged":[]}
[]
[]
[]
[]
[]
[]
[]
[]
["Cuadro II-6.1.1"," MATRÍCULA Y PERSONAL DOCENTE SEGÚN GRANDES ÁREAS, DEPARTAMENTOS E INSTITUCIONES. CFE. AÑO 2016. "]
[""]
[""]
["Cuadro II-6.2.1","ALUMNOS INGRESADOS, MATRICULADOS Y EGRESADOS EN FORMACIÓN EN EDUCACIÓN POR CARRERA SEGÚN DEPARTAMENTO Y ESTABLECIMIENTO. CFE. AÑO 2016. "]
["Cuadro II-6.2.2 ","ALUMNOS INGRESADOS, MATRICULADOS Y EGRESADOS EN FORMACIÓN EN EDUCACIÓN POR SEXO SEGÚN INSTITUCIÓN Y CARRERA.  TERCIARIAS NO UNIVERSITARIAS. AÑO 2016."]
[]
[]
[""]
["Cuadro II-6.3.1","PERSONAL DOCENTE DE LOS INSTITUTOS DE FORMACIÓN EN EDUCACIÓN Y CANTIDAD DE HORAS POR INSTITUCIÓN Y DEPARTAMENTO. AÑO 2016."]
["Cuadro II-6.3.2","PERSONAL DOCENTE DE FORMACIÓN EN EDUCACIÓN POR CARGA HORARIA SEMANAL, SEXO, SEGÚN INSTITUCIÓN Y FORMACIÓN. TERCIARIAS NO UNIVERSITARIAS. AÑO 2016."]
["Cuadro II-6.3.3","ESTUDIANTES INGRESADOS Y MATRICULADOS EN FORMACIÓN EN EDUCACIÓN SEGÚN ORIGEN GEOGRÁFICO. AÑO 2016."]
[""]
[""]
[""]
[""]
[""]
[""]
[""]
[""]
[""]
[""]
[""]
[""]
[""]
[{"$f":"MID(B22,1,20)","v":""}]
[""]
[""]
[""]
[""]
[""]
[""]
[""]
[""]
[""]
[""]

{"sheet":"II-6.1.1","index":77,"n_rows":41,"n_cols":3,"rows_kept":41,"cut":false,"hidden":false,"merged":[[40,0,46,2],[0,0,0,1],[0,2,1,3],[4,0,4,2],[5,0,9,0],[5,1,9,1],[5,2,9,2]]}
["ANEP - CONSEJO DE FORMACIÓN EN EDUCACIÓN",null,"INSTITUCIONES"]
[]
["Cuadro Nº II-6.1.1"]
[]
["MATRÍCULA Y PERSONAL DOCENTE SEGÚN GRANDES ÁREAS, DEPARTAMENTOS E INSTITUCIONES. AÑO 2016."]
["GRANDES ÁREAS / DEPARTAMENTO / INSTITUCIÓN","TOTAL","DOCENTES"]
[]
[]
[]
[]
["TOTAL",{"$f":"+B13+B20","v":24369},{"$f":"+C13+C20","v":2478}]
[]
["MONTEVIDEO",{"$f":"SUM(B15:B18)","v":9317},{"$f":"SUM(C15:C18)","v":704}]
[]
["IINN",2076,196]
["IPA ",5240,317]
["INET",1254,137]
["IFES",747,54]
[]
["RESTO DEL PAÍS",{"$f":"SUM(B22:B39)","v":15052},{"$f":"SUM(C22:C39)","v":1774}]
[]
["Artigas",557,64]
["Canelones",2702,279]
["Cerro Largo",937,63]
["Colonia",911,158]
["Durazno",417,50]
["Flores",173,32]
["Florida",651,143]
["Lavalleja",335,44]
["Maldonado ",1212,160]
["Paysandú",1144,105]
["Río Negro",248,27]
["Rivera",1502,165]
["Rocha",543,49]
["Salto",1363,208]
["San José",362,41]
["Soriano",501,47]
["Tacuarembó",550,70]
["Treinta y Tres",944,69]
["Fuente: División Estudiantil del CFE"]
["Notas: 1) Matrícula considerada como el número de personas inscriptas  inscriptas y validades en el sistema web, para cursar en el 2016 al menos una materia de las carreras que se ofrecen en el CFE.                                                                                                                          2) A partir del año 2016, los estudiantes de Educador Social del IPA, pasan al nuevo Instutito de Formación en Educación Social (IFES)"]

{"sheet":"II-6.2.1","index":78,"n_rows":60,"n_cols":17,"rows_kept":60,"cut":false,"hidden":false,"merged":[[55,0,55,9],[8,12,9,12],[8,13,9,13],[8,14,9,14],[8,15,9,15],[8,16,9,16],[25,0,25,1],[6,14,7,16],[8,2,9,2],[8,3,9,3],[8,4,9,4],[8,5,9,5],[8,6,9,6],[8,7,9,7],[8,8,9,8],[8,9,9,9],[8,10,9,10],[0,0,0,2],[0,8,1,10],[4,0,4,9],[5,0,9,1],[5,2,7,4],[5,5,5,13],[6,5,7,7],[6,8,7,10],[6,11,7,13],[8,11,9,11]]}
["ANEP - CONSEJO DE FORMACIÓN EN EDUCACIÓN",null,null,null,null,null,null,null,"ALUMNOS MATRICULADOS"]
[]
["Cuadro Nº II-6.2.1"]
[]
["ALUMNOS INGRESADOS, MATRICULADOS Y EGRESADOS EN FORMACIÓN EN EDUCACIÓN POR CARRERA SEGÚN DEPARTAMENTO Y ESTABLECIMIENTO. AÑO 2016."]
["DEPARTAMENTO / ESTABLECIMIENTO",null,"TOTAL",null,null,"CARRERA"]
[null,null,null,null,null,"Magisterio",null,null,"Profesorado",null,null,"Educador Social",null,null,"Asistente técnico en Primera Infancia"]
[]
[null,null,"Ingr.","Matr.","Egr.","Ingr.","Matr.","Egr.","Ingr.","Matr.","Egr.","Ingr.","Matr.","Egr.","Ingr.","Matr.","Egr."]
[]
["TOTAL",null,"S/D",{"$f":"G11+J11+M11+P11","v":24369},{"$f":"E13+E19","v":1574},{"$f":"+F13+F19","v":0},{"$f":"+G13+G19","v":6451},{"$f":"H13+H19","v":763},{"$f":"+I13+I19","v":0},{"$f":"+J13+J19","v":15228},{"$f":"K13+K19","v":718},{"$f":"+L13+L19","v":0},{"$f":"+M13+M19","v":1587},{"$f":"N13+N19","v":6},{"$f":"+O13+O19","v":0},{"$f":"+P13+P19","v":1103},{"$f":"Q13+Q19","v":87}]
[]
["MONTEVIDEO",null,"S/D",{"$f":"G13+J13+M13+P13","v":9317},{"$f":"SUM(E14:E17)","v":512},{"$f":"SUM(F14:F17)","v":0},{"$f":"SUM(G14:G18)","v":1767},{"$f":"SUM(H14:H17)","v":143},{"$f":"SUM(I14:I17)","v":0},{"$f":"SUM(J14:J18)","v":6558},313,0,{"$f":"SUM(M14:M18)","v":747},0,0,{"$f":"SUM(P14:P18)","v":245},56]
["                  IINN",null,{"$f":"F14+I14+L14","v":0},{"$f":"G14+J14+M14+P14","v":2076},{"$f":"H14+K14+N14+Q13","v":208},"S/D",1767,130,"S/D",64,22,"N/C","N/C","N/C","N/C",245,56]
["                  IPA ",null,{"$f":"F15+I15+L15","v":0},{"$f":"G15+J15+M15+P15","v":5240},{"$f":"H15+K15+N15+Q15","v":257},"N/C","N/C","N/C","S/D",5240,257,"S/D",null,"S/D","S/D","N/C","S/D"]
["                  UM",null,{"$f":"F16+I16+L16","v":0},0,17,"N/C",null,13,"S/D","S/D",4,"N/C","N/C","N/C","N/C","N/C","N/C"]
["                  INET ",null,{"$f":"F17+I17+L17","v":0},1254,30,"N/C","N/C","N/C","S/D",1254,30,"N/C","N/C","N/C","N/C","N/C","N/C"]
["I.F.E.S",null,null,null,null,null,null,null,null,null,null,null,747]
["RESTO DEL PAÍS",null,{"$f":"SUM(C20:C54)","v":0},{"$f":"G19+J19+M19+P19","v":15052},1062,{"$f":"F20+F21+F28+F29+F34+F33+F35+F38+F39+F42+F43+F45+F47+F49+F51+F52+F53+F54","v":0},{"$f":"G20+G21+G28+G29+G33+G34+G35+G38+G39+G42+G43+G44+G47+G48+G51+G52+G53+G54","v":4684},{"$f":"H20+H21+H28+H29+H33+H34+H35+H38+H39+H42+H43+H44+H47+H48+H51+H52+H53+H54","v":620},{"$f":"I20+I21+I28+I29+I33+I34+I35+I38+I39+I42+I43+I44+I47+I48+I51+I52+I53+I54","v":0},8670,405,0,{"$f":"M20+M21+M28+M29+M33+M34+M35+M38+M39+M42+M43+M44+M47+M48+M51+M52+M53+M54","v":840},6,0,{"$f":"P20+P21+P28+P29+P33+P34+P35+P38+P39+P42+P43+P44+P47+P48+P51+P52+P53+P54","v":858},31]
["Artigas         Artigas",null,"S/D",557,47,"S/D",345,39,"S/D",187,3,"S/D",25,5,"S/D"]
["Canelones",null,"S/D",{"$f":"G21+J21+M21+P21","v":2702},{"$f":"H21+K21+N21+Q21","v":159},"S/D",{"$f":"SUM(G22:G27)","v":807},{"$f":"SUM(H22:H27)","v":103},"S/D",{"$f":"SUM(J22:J27)","v":1447},{"$f":"SUM(K22:K27)","v":56},"S/D",{"$f":"SUM(M22:M27)","v":160},{"$f":"SUM(N22:N27)","v":0},"S/D",{"$f":"SUM(P22:P27)","v":288}]
["                  Canelones ",null,{"$f":"F22+I22+L22","v":0},694,{"$f":"H22+K22+N22+Q22","v":33},"S/D",248,33,"S/D",286,null,"S/D",160,null,"S/D"]
["                  De la Costa ",null,{"$f":"F23+I23+L23","v":0},644,{"$f":"H23+K23+N23+Q23","v":41},"S/D",200,17,"S/D",277,8,"S/D",null,null,"S/D",167,16]
["                  Pando",null,0,619,{"$f":"H24+K24+N24+Q24","v":31},"S/D",233,23,"S/D",265,5,"S/D",null,null,"S/D",121,3]
["                  San Ramón ",null,0,231,{"$f":"H25+K25+N25+Q25","v":25},"S/D",126,23,"S/D",105,2,"S/D",null,null,"S/D"]
["María Auxiliadora",null,null,null,7,null,null,7]
["Cerp Sur- Atlántida",null,0,514,41,"S/D",null,null,"S/D",514,41,"S/D",null,null,"S/D"]
["Cerro Largo     Melo",null,"S/D",937,59,"S/D",328,44,"S/D",609,15,"S/D",null,null,"S/D"]
["Colonia",null,"S/D",911,33,"S/D",{"$f":"SUM(G30:G32)","v":208},{"$f":"H30+H31+H32","v":33},"S/D",{"$f":"SUM(J30:J32)","v":703},null,"S/D",null,null,"S/D"]
["                Colonia",null,{"$f":"F30+I30+L30","v":0},365,{"$f":"H30+K30+M30+N30+Q30","v":29},"S/D",0,null,"S/D",365,29,"S/D",null,null,"S/D"]
["                Carmelo",null,{"$f":"F31+I31+L31","v":0},325,{"$f":"H31+K31+N31+Q31","v":21},"S/D",106,16,"S/D",219,5,"S/D",null,null,"S/D"]
["                Rosario",null,0,221,{"$f":"H32+K32+N32+Q32","v":21},"S/D",102,17,"S/D",119,4,"S/D",null,null,"S/D"]
["Durazno   Durazno ",null,"S/D",417,{"$f":"H33+K33+N33+Q33","v":30},"S/D",201,25,"S/D",216,5,"S/D",null,null,"S/D"]
["Flores       Trinidad",null,"S/D",173,6,"S/D",57,6,"S/D",116,null,"S/D",null,null,"S/D"]
["Florida         ",null,"S/D",651,113,"S/D",{"$f":"SUM(G36:G37)","v":172},{"$f":"H36+H37","v":44},"S/D",{"$f":"J36+J37","v":401},{"$f":"K36+K37","v":57},"S/D",{"$f":"M36+M37","v":0},{"$f":"N36+N37","v":0},"S/D",{"$f":"P36+P37","v":78},{"$f":"Q36+Q37","v":12}]
["                Florida",null,"S/D",269,59,"S/D",172,44,"S/D",19,3,"S/D",null,null,"S/D",78,12]
["                Cerp Centro - Florida",null,"S/D",382,54,"S/D",0,null,"S/D",382,54,"S/D",null,null,"S/D"]
["Lavalleja       Minas",null,"S/D",335,30,"S/D",158,26,"S/D",177,4,"S/D",null,null,"S/D"]
["Maldonado   ",null,"S/D",1212,93,"S/D",{"$f":"SUM(G40:G41)","v":334},{"$f":"H40+H41","v":35},"S/D",{"$f":"J40+J41","v":696},{"$f":"K40+K41","v":58},"S/D",{"$f":"M40+M41","v":182},{"$f":"N40+N41","v":0},"S/D",null,{"$f":"Q40+Q41","v":0}]
["                 Maldonado",null,null,{"$f":"G40+J40+M40+P40","v":361},{"$f":"H40+K40+M40+Q40","v":42},null,334,35,"S/D",27,7,"S/D",null,null,"S/D"]
["                 Cerp Este",null,null,851,{"$f":"H41+K41+N41+Q41","v":51},null,0,null,"S/D",669,51,"S/D",182,null,"S/D"]
["Paysandú     Paysandú",null,"S/D",1144,106,"S/D",314,57,"S/D",539,29,"S/D",142,1,"S/D",149,19]
["Río Negro     Fray Bentos",null,"S/D",248,15,"S/D",99,12,"S/D",149,3,"S/D",null,null,"S/D"]
["Rivera",null,null,1502,99,null,{"$f":"SUM(G45:G46)","v":356},{"$f":"H45+H46","v":37},"S/D",{"$f":"J45+J46","v":870},{"$f":"K45+K46","v":62},"S/D",{"$f":"M45+M46","v":276},null,"S/D"]
["                  Rivera",null,"S/D",781,37,"S/D",356,37,"S/D",149,null,"S/D",276,null,"S/D"]
["                  Cerp Norte",null,null,721,62,null,null,null,"S/D",721,62,"S/D",null,null,"S/D"]
["Rocha          Rocha",null,"S/D",543,21,"S/D",130,15,"S/D",292,6,"S/D",null,null,"S/D",121]
["Salto ",null,null,1363,119,null,{"$f":"SUM(G49:G50)","v":496},{"$f":"H49+H50","v":49},"S/D",{"$f":"J49+J50","v":867},{"$f":"K49+K50","v":70},"S/D",null,null,"S/D"]
["                  Salto ",null,"S/D",520,50,"S/D",496,49,"S/D",24,1,"S/D",null,null,"S/D"]
["                  Cerp Salto",null,"S/D",843,69,"S/D",null,null,"S/D",843,69,"S/D",null,null,"S/D"]
["San José      San José",null,"S/D",362,23,"S/D",133,19,"S/D",229,4,"S/D",null,null,"S/D"]
["Soriano        Mercedes ",null,"S/D",501,{"$f":"H52+K52+N52+Q52","v":29},"S/D",186,25,"S/D",315,4,"S/D",null,null,"S/D"]
["Tacuarembó      Tacuarembó ",null,"S/D",944,54,"S/D",203,36,"S/D",519,18,"S/D",null,null,"S/D",222]
["Treinta y Tres    Treinta y Tres",null,"S/D",550,{"$f":"H54+K54+N54+Q54","v":26},"S/D",157,15,"S/D",338,11,"S/D",55,null,"S/D"]
["Fuente: Informática - DFPD "]
["Nota: No se dispone de datos de ingreso. "]
["Matrícula considerada como el número de personas inscriptas  inscriptas y validades en el sistema web, para cursar en el 2016 al menos una materia de las carreras que se ofrecen en el CFE. "]
["Los matriculados en Profesorado del INET corresponden tanto al profesorado de Informática como a Maestros Técnicos."]
["La categoría profesora incluye a los maestros y profesores técnicos y a las certificaciones en lenguas extranejeras "]
["El I.F.E.S. es el Instituto de Formación en Educación Social"]

{"sheet":"II-6.2.2","index":79,"n_rows":17,"n_cols":10,"rows_kept":17,"cut":false,"hidden":false,"merged":[[0,6,1,9],[4,0,4,9],[5,0,8,0],[5,1,8,1],[5,2,5,3],[5,4,8,4],[5,5,5,6],[5,7,8,7],[5,8,5,9],[6,2,6,3],[17,0,21,9],[6,5,6,6],[6,8,6,9],[7,2,8,2],[7,3,8,3],[7,5,8,5],[7,6,8,6],[7,8,8,8],[7,9,8,9]]}
["OTRAS TERCIARIAS NO UNIVERSITARIAS",null,null,null,null,null,"ALUMNOS MATRICULADOS"]
[]
["Cuadro Nº II-6.2.2"]
[]
["ALUMNOS INGRESADOS, MATRICULADOS Y EGRESADOS EN FORMACIÓN EN EDUCACIÓN POR SEXO SEGÚN INSTITUCIÓN Y CARRERA. AÑO 2016."]
["INSTITUCION / CARRERA","TOTAL","INGRESADOS",null,"TOTAL","MATRICULADOS",null,"TOTAL","EGRESADOS"]
[null,null,"SEXO",null,null,"SEXO",null,null,"SEXO"]
[null,null,"M","F",null,"M","F",null,"M","F"]
[]
["C.I.E.P",{"$f":"SUM(C10:D10)","v":20},{"$f":"SUM(C11:C12)","v":0},{"$f":"SUM(D11:D12)","v":20},{"$f":"SUM(F10:G10)","v":42},{"$f":"SUM(F11:F12)","v":0},{"$f":"SUM(G11:G12)","v":42},{"$f":"SUM(I10:J10)","v":25},{"$f":"SUM(I11:I12)","v":0},{"$f":"SUM(J11:J12)","v":25}]
["Educador Inicial",{"$f":"SUM(C11:D11)","v":14},0,14,{"$f":"SUM(F11:G11)","v":36},0,36,19,0,19]
["Técnico en educación inicial y primera infancia",{"$f":"SUM(C12:D12)","v":6},0,6,{"$f":"SUM(F12:G12)","v":6},0,6,6,0,6]
["INAU – CENFORES",{"$f":"SUM(C13:D13)","v":69},{"$f":"+C14","v":2},{"$f":"+D14","v":67},155,3,152,22,0,22]
["Educación en Primera Infancia",{"$f":"SUM(C14:D14)","v":69},2,67,{"$f":"SUM(F14:G14)","v":155},3,152,22,0,22]
["Fuente:"]
["         CEN.FOR.ES - I.N.A.U. "]
["         C.I.E.P"]

{"sheet":"II-6.3.1","index":80,"n_rows":53,"n_cols":4,"rows_kept":53,"cut":false,"hidden":false,"merged":[[53,0,53,3],[0,3,1,4],[4,0,4,2],[5,0,7,0],[5,1,6,2],[52,0,52,3]]}
["ANEP - CONSEJO DE FORMACIÓN EN EDUCACIÓN",null,null,"FUNCIONARIOS"]
[]
["Cuadro Nº II-6.3.1"]
[]
["PERSONAL DOCENTE DE LOS INSTITUTOS DE FORMACIÓN EN EDUCACIÓN Y CANTIDAD DE HORAS POR INSTITUCIÓN Y DEPARTAMENTO. AÑO 2014."]
["DEPARTAMENTO / ESTABLECIMIENTO"]
[]
[null,"Cantidad de  Docentes","Cantidad de  Horas"]
["TOTAL",{"$f":"B11+B16","v":2478},{"$f":"C11+C16","v":0}]
[]
["MONTEVIDEO",{"$f":"B12+B13+B14+B15","v":704},0]
["                IINN",196,"s/d"]
["                IPA ",317,"s/d"]
["                INET",137,"s/d"]
["                IFES",54,"s/d"]
["RESTO DEL PAÍS",{"$f":"B17+B18+B24+B25+B29+B30+B31+B34+B35+B38+B39+B40+B43+B44+B47+B48+B49+B50","v":1774},0]
["Artigas",64,"s/d"]
["Canelones",{"$f":"SUM(B19:B23)","v":279},"s/d"]
["                IFD Canelones ",63,"s/d"]
["                IFD de la Costa ",55,"s/d"]
["                IFD Pando",57,"s/d"]
["                IFD San Ramón ",29,"s/d"]
["                CERP del Sur",75,"s/d"]
["Cerro Largo",63,"s/d"]
["Colonia",{"$f":"SUM(B26:B28)","v":158},"s/d"]
["                IFD Carmelo",30,"s/d"]
["                IFD Rosario ",39,"s/d"]
["                CERP del Suroeste",89,"s/d"]
["Durazno ",50,"s/d"]
["Flores",32,"s/d"]
["Florida",{"$f":"B32+B33","v":143},"s/d"]
["                IFD Florida",50,"s/d"]
["                CERP del Centro",93,"s/d"]
["Lavalleja",44,"s/d"]
["Maldonado ",{"$f":"B36+B37","v":160},"s/d"]
["                IFD Maldonado",46,"s/d"]
["                CERP del Centro",114,"s/d"]
["Paysandú",105,"s/d"]
["Río Negro",27,"s/d"]
["Rivera",{"$f":"B41+B42","v":165},"s/d"]
["                IFD Rivera",73,"s/d"]
["                CERP del Norte",92,"s/d"]
["Rocha",49,"s/d"]
["Salto ",{"$f":"B45+B46","v":208},"s/d"]
["                IFD Salto",60,"s/d"]
["                CERP del Litoral",148,"s/d"]
["San José",41,"s/d"]
["Soriano ",47,"s/d"]
["Tacuarembó ",70,"s/d"]
["Treinta y Tres",69,"s/d"]
["Fuente: Contralor Docente - CFE"]
["Nota: Dato 2014 último dato disponible"]
["Nota: En octubre del 2007 el CODICEN aprobó un Sistema Único Nacional de Formación Docente (SUNFD) y el nuevo Plan Integrado 2008, creándose además una estructura departamentalizada con el objetivo de fortalecer la labor de los IFD y promover las actividades de investigación y extensión en el espacio de formación en educación. Las horas de departamento representan horas de docencia indirecta destinadas a promover la producción académica de los docentes. Los Departamentos poseen alcance nacional. Su conducción está a cargo de un Coordinacionador/a Académico/a. "]

{"sheet":"II-6.3.2","index":81,"n_rows":22,"n_cols":11,"rows_kept":22,"cut":false,"hidden":false,"merged":[[6,9,6,10],[7,3,7,4],[7,6,7,7],[7,9,7,10],[0,2,1,4],[4,0,4,10],[5,0,8,0],[5,1,8,1],[5,2,5,10],[6,2,8,2],[6,3,6,4],[6,5,8,5],[6,6,6,7],[6,8,8,8]]}
["OTRAS TERCIARIAS NO UNIVERSITARIAS",null,"PERSONAL ACADÉMICO"]
[]
["Cuadro Nº II-6.3.2"]
[]
["PERSONAL DOCENTE DE FORMACIÓN EN EDUCACIÓN POR CARGA HORARIA SEMANAL, SEXO, SEGÚN INSTITUCIÓN Y FORMACIÓN. AÑO 2016."]
["INSTITUCIONES / FORMACIÓN","TOTAL","HORAS SEMANALES"]
[null,null,"Total","20 horas o menos",null,"Total","Entre 21 y 30 horas",null,"Total","31 horas y más"]
[null,null,null,"SEXO",null,null,"SEXO",null,null,"SEXO"]
[null,null,null,"M","F",null,"M","F",null,"M","F"]
["CIEP",{"$f":"C10+F10+I10","v":23},{"$f":"D10+E10","v":23},{"$f":"SUM(D11:D14)","v":4},{"$f":"SUM(E11:E14)","v":19},{"$f":"G10+H10","v":0},{"$f":"SUM(G11:G14)","v":0},{"$f":"SUM(H11:H14)","v":0},{"$f":"J10+K10","v":0},{"$f":"SUM(J11:J14)","v":0},{"$f":"SUM(K11:K14)","v":0}]
["Sin formación de grado completa",{"$f":"C11+F11+I11","v":0},{"$f":"D11+E11","v":0},0,0,{"$f":"G11+H11","v":0},0,0,{"$f":"J11+K11","v":0},0,0]
["Con formación de grado (incluye formación docente)",{"$f":"C12+F12+I12","v":19},{"$f":"D12+E12","v":19},2,17,{"$f":"G12+H12","v":0},0,0,{"$f":"J12+K12","v":0},0,0]
["Con posgrado de especialización o maestría",{"$f":"C13+F13+I13","v":3},{"$f":"D13+E13","v":3},2,1,{"$f":"G13+H13","v":0},0,0,{"$f":"J13+K13","v":0},0,0]
["Con doctorado",{"$f":"C14+F14+I14","v":1},{"$f":"D14+E14","v":1},0,1,{"$f":"G14+H14","v":0},0,0,{"$f":"J14+K14","v":0},0,0]
[]
["CENFORES -INAU ",{"$f":"C16+F16+I16","v":31},{"$f":"D16+E16","v":31},{"$f":"SUM(D17:D20)","v":3},{"$f":"SUM(E17:E20)","v":28},{"$f":"G16+H16","v":0},{"$f":"SUM(G17:G20)","v":0},{"$f":"SUM(H17:H20)","v":0},{"$f":"J16+K16","v":0},{"$f":"SUM(J17:J20)","v":0},{"$f":"SUM(K17:K20)","v":0}]
["Sin formación de grado completa",{"$f":"C17+F17+I17","v":31},{"$f":"D17+E17","v":31},3,28,{"$f":"G17+H17","v":0},0,0,{"$f":"J17+K17","v":0},0,0]
["Con formación de grado (incluye formación docente)",0,{"$f":"D18+E18","v":0},0,0,{"$f":"G18+H18","v":0},0,0,{"$f":"J18+K18","v":0},0,0]
["Con posgrado de especialización o maestría",0,{"$f":"D19+E19","v":0},0,0,{"$f":"G19+H19","v":0},0,0,{"$f":"J19+K19","v":0},0,0]
["Con doctorado",0,{"$f":"D20+E20","v":0},0,0,{"$f":"G20+H20","v":0},0,0,{"$f":"J20+K20","v":0},0,0]
["Fuente:  CENFORES - INAU"]
["            CIEP"]

{"sheet":"II-6.3.3","index":82,"n_rows":28,"n_cols":4,"rows_kept":28,"cut":false,"hidden":false,"merged":[[0,0,0,1],[0,3,1,4],[4,0,4,2],[5,0,6,0],[5,1,6,1],[5,2,6,2]]}
["ANEP - CONSEJO DE FORMACIÓN EN EDUCACIÓN",null,null,"ALUMNOS MATRICULADOS"]
[]
["Cuadro Nº II-6.3.3"]
[]
["ESTUDIANTES INGRESADOS Y MATRICULADOS EN FORMACIÓN EN EDUCACIÓN SEGÚN ORIGEN GEOGRÁFICO. AÑO 2016."]
["DEPARTAMENTO DONDE CURSÓ EL ÚLTIMO AÑO LICEAL","ESTUDIANTES INGRESADOS","ESTUDIANTES MATRICULADOS"]
[]
["TOTAL ","s/d",{"$f":"SUM(C9:C27)","v":24369}]
["Montevideo","s/d",9317]
["Artigas","s/d",557]
["Canelones","s/d",2702]
["Cerro Largo","s/d",937]
["Colonia","s/d",911]
["Durazno","s/d",417]
["Flores","s/d",173]
["Florida","s/d",651]
["Lavalleja","s/d",335]
["Maldonado","s/d",1212]
["Paysandú","s/d",1144]
["Río Negro","s/d",248]
["Rivera","s/d",1502]
["Rocha","s/d",543]
["Salto","s/d",1363]
["San José","s/d",362]
["Soriano","s/d",501]
["Tacuarembó","s/d",550]
["Treinta y Tres","s/d",944]
["Fuente: Institutos de Formación Docente"]

{"sheet":"EDUCACIÓN UNIVERSITARIA","index":83,"n_rows":69,"n_cols":2,"rows_kept":69,"cut":false,"hidden":false,"merged":[]}
[]
[]
[]
[]
[]
[]
["Cuadro II-7.1.1","ALUMNOS INGRESADOS, MATRICULADOS Y EGRESADOS EN PROGRAMAS DE GRADO POR SEXO SEGÚN GRANDES ÁREAS, DEPARTAMENTO E INSTITUCIÓN. AÑO 2016. "]
["Cuadro II-7.2.2","ALUMNOS INGRESADOS A CARRERAS 2015 Y EGRESADOS PRELIMINARES 2015 EN PROGRAMAS DE GRADO POR SEXO SEGÚN SERVICIO UNIVERSITARIO Y CARRERA. AÑO 2016."]
["Cuadro II-7.2.3","ALUMNOS INGRESADOS, MATRICULADOS Y EGRESADOS EN PROGRAMAS DE GRADO  EN UNIVERSIDADES PRIVADAS POR SEXO SEGÚN UNIVERSIDAD Y CARRERA. AÑO 2016. "]
["Cuadro II-7.2.4","ALUMNOS INGRESADOS, MATRICULADOS Y EGRESADOS EN PROGRAMAS DE GRADO DE INSTITUTOS UNIVERSITARIOS Y OFERTAS UNIVERSITAREAS DEL ÁREA SEGURIDAD Y DEFENSA POR SEXO SEGÚN INSTITUCIÓN Y CARRERA. AÑO 2016. "]
["Cuadro II-7.2.5","ALUMNOS INGRESADOS, MATRICULADOS Y EGRESADOS EN PROGRAMAS DE POSTGRADO POR SEXO SEGÚN INSTITUCIÓN. AÑO 2016. "]
["Cuadro II-7.2.6","ALUMNOS INGRESADOS 2015 Y EGRESADOS PRELIMINARES 2015 EN PROGRAMAS DE POSTGRADO DE LA UNIVERSIDAD DE LA REPÚBLICA POR SEXO SEGÚN SERVICIO UNIVERSITARIO Y ACREDITACIÓN. AÑO 2016."]
["Cuadro II-7.2.7","ALUMNOS INGRESADOS, MATRICULADOS Y EGRESADOS EN PROGRAMAS DE POSTGRADO DE UNIVERSIDADES PRIVADAS POR SEXO SEGÚN UNIVERSIDAD Y ACREDITACIÓN. AÑO 2016. "]
["Cuadro II-7.2.8","ALUMNOS INGRESADOS, MATRICULADOS Y EGRESADOS EN PROGRAMAS DE POSTGRADO DE INSTITUTOS UNIVERSITARIOS POR SEXO SEGÚN INSTITUTO UNIVERSITARIO Y ACREDITACIÓN. AÑO 2016. "]
["Cuadro II-7.2.9","EVOLUCIÓN DE LA MATRÍCULA DE LAS INSTITUCIONES UNIVERSITARIAS (2000 – 2016)"]
[""]
["Cuadro II-7.2.10","PERSONAL DOCENTE Y NO DOCENTE DE INSTITUCIONES UNIVERSITARIAS PUBLICAS Y PRIVADAS EXPRESADAS EN POSICIONES FUNCIONALES POR CARGA HORARIA SEMANAL SEGÚN INSTITUCIÓN, ACTIVIDAD Y SEXO. AÑO 2016. "]
["Cuadro II-7.2.11","ALUMNOS INGRESADOS Y MATRICULADOS DE GRADO EN UNIVERSIDADES E INSTITUTOS UNIVERSITARIOS, SEGÚN INSTITUCIÓN Y LUGAR DE ORIGEN. AÑO 2016. "]
[""]
[""]
[""]
[""]
[""]
[""]
[""]
[""]
[""]
[""]
[""]
[""]
[""]
[""]
[""]
[""]
[""]
[""]
[""]
[""]
[""]
[""]
[""]
[""]
[""]
[""]
[""]
[""]
[""]
[""]
[""]
[""]
[""]
[""]
[""]
[""]
[""]
[""]
[""]
[{"$f":"MID(B46,1,20)","v":""}]
[""]
[""]
[""]
[""]
[""]
[""]
[""]
[""]
[""]
[""]
[""]

{"sheet":"II-7.1.1  ","index":84,"n_rows":69,"n_cols":10,"rows_kept":69,"cut":false,"hidden":false,"merged":[[0,3,1,5],[4,0,4,10],[5,1,7,1],[5,2,5,3],[5,4,7,4],[5,5,5,6],[5,7,7,7],[5,8,5,9],[6,2,6,3],[6,5,6,6],[6,8,6,9],[66,0,66,2],[60,0,60,6],[61,0,61,6],[62,0,62,9],[64,0,64,9],[65,0,65,9]]}
["OFERTA UNIVERSITARIA DE GRADO",null,null,"INSTITUCIONES"]
[]
["Cuadro Nº II-7.1.1"]
[]
["ALUMNOS INGRESADOS, MATRICULADOS Y EGRESADOS EN PROGRAMAS DE GRADO POR SEXO SEGÚN GRANDES ÁREAS, DEPARTAMENTO E INSTITUCIÓN. AÑO 2016."]
["GRANDES ÁREAS / DEPARTAMENTO / INSTITUCIÓN","TOTAL","INGRESO",null,"TOTAL","MATRÍCULA ",null,"TOTAL","EGRESADOS "]
[null,null,"SEXO",null,null,"SEXO",null,null,"SEXO"]
[null,null,"M","F",null,"M","F",null,"M","F"]
["TOTAL PAÍS",{"$f":"+C9+D9","v":31879},{"$f":"+C13+C27","v":12500},{"$f":"+D13+D27","v":19379},{"$f":"+F9+G9","v":22711},{"$f":"+F13+F27","v":11539},{"$f":"+G13+G27","v":11172},{"$f":"+I9+J9","v":8703},{"$f":"+I13+I27","v":3117},{"$f":"+J13+J27","v":5586}]
["PÚBLICO",{"$f":"+C10+D10","v":28254},{"$f":"C14+C28","v":10668},{"$f":"D14+D28","v":17586},{"$f":"+F10+G10","v":358},{"$f":"F14+F28","v":231},{"$f":"G14+G28","v":127},{"$f":"+I10+J10","v":6630},{"$f":"I14+I28","v":2165},{"$f":"J14+J28","v":4465}]
["PRIVADO",3625,{"$f":"C15+C29","v":1832},{"$f":"D15+D29","v":1793},22353,{"$f":"F15+F29","v":11308},{"$f":"G15+G29","v":11045},2073,{"$f":"I15+I29","v":952},{"$f":"J15+J29","v":1121}]
[]
["MONTEVIDEO",{"$f":"SUM(C13:D13)","v":26987},{"$f":"C14+C15","v":10601},{"$f":"D14+D15","v":16386},{"$f":"SUM(F13:G13)","v":20581},{"$f":"SUM(F16:F26)","v":10574},{"$f":"SUM(G16:G26)","v":10007},{"$f":"SUM(I13:J13)","v":8055},{"$f":"I14+I15","v":2859},{"$f":"J14+J15","v":5196}]
["PÚBLICO",23680,{"$f":"C16+C26","v":8923},{"$f":"D16+D26","v":14757},0,{"$f":"F16+F26","v":0},{"$f":"G16+G26","v":0},6137,{"$f":"I16+I26","v":1967},{"$f":"J16+J26","v":4170}]
["PRIVADO",3307,{"$f":"SUM(C17:C25)","v":1678},{"$f":"SUM(D17:D25)","v":1629},20581,{"$f":"SUM(F17:F25)","v":10574},10007,1918,{"$f":"SUM(I17:I25)","v":892},1026]
["UdelaR *",{"$f":"SUM(C16:D16)","v":23680},8923,14757,"-","-","-",6137,1967,4170]
["UCUDAL",1114,466,648,{"$f":"SUM(F17:G17)","v":6542},2751,3791,708,268,440]
["Universidad ORT Uruguay",1034,569,465,7349,4268,3081,570,298,272]
["Universidad de Montevideo",421,181,240,2738,1271,1467,312,143,169]
["Universidad de la Empresa",458,289,169,3131,1810,1321,128,80,48]
["Inst Univ Asociación Cristiana de Jóvenes",202,145,57,541,386,155,138,92,46]
["Inst Metodista Univ Crandon ",1,0,1,48,3,45,0,0,0]
["Inst Univ Monseñor Mariano Soler ",19,16,3,71,64,7,9,9,0]
["Inst Univ CEDIIAP",36,6,30,107,8,99,44,2,42]
["Inst Univ CLAEH ",22,6,16,54,13,41,9,0,9]
["Escuela Nacional de Policía ***","-","-","-","-","-","-","-","-","-"]
["RESTO DEL PAÍS",{"$f":"+C27+D27","v":4892},{"$f":"C28+C29","v":1899},{"$f":"D28+D29","v":2993},{"$f":"+F27+G27","v":2130},{"$f":"F28+F29","v":965},{"$f":"G28+G29","v":1165},{"$f":"+I27+J27","v":648},{"$f":"I28+I29","v":258},{"$f":"J28+J29","v":390}]
["PÚBLICO",{"$f":"C28+D28","v":4574},{"$f":"C32+C34+C36+C43+C44+C46+C48+C50+C52+C55+C57+C59","v":1745},{"$f":"D32+D34+D36+D43+D44+D46+D48+D50+D52+D55+D57+D59","v":2829},{"$f":"F28+G28","v":358},{"$f":"F32+F34+F36+F43+F44+F46+F48+F50+F52+F55+F57+F59","v":231},{"$f":"G32+G34+G36+G43+G44+G46+G48+G50+G52+G55+G57+G59","v":127},{"$f":"I28+J28","v":493},{"$f":"I32+I34+I36+I43+I44+I46+I48+I50+I52+I55+I57+I59","v":198},{"$f":"J32+J34+J36+J43+J44+J46+J48+J50+J52+J55+J57+J59","v":295}]
["PRIVADO",{"$f":"C29+D29","v":318},{"$f":"C31+C37+C38+C39+C40+C41+C53","v":154},{"$f":"D31+D37+D38+D39+D40+D41+D53","v":164},{"$f":"F29+G29","v":1772},{"$f":"F31+F37+F38+F39+F40+F41+F53","v":734},{"$f":"G31+G37+G38+G39+G40+G41+G53","v":1038},{"$f":"I29+J29","v":155},{"$f":"I31+I37+I38+I39+I40+I41+I53","v":60},{"$f":"J31+J37+J38+J39+J40+J41+J53","v":95}]
["Colonia",{"$f":"SUM(C30:D30)","v":80},{"$f":"C31+C32","v":39},{"$f":"D31+D32","v":41},{"$f":"SUM(F30:G30)","v":239},{"$f":"F31+F32","v":90},{"$f":"G31+G32","v":149},{"$f":"SUM(I30:J30)","v":0},{"$f":"I31+I32","v":0},{"$f":"J31+J32","v":0}]
["Universidad de la Empresa",60,28,32,180,54,126,0,0,0]
["UTEC **",20,11,9,59,36,23,0,0,0]
["Durazno"]
["UTEC **",144,105,39,194,143,51,0,0,0]
["Maldonado",{"$f":"SUM(C35:D35)","v":1484},{"$f":"SUM(C36:C41)","v":631},{"$f":"SUM(D36:D41)","v":853},1053,{"$f":"SUM(F36:F41)","v":422},{"$f":"SUM(G36:G41)","v":631},161,{"$f":"SUM(I36:I41)","v":77},{"$f":"SUM(J36:J41)","v":84}]
["UdelaR ",1323,557,766,"-","-","-",83,51,32]
["UCUDAL",37,21,16,247,125,122,17,8,9]
["Inst Univ CLAEH ",57,17,40,307,110,197,30,8,22]
["Fundación Politécnico de Punta del Este",0,0,0,32,12,20,2,0,2]
["Inst Univ Francisco de Asís ",33,11,22,433,150,283,29,10,19]
["Inst Univ Asociación Cristiana de Jóvenes",34,25,9,34,25,9,0,0,0]
["Paysandú",1031,{"$f":"C43+C44","v":327},{"$f":"D43+D44","v":704},53,{"$f":"F43+F44","v":7},{"$f":"G43+G44","v":46},186,{"$f":"I43+I44","v":79},{"$f":"J43+J44","v":107}]
["UdelaR ",1007,323,684,0,"-","-",186,79,107]
["UTEC **",24,4,20,53,7,46,0,0,0]
["Río Negro"]
["UTEC **",{"$f":"SUM(C46:D46)","v":36},30,6,52,45,7,0,0,0]
["Rivera"]
["UdelaR ",347,135,212,"-","-","-",33,14,19]
["Rocha"]
["UdelaR ",230,77,153,"-","-","-",16,3,13]
["Salto",1239,{"$f":"C52+C53","v":434},{"$f":"D52+D53","v":805},539,{"$f":"F52+F53","v":258},{"$f":"G52+G53","v":281},217,{"$f":"I52+I53","v":72},{"$f":"J52+J53","v":145}]
["UdelaR ",1142,382,760,0,"-","-",140,38,102]
["UCUDAL",97,52,45,539,258,281,77,34,43]
["San José"]
["UdelaR ",17,15,2,"-","-","-",7,7,0]
["Tacuarembó"]
["UdelaR ",198,81,117,"-","-","-",26,4,22]
["Treinta y Tres"]
["UdelaR ",86,25,61,"-","-","-",2,2,0]
[]
["Fuente: Oficinas Productoras de cada una de las Instituciones. "]
["Nota: "]
["La expresión “Estudiantes” hace referencia a relaciones entre personas e instituciones y no al conteo de personas físicas. De manera que una persona puede ser estudiante de más de una institución o región, ostentando en cualquiera de ambas categorías inserciones múltiples y en cada caso será contada como personas diferentes."]
["Para UdelaR:"]
["Según Res. N°15 del CDC de fecha 23/10/12, se entiende por Generación de Ingreso a Carrera  a todos los estudiantes que ingresan por primera vez a una carrera terciaria y/o de grado, en un año dado. No se consideran los estudiantes que ingresan a la carrera a través de un CIO o de un ciclo básico común en años anteriores. No se incluyen los estudiantes provisorios por previas, ni los de intercambio. Se incluyen los estudiantes de cortesía diplomática."]
["* La matrícula de UdelaR corresponde al dato del VII Censo de estudiantes de grado 2012. Son 124.200 estudiantes en Montevideo (43.748 hombres y 80.452 mujeres ) y 6.741 en el Interior del país (2.272 hombres y 4.469 mujeres).  "]
["El dato de egreso 2016 de UdelaR es PRELIMINAR"]
["** La UTEC comenzó a dictar los cursos en el año 2014"]
["***  En 2016 la Licenciatura en Seguridad Pública no fue dictada."]

{"sheet":"II-7.2.2","index":85,"n_rows":437,"n_cols":7,"rows_kept":437,"cut":false,"hidden":false,"merged":[[434,0,434,6],[435,0,435,6],[437,0,437,6],[0,4,1,5],[4,0,4,6],[5,1,7,1],[5,2,5,3],[5,4,7,4],[5,5,5,6],[6,2,6,3],[6,5,6,6]]}
["UNIVERSIDADES PÚBLICAS: OFERTA DE GRADO",null,null,null,"ALUMNOS "]
[]
["Cuadro Nº II-7.2.2"]
[]
["UNIVERSIDADES PÚBLICAS:   ALUMNOS INGRESADOS A CARRERAS 2016 Y EGRESADOS PRELIMINARES 2016 EN PROGRAMAS DE GRADO POR SEXO,  SEGÚN SERVICIO UNIVERSITARIO Y CARRERA. "]
[null,"TOTAL","INGRESADOS (3)",null,"TOTAL","EGRESADOS (datos preliminares) (4)"]
["SERVICIO UNIVERSITARIO / CARRERA",null,"SEXO",null,null,"SEXO"]
[null,null,"M","F",null,"M","F"]
[]
["TOTAL UNIVERSIDADES PÚBLICAS",{"$f":"C10+D10","v":28254},{"$f":"C12+C25","v":10668},{"$f":"D12+D25","v":17586},{"$f":"F10+G10","v":6630},{"$f":"F12+F25","v":2165},{"$f":"G12+G25","v":4465}]
[]
["UNIVERSIDAD TECNOLÓGICA -UTEC *",{"$f":"C12+D12","v":224},{"$f":"C13+C16+C20+C22","v":150},{"$f":"D13+D16+D20+D22","v":74},{"$f":"F12+G12","v":0},{"$f":"F13+F16+F20+F22","v":0},{"$f":"G13+G16+G20+G22","v":0}]
["Colonia",{"$f":"C13+D13","v":20},{"$f":"C14+C15","v":11},{"$f":"D14+D15","v":9},{"$f":"F13+G13","v":0},{"$f":"F14+F15","v":0},{"$f":"G14+G15","v":0}]
["Licenciatura en Ciencias y Tecnología de Lácteos",14,8,6,0,0,0]
["Tecnólogo en Manejo de Sistemas de Producción Lechera",6,3,3,0,0,0]
["Durazno",144,{"$f":"C17+C18","v":105},{"$f":"D17+D18","v":39},0,{"$f":"F17+F18","v":0},{"$f":"G17+G18","v":0}]
["Ingeniería en Energías Renovables",43,36,7,0,0,0]
["Tecnicatura en Tecnologías de la Información",101,69,32,0,0,0]
["Paysandú"]
["Licenciatura en Análisis Alimentario",24,4,20,0,0,0]
["Río Negro"]
["Ingeniería en Mecatrónica",36,30,6,0,0,0]
[]
[]
["TOTAL UDELAR",{"$f":"SUM(C25:D25)","v":28030},{"$f":"C27+C51+C59+C67+C89+C105+C122+C130+C143+C155+C166+C172+C190+C204+C211+C221+C227+C239+C274+C291+C305+C324+C328+C336+C354+C358+C364+C367+C370++C383+C387+C391+C395+C398+C401+C405+C409+C421+C424","v":10518},{"$f":"D27+D51+D59+D67+D89+D105+D122+D130+D143+D155+D166+D172+D190+D204+D211+D221+D227+D239+D274+D291+D305+D324+D328+D336+D354+D358+D364+D367+D370++D383+D387+D391+D395+D398+D401+D405+D409+D421+D424","v":17512},{"$f":"SUM(F25:G25)","v":6630},{"$f":"F27+F51+F59+F67+F89+F105+F122+F130+F143+F155+F166+F172+F190+F204+F211+F221+F227+F239+F274+F291+F305+F324+F328+F336+F354+F358+F364+F367+F370++F383+F387+F391+F395+F398+F401+F405+F409+F421+F424","v":2165},{"$f":"G27+G51+G59+G67+G89+G105+G122+G130+G143+G155+G166+G172+G190+G204+G211+G221+G227+G239+G274+G291+G305+G324+G328+G336+G354+G358+G364+G367+G370++G383+G387+G391+G395+G398+G401+G405+G409+G421+G424","v":4465}]
[]
["FACULTAD DE HUMANIDADES Y CIENCIAS DE LA EDUCACIÓN",{"$f":"SUM(C27:D27)","v":1482},{"$f":"C28+C38+C40+C42+C45+C48","v":485},{"$f":"D28+D38+D40+D42+D45+D48","v":997},{"$f":"SUM(F27:G27)","v":97},{"$f":"F28+F38+F40+F42+F45+F48","v":28},{"$f":"G28+G38+G40+G42+G45+G48","v":69}]
["Montevideo",{"$f":"SUM(C28:D28)","v":1338},{"$f":"SUM(C29:C37)","v":432},{"$f":"SUM(D29:D37)","v":906},81,{"$f":"SUM(F29:F37)","v":25},{"$f":"SUM(G29:G37)","v":56}]
["Licenciado en Ciencias Antropológicas ",200,67,133,13,2,11]
["Licenciado en Ciencias de la Educación ",224,55,169,20,7,13]
["Licenciado en Historia ",164,96,68,3,3,0]
["Licenciado en Filosofía ",166,91,75,9,5,4]
["Licenciado en Letras ",173,52,121,5,1,4]
["Licenciado en Lingüística ",85,26,59,5,1,4]
["Técnico Universitario en Corrección de Estilo (Lengua Española)",263,35,228,15,2,13]
["Técnico Universitario en Interpretación LSU-ESP-LSU",63,10,53,1,0,1]
["Técnico Universitario en Museología",0,0,0,10,4,6]
["Maldonado",90,{"$f":"C39","v":39},{"$f":"D39","v":51},11,{"$f":"F39","v":3},{"$f":"G39","v":8}]
["Licenciado en Turismo",90,39,51,{"$f":"SUM(F39:G39)","v":11},3,8]
["Paysandú",23,{"$f":"C41","v":4},{"$f":"D41","v":19},0,{"$f":"F41","v":0},{"$f":"G41","v":0}]
["Técnico Universitario en Bienes Culturales ",{"$f":"SUM(C41:D41)","v":23},4,19,0,0,0]
["Salto",16,{"$f":"C43+C44","v":4},{"$f":"D43+D44","v":12},2,{"$f":"F43+F44","v":0},{"$f":"G43+G44","v":2}]
["Licenciado en Turismo ",5,3,2,2,0,2]
["Técnico Universitario en Interpretación LSU-ESP-LSU ",11,1,10,0,0,0]
["Tacuarembó",15,{"$f":"C46+C47","v":6},{"$f":"D46+D47","v":9},3,{"$f":"F46+F47","v":0},{"$f":"G46+G47","v":3}]
["Técnico Universitario en Bienes Culturales ",{"$f":"SUM(C46:D46)","v":15},6,9,0,0,0]
["Técnico Universitario en Interpretación LSU-ESP-LSU ",{"$f":"SUM(C47:D47)","v":0},0,0,3,0,3]
["Tacuarembó-Paysandú",{"$f":"SUM(C48:D48)","v":0},{"$f":"C49","v":0},{"$f":"D49","v":0},0,{"$f":"F49","v":0},{"$f":"G49","v":0}]
["Técnico Universitario en Prom. Bienes Culturales ",0,0,0,0,0,0]
[]
["FACULTAD DE AGRONOMÍA",{"$f":"SUM(C51:D51)","v":448},{"$f":"C52+C54+C56","v":280},{"$f":"D52+D54+D56","v":168},{"$f":"SUM(F51:G51)","v":145},{"$f":"F52+F54+F56","v":109},{"$f":"G52+G54+G56","v":36}]
["Montevideo",{"$f":"SUM(C52:D52)","v":355},{"$f":"C53","v":224},{"$f":"D53","v":131},{"$f":"SUM(F52:G52)","v":144},{"$f":"F53","v":108},{"$f":"G53","v":36}]
["Ingeniero Agrónomo",{"$f":"SUM(C53:D53)","v":355},224,131,{"$f":"SUM(F53:G53)","v":144},108,36]
["Salto",93,{"$f":"C55","v":56},{"$f":"D55","v":37},1,{"$f":"F55","v":1},{"$f":"G55","v":0}]
["Ingeniero Agrónomo ",93,56,37,1,1,0]
["Montevideo-Salto",0,{"$f":"C57","v":0},{"$f":"D57","v":0},0,{"$f":"F57","v":0},{"$f":"G57","v":0}]
["Ingeniero Agrónomo ",0,0,0,0,0,0]
[]
["FACULTAD DE ARQUITECTURA, DISEÑO Y URBANISMO",{"$f":"SUM(C59:D59)","v":962},{"$f":"C60+C64","v":336},{"$f":"D60+D64","v":626},{"$f":"SUM(F59:G59)","v":355},{"$f":"F60+F64","v":130},{"$f":"G60+G64","v":225}]
["Montevideo",{"$f":"SUM(C60:D60)","v":924},{"$f":"C61+C62+C63","v":321},{"$f":"D61+D62+D63","v":603},{"$f":"SUM(F60:G60)","v":355},{"$f":"F61+F62+F63","v":130},{"$f":"G61+G62+G63","v":225}]
["Arquitecto",649,263,386,329,127,202]
["Licenciado en Diseño Industrial perfil Producto",138,48,90,14,3,11]
["Licenciado en Diseño Industrial perfil Textil-Indumentaria",137,10,127,12,0,12]
["Salto",38,{"$f":"C65","v":15},{"$f":"D65","v":23},0,{"$f":"F65","v":0},{"$f":"G65","v":0}]
["Licenciado en Diseño Integrado",38,15,23,0,0,0]
[]
["FACULTAD DE CIENCIAS ECONÓMICAS Y ADMINISTRACIÓN",{"$f":"SUM(C67:D67)","v":5074},{"$f":"C68+C79+C81+C83+C85+C87","v":2163},{"$f":"D68+D79+D81+D83+D85+D87","v":2911},{"$f":"SUM(F67:G67)","v":1196},{"$f":"F68+F79+F81+F83+F85+F87","v":441},{"$f":"G68+G79+G81+G83+G85+G87","v":755}]
["Montevideo",{"$f":"C68+D68","v":4627},{"$f":"SUM(C69:C77)","v":1996},{"$f":"SUM(D69:D77)","v":2631},{"$f":"F68+G68","v":1182},{"$f":"SUM(F69:F77)","v":436},{"$f":"SUM(G69:G77)","v":746}]
["Contador Público (Plan 2012)",{"$f":"C69+D69","v":2024},917,1107,{"$f":"F69+G69","v":848},308,540]
["Licenciado en Economía (Plan 2012)",536,300,236,{"$f":"SUM(F70:G70)","v":133},65,68]
["Licenciado en Administración (Plan 2012)",744,313,431,{"$f":"SUM(F71:G71)","v":70},28,42]
["Licenciado en Administración - Contador (Plan 1990)",0,0,0,3,1,2]
["Licenciado en Estadística",0,0,0,3,2,1]
["Técnico en Gestión Universitaria",21,3,18,5,3,2]
["Técnico en Administración  ",1302,463,839,3,0,3]
["Técnico en Administración de Empresas",0,0,0,3,1,2]
["Técnico Universitario en Administración",0,0,0,114,28,86]
["Maldonado"]
["Tecnólogo en Administración y Contabilidad (Plan 2012)",272,101,171,4,3,1]
["Rocha"]
["Tecnólogo en Administración y Contabilidad (Plan 2012) ",39,14,25,0,0,0]
["Tacuarembó"]
["Tecnólogo en Administración y Contabilidad (Plan 2012) ",95,41,54,10,2,8]
["Treinta y Tres"]
["Tecnólogo en Administración y Contabilidad (Plan 2012) ",41,11,30,0,0,0]
["Treinta y Tres-Tacuarembó"]
["Tecnólogo en Administración y Contabilidad (Plan 2012) ",0,0,0,0,0,0]
[]
["FACULTAD DE DERECHO",2789,{"$f":"+C90+C98+C103","v":917},{"$f":"+D90+D98+D103","v":1872},965,238,727]
["Montevideo",2663,{"$f":"SUM(C91:C97)","v":875},{"$f":"SUM(D91:D97)","v":1788},929,{"$f":"SUM(F91:F97)","v":226},{"$f":"SUM(G91:G97)","v":703}]
["Doctor en Derecho ",4,2,2,351,116,235]
["Escribano Público",3,0,3,299,47,252]
["Doctor en Derecho-Escribano Público (*)",1310,425,885,0,0,0]
["Licenciado en Relaciones Internacionales",681,274,407,109,32,77]
["Traductor Público",39,11,28,25,2,23]
["Licenciado en Relaciones Laborales",626,163,463,136,27,109]
["Técnico en Relaciones Laborales",0,0,0,9,2,7]
["Salto",126,{"$f":"SUM(C99:C101)","v":42},{"$f":"SUM(D99:D101)","v":84},36,{"$f":"SUM(F99:F101)","v":12},{"$f":"SUM(G99:G101)","v":24}]
["Escribano Público ",0,0,0,19,4,15]
["Doctor en Derecho  ",0,0,0,17,8,9]
["Doctor en Derecho-Escribano Público  (*)",126,42,84,0,0,0]
["Montevideo-Salto"]
["Doctor en Derecho-Escribano Público (*)",0,0,0,0,0,0]
[]
["FACULTAD DE INGENIERÍA",{"$f":"SUM(C105:D105)","v":1604},{"$f":"+C106+C117+C118","v":1232},{"$f":"+D106+D117+D118","v":372},{"$f":"SUM(F105:G105)","v":309},{"$f":"+F106+F117+F118","v":237},{"$f":"+G106+G117+G118","v":72}]
["Montevideo",1552,{"$f":"SUM(C107:C115)","v":1193},{"$f":"SUM(D107:D115)","v":359},306,{"$f":"SUM(F107:F115)","v":235},{"$f":"SUM(G107:G115)","v":71}]
["Ingeniero Agrimensor",36,25,11,2,1,1]
["Ingeniero Civil",266,170,96,52,31,21]
["Ingeniero de Producción ",99,48,51,{"$f":"SUM(F109:G109)","v":0},0,0]
["Ingeniero Eléctrico",242,199,43,69,58,11]
["Ingeniero en Computación",656,557,99,138,105,33]
["Ingeniero Industrial Mecánico",205,164,41,42,37,5]
["Ingeniero Naval",22,15,7,0,0,0]
["Licenciado en  Ingeniería Biológica",18,9,9,0,0,0]
["Licenciado en Computación",8,6,2,3,3,0]
["Rocha"]
["Tecnólogo en Telecomunicaciones ",23,18,5,{"$f":"SUM(F117:G117)","v":3},2,1]
["Salto",29,{"$f":"C119+C120","v":21},{"$f":"D119+D120","v":8},0,{"$f":"F119+F120","v":0},{"$f":"G119+G120","v":0}]
["Licenciado en Ciencias Hídricas Aplicadas ",24,18,6,0,0,0]
["Licenciado en  Ingeniería Biológica ",5,3,2,0,0,0]
[]
["FACULTAD DE MEDICINA",{"$f":"SUM(C122:D122)","v":1768},{"$f":"SUM(C124+C126+C128)","v":533},{"$f":"SUM(D124+D126+D128)","v":1235},{"$f":"SUM(F122:G122)","v":681},{"$f":"SUM(F124+F126+F128)","v":196},{"$f":"SUM(G124+G126+G128)","v":485}]
["Montevideo"]
["Doctor en Medicina",{"$f":"SUM(C124:D124)","v":1768},533,1235,{"$f":"SUM(F124:G124)","v":675},195,480]
["Paysandú"]
["Doctor en Medicina",{"$f":"SUM(C126:D126)","v":0},0,0,3,1,2]
["Salto"]
["Doctor en Medicina",{"$f":"SUM(C128:D128)","v":0},0,0,3,0,3]
[]
["FACULTAD DE ODONTOLOGÍA ",{"$f":"SUM(C130:D130)","v":500},{"$f":"C131+C136+C139","v":94},{"$f":"D131+D136+D139","v":406},{"$f":"SUM(F130:G130)","v":266},{"$f":"F131+F136+F139","v":52},{"$f":"G131+G136+G139","v":214}]
["Montevideo",500,{"$f":" SUM(C132:C135)","v":94},{"$f":" SUM(D132:D135)","v":406},{"$f":"SUM(F131:G131)","v":244},{"$f":" SUM(F132:F135)","v":49},{"$f":" SUM(G132:G135)","v":195}]
["Doctor en Odontología",228,56,172,122,30,92]
["Laboratorista en Odontología",83,14,69,43,10,33]
["Asistente en Odontología",94,11,83,45,7,38]
["Higienista en Odontología",95,13,82,34,2,32]
["Rivera",0,{"$f":"C137+C138","v":0},{"$f":"D137+D138","v":0},5,{"$f":"F137+F138","v":1},{"$f":"G137+G138","v":4}]
["Asistente en Odontología ",0,0,0,1,0,1]
["Higienista en Odontología ",0,0,0,4,1,3]
["Salto",0,{"$f":"C140+C141","v":0},{"$f":"D140+D141","v":0},17,{"$f":"F140+F141","v":2},{"$f":"G140+G141","v":15}]
["Asistente en Odontología ",0,0,0,7,1,6]
["Higienista en Odontología",0,0,0,10,1,9]
[]
["FACULTAD DE QUÍMICA",{"$f":"SUM(C143:D143)","v":304},{"$f":"+C144+C150","v":88},{"$f":"+D144+D150","v":216},{"$f":"SUM(F143:G143)","v":92},{"$f":"+F144+F150","v":16},{"$f":"+G144+G150","v":76}]
["Montevideo",{"$f":"SUM(C144:D144)","v":281},{"$f":"SUM(C145:C149)","v":83},{"$f":"SUM(D145:D149)","v":198},92,{"$f":"SUM(F145:F149)","v":16},{"$f":"SUM(G145:G149)","v":76}]
["Bioquímico Clínico",{"$f":"SUM(C145:D145)","v":98},24,74,16,0,16]
["Químico",38,19,19,9,3,6]
["Químico Farmacéutico ",132,39,93,49,4,45]
["Licenciado en Química",9,1,8,13,7,6]
["Técnico Bachiller En Cs. Químicas",4,0,4,5,2,3]
["Salto",23,{"$f":"C151+C152+C153","v":5},{"$f":"D151+D152+D153","v":18},0,{"$f":"F151+F152+F153","v":0},{"$f":"G151+G152+G153","v":0}]
["Bioquímico Clínico ",4,1,3,0,0,0]
["Químico ",13,3,10,0,0,0]
["Químico Farmacéutico ",3,1,5,0,0,0]
[]
["FACULTAD DE VETERINARIA ",{"$f":"SUM(C155:D155)","v":654},{"$f":"C156+C160+C161+C165","v":228},{"$f":"D156+D160+D161+D165","v":426},{"$f":"SUM(F155:G155)","v":165},{"$f":"F156+F160+F161+F165","v":74},{"$f":"G156+G160+G161+G165","v":91}]
["Montevideo",{"$f":"SUM(C156:D156)","v":534},{"$f":"C157+C158","v":178},{"$f":"D157+D158","v":356},{"$f":"SUM(F156:G156)","v":125},{"$f":"F157+F158","v":47},{"$f":"G157+G158","v":78}]
["Doctor en Ciencias Veterinarias",534,178,356,120,46,74]
["Doctor en Medicina y Tecnología Veterinaria",0,0,0,5,1,4]
["Paysandú"]
["Doctor en Ciencias Veterinarias ",{"$f":"SUM(C160:D160)","v":0},0,0,{"$f":"SUM(F160:G160)","v":19},14,5]
["Salto",120,{"$f":"C162+C163","v":50},{"$f":"D162+D163","v":70},21,{"$f":"F162+F163","v":13},{"$f":"G162+G163","v":8}]
["Doctor en Ciencias Veterinarias ",120,50,70,20,13,7]
["Doctor en Medicina y Tecnología Veterinaria ",0,0,0,1,0,1]
["Montevideo-Salto"]
["Doctor en Ciencias Veterinarias ",{"$f":"SUM(C165:D165)","v":0},0,0,{"$f":"SUM(F165:G165)","v":0},0,0]
["FACULTAD DE INFORMACIÓN Y COMUNICACIÓN (F.I.C.) ",{"$f":"SUM(C166:D166)","v":848},{"$f":"SUM(C167:C170)","v":354},{"$f":"SUM(D167:D170)","v":494},{"$f":"SUM(F166:G166)","v":203},{"$f":"SUM(F167:F170)","v":61},{"$f":"SUM(G167:G170)","v":142}]
["Licenciado en Bibliotecología",65,20,45,17,3,14]
["Licenciado en Archivología ",43,13,30,0,0,0]
["Licenciado en Ciencias de la Comunicación",740,321,419,171,53,118]
["Archivólogo",0,0,0,15,5,10]
[]
["INSTITUTO ESCUELA NACIONAL DE BELLAS ARTES ",{"$f":"+C172+D172","v":631},{"$f":"C173+C184+C186+C188","v":196},{"$f":"D173+D184+D186+D188","v":435},{"$f":"+F172+G172","v":32},{"$f":"F173+F184+F186+F188","v":15},{"$f":"G173+G184+G186+G188","v":17}]
["Montevideo",{"$f":"+C173+D173","v":511},{"$f":"SUM(C174:C182)","v":153},{"$f":"SUM(D174:D182)","v":358},{"$f":"+F173+G173","v":30},{"$f":"SUM(F174:F182)","v":13},{"$f":"SUM(G174:G182)","v":17}]
["Licenciado en Artes - Ciclo Básico",487,136,351,0,0,0]
["Creador Plástico",0,0,0,7,3,4]
["Licenciado en Artes - Artes Plásticas y Visuales ",0,0,0,15,5,10]
["Licenciado en Artes - Dibujo y Pintura ",0,0,0,3,3,0]
["Licenciado en Artes - Cerámica",0,0,0,1,0,1]
["Licenciado en Artes - Diseño Gráfico ",0,0,0,1,0,1]
["Licenciado en Artes - Fotografía ",0,0,0,2,1,1]
["Licenciado en Artes - Escultura y Volumen en el Espacio",0,0,0,1,1,0]
["Licenciado en Arte Digital y Electrónico",24,17,7,0,0,0]
["Maldonado"]
["Licenciado en Lenguaje y Medios Audiovisuales ",67,32,35,2,2,0]
["Paysandú"]
["Técnico en Tecnologías de la Imagen Fotográfica ",33,8,25,0,0,0]
["Rocha"]
["Técnico en Artes Plásticas y Visuales ",20,3,17,0,0,0]
[]
["FACULTAD DE ENFERMERÍA ",{"$f":"SUM(C190:D190)","v":906},{"$f":"C192+C194+C196+C198+C200+C202","v":223},{"$f":"D192+D194+D196+D198+D200+D202","v":683},{"$f":"SUM(F190:G190)","v":221},{"$f":"F192+F194+F196+F198+F200+F202","v":31},{"$f":"G192+G194+G196+G198+G200+G202","v":190}]
["Montevideo"]
["Licenciado en Enfermería ",{"$f":"SUM(C192:D192)","v":645},169,476,160,22,138]
["Rivera"]
["Licenciado en Enfermería ",{"$f":"SUM(C194:D194)","v":147},30,117,{"$f":"SUM(F194:G194)","v":17},3,14]
["Rocha"]
["Licenciado en Enfermería ",0,0,0,{"$f":"SUM(F196:G196)","v":13},1,12]
["Salto"]
["Licenciado en Enfermería ",114,24,90,31,5,26]
["Montevideo-Rivera"]
["Licenciado en Enfermería ",{"$f":"SUM(C200:D200)","v":0},0,0,{"$f":"SUM(F200:G200)","v":0},0,0]
["Montevideo-Rocha"]
["Licenciado en Enfermería ",0,0,0,{"$f":"SUM(F202:G202)","v":0},0,0]
[]
["ESCUELA DE NUTRICIÓN ",456,{"$f":"+C206+C208","v":94},{"$f":"+D206+D208","v":362},{"$f":"+F204+G204","v":131},{"$f":"+F206+F208","v":10},{"$f":"+G206+G208","v":121}]
["Montevideo"]
["Licenciado en Nutrición ",441,92,349,{"$f":"+F206+G206","v":118},8,110]
["Tacuarembó"]
["Técnico Operador de Alimentos ",{"$f":"SUM(C208:D208)","v":15},2,13,{"$f":"SUM(F208:G208)","v":13},2,11]
[]
[]
["ESCUELA UNIVERSITARIA DE MÚSICA",{"$f":"SUM(C211:D211)","v":53},{"$f":"C212+C217","v":35},{"$f":"D212+D217","v":18},{"$f":"SUM(F211:G211)","v":10},{"$f":"F212+F217","v":6},{"$f":"G212+G217","v":4}]
["Montevideo",43,{"$f":"SUM(C213:C216)","v":30},{"$f":"SUM(D213:D216)","v":13},{"$f":"SUM(F212:G212)","v":10},{"$f":"SUM(F213:F216)","v":6},{"$f":"SUM(G213:G216)","v":4}]
["Licenciado en Música",19,14,5,3,3,0]
["Licenciado en Interpretación Musical",24,16,8,3,2,1]
["Licenciado en Musicología",0,0,0,3,1,2]
["Licenciado en Interpretación Instrumental",0,0,0,1,0,1]
["Salto",10,{"$f":"SUM(C218:C219)","v":5},{"$f":"SUM(D218:D219)","v":5},0,{"$f":"SUM(F218:F220)","v":0},{"$f":"SUM(G218:G220)","v":0}]
["Técnico en Interpretación",9,5,4,0,0,0]
["Técnico en Dirección de Coros ",1,0,1,0,0,0]
[]
["ESCUELA DE PARTERAS",{"$f":"SUM(C221:D221)","v":482},{"$f":"SUM(C223:C225)","v":49},{"$f":"SUM(D223:D225)","v":433},{"$f":"SUM(F221:G221)","v":61},{"$f":"SUM(F223:F225)","v":0},{"$f":"SUM(G223:G225)","v":61}]
["Montevideo"]
["Obstetra - Partera",{"$f":"SUM(C223:D223)","v":410},49,361,{"$f":"SUM(F223:G223)","v":33},0,33]
["Paysandú"]
["Licenciado en Obstetricia (Paysandú - Entre Ríos)",{"$f":"SUM(C225:D225)","v":72},0,72,{"$f":"SUM(F225:G225)","v":28},0,28]
[]
["FACULTAD DE PSICOLOGÍA",{"$f":"SUM(C227:D227)","v":2303},{"$f":"C228+C233+C235+C237","v":600},{"$f":"D228+D233+D235+D237","v":1703},{"$f":"SUM(F227:G227)","v":590},{"$f":"F228+F233+F235+F237","v":109},{"$f":"G228+G233+G235+G237","v":481}]
["Montevideo",{"$f":"SUM(C228:D228)","v":2189},{"$f":"C229+C230+C231","v":582},{"$f":"D229+D230+D231","v":1607},{"$f":"SUM(F228:G228)","v":587},{"$f":"F229+F230+F231","v":109},{"$f":"G229+G230+G231","v":478}]
["Licenciado en Psicología",2189,582,1607,586,108,478]
["Licenciado en Psicología (Plan 1988)",0,0,0,0,0,0]
["Psicólogo (Plan 1977)",0,0,0,1,1,0]
["Paysandú"]
["Licenciado en Psicología ",32,3,29,2,0,2]
["Salto"]
["Licenciado en Psicología",82,15,67,1,0,1]
["Montevideo-Salto"]
["Licenciado en Psicología",0,0,0,0,0,0]
[]
["ESCUELA UNIVERSITARIA DE TECNOLOGÍA MEDICA",{"$f":"SUM(C239:D239)","v":1209},{"$f":"C240+C262","v":274},{"$f":"D240+D262","v":935},{"$f":"SUM(F239:G239)","v":345},{"$f":"F240+F262","v":69},{"$f":"G240+G262","v":276}]
["Montevideo",925,{"$f":"SUM(C241:C260)","v":212},{"$f":"SUM(D241:D260)","v":713},276,{"$f":"SUM(F241:F260)","v":55},{"$f":"SUM(G241:G260)","v":221}]
["Licenciado en Fisioterapia",100,34,66,18,6,12]
["Licenciado en Fonoaudiología",38,2,36,18,2,16]
["Licenciado en Imagenología",112,49,63,70,35,35]
["Licenciado en Instrumentación Quirúrgica",50,5,45,18,0,18]
["Licenciado en Neumocardiología",44,10,34,5,2,3]
["Licenciado en Neurofisiología Clínica",45,11,34,6,0,6]
["Licenciado en Oftalmología ",38,9,29,4,0,4]
["Licenciado en Psicomotricidad",51,2,49,35,1,34]
["Licenciado en Registros Médicos",57,12,45,6,0,6]
["Licenciado en Terapia Ocupacional",20,3,17,11,0,11]
["Licenciado en Laboratorio Clínico",117,20,97,32,7,25]
["Tecnólogo en Salud Ocupacional",15,6,9,0]
["Técnico en Anatomía Patológica",35,7,28,11,1,10]
["Técnico en Hemoterapia",60,16,44,5,0,5]
["Técnico en Podología",41,6,35,6,0,6]
["Técnico en Radioisótopos",29,10,19,4,1,3]
["Tecnólogo en Cosmetología Médica",32,0,32,23,0,23]
["Tecnólogo en Radioterapia",41,10,31,3,0,3]
["Técnico en Radiología",0,0,0,0,0,0]
["Instrumentista Quirúrgico ",0,0,0,1,0,1]
[]
["Paysandú",284,{"$f":"SUM(C263:C272)","v":62},{"$f":"SUM(D263:D272)","v":222},69,{"$f":"SUM(F263:F272)","v":14},{"$f":"SUM(G263:G272)","v":55}]
["Licenciado en Fisioterapia ",58,21,37,7,2,5]
["Licenciado en Imagenología ",48,17,31,17,7,10]
["Licenciado en Instrumentación Quirúrgica ",10,0,10,2,2,0]
["Licenciado en Psicomotricidad ",36,2,34,4,0,4]
["Licenciado en Laboratorio Clínico ",22,4,18,8,0,8]
["Tecnólogo en Salud Ocupacional ",35,4,31,5,1,4]
["Técnico en Anatomía Patológica ",10,2,8,7,0,7]
["Técnico en Hemoterapia ",20,5,15,9,0,9]
["Técnico en Podología  ",45,7,38,10,2,8]
["Tecnólogo en Radioterapia ",0,0,0,0,0,0]
[]
["FACULTAD DE CIENCIAS",{"$f":"SUM(C274:D274)","v":649},{"$f":"C275+C284+C285+C289","v":337},{"$f":"D275+D284+D285+D289","v":312},{"$f":"SUM(F274:G274)","v":94},{"$f":"F275+F284+F285+F289","v":48},{"$f":"G275+G284+G285+G289","v":46}]
["Montevideo",{"$f":"SUM(C275:D275)","v":507},{"$f":"SUM(C276:C282)","v":275},{"$f":"SUM(D276:D282)","v":232},91,{"$f":"SUM(F276:F282)","v":46},{"$f":"SUM(G276:G282)","v":45}]
["Licenciado en Bioquímica",{"$f":"SUM(C276:D276)","v":77},32,45,30,9,21]
["Licenciado en Ciencias Biológicas",203,97,106,36,17,19]
["Licenciado en Ciencias Física ",93,74,19,5,4,1]
["Licenciado en Física ",0,0,0,1,1,0]
["Licenciado en Geografía",33,19,14,2,2,0]
["Licenciado en Geología ",33,15,18,10,7,3]
["Licenciado en Matemática",68,38,30,7,6,1]
["Maldonado"]
["Licenciado en Gestión Ambiental ",63,26,37,1,1,0]
["Rivera",58,{"$f":"C286+C287","v":24},{"$f":"D286+D287","v":34},2,{"$f":"F286+F287","v":1},{"$f":"G286+G287","v":1}]
["Licenciado en Recursos Naturales ",36,14,22,1,1,0]
["Técnico en Gestión de Recursos Naturales ",22,10,12,1,0,1]
["Rocha"]
["Licenciado en Gestión Ambiental ",21,12,9,0,0,0]
[]
["FACULTAD DE CIENCIAS SOCIALES",{"$f":"SUM(C291:D291)","v":1127},{"$f":"C292+C298+C303","v":258},{"$f":"D292+D298+D303","v":869},{"$f":"SUM(F291:G291)","v":258},{"$f":"F292+F298+F303","v":53},{"$f":"G292+G298+G303","v":205}]
["Montevideo",986,{"$f":"SUM(C293:C297)","v":233},{"$f":"SUM(D293:D297)","v":753},230,{"$f":"SUM(F293:F297)","v":48},{"$f":"SUM(G293:G297)","v":182}]
["Estudios Iniciales en CCSS",986,233,753,0,0,0]
["Licenciado en Ciencia Política",0,0,0,48,21,27]
["Licenciado en Sociología",0,0,0,31,8,23]
["Licenciado en Trabajo Social",0,0,0,135,11,124]
["Licenciado en Desarrollo",0,0,0,16,8,8]
["Salto",117,{"$f":"SUM(C299:C301)","v":18},{"$f":"SUM(D299:D301)","v":99},28,{"$f":"SUM(F299:F301)","v":5},{"$f":"SUM(G299:G301)","v":23}]
["Estudios Iniciales en CCSS ",117,18,99,0,0,0]
["Licenciado en Ciencias Sociales ",0,0,0,1,0,1]
["Licenciado en Trabajo Social ",0,0,0,27,5,22]
["Tacuarembó"]
["Tec. en Desarrollo Regional Sustentable ",24,7,17,0,0,0]
[]
["INSTITUTO SUPERIOR DE EDUCACIÓN FÍSICA",{"$f":"SUM(C305:D305)","v":949},{"$f":"C306+C310+C315+C318","v":542},{"$f":"D306+D310+D315+D318","v":407},{"$f":"SUM(F305:G305)","v":210},{"$f":"F306+F310+F315+F318","v":137},{"$f":"G306+G310+G315+G318","v":73}]
["Montevideo",{"$f":"SUM(C306:D306)","v":513},{"$f":"C307+C308+C309","v":294},{"$f":"D307+D308+D309","v":219},{"$f":"SUM(F306:G306)","v":99},{"$f":"F307+F308+F309","v":58},{"$f":"G307+G308+G309","v":41}]
["Licenciado en Educación Física",{"$f":"SUM(C307:D307)","v":412},203,209,84,43,41]
["Técnico Deportivo Sup. - Fútbol ",100,91,9,15,15,0]
["Técnico Deportivo Sup. - Básquetbol",1,0,1,0,0,0]
["Maldonado",274,{"$f":"SUM(C311:C314)","v":156},{"$f":"SUM(D311:D314)","v":118},53,{"$f":"SUM(F311:F314)","v":34},{"$f":"SUM(G311:G314)","v":19}]
["Licenciado en Educación Física ",199,101,98,41,27,14]
["Técnico Deportivo Sup. -  Atletismo ",75,55,20,{"$f":"SUM(F312:G312)","v":5},5,0]
["Técnico Deportivo Sup. - Voleibol ",0,0,0,{"$f":"SUM(F313:G313)","v":0},0,0]
["Técnico Deportivo Sup. - Actividades acuáticas ",0,0,0,7,2,5]
["Paysandú",162,{"$f":"C316+C317","v":92},{"$f":"D316+D317","v":70},49,{"$f":"F316+F317","v":36},{"$f":"G316+G317","v":13}]
["Licenciado en Educación Física",101,51,50,47,34,13]
["Técnico Deportivo Sup. - Básquetbol ",61,41,20,2,2,0]
["Rivera",0,{"$f":"SUM(C319:C322)","v":0},{"$f":"SUM(D319:D322)","v":0},9,{"$f":"SUM(F319:F322)","v":9},{"$f":"SUM(G319:G322)","v":0}]
["Técnico Deportivo Sup. - Basquetbol  ",0,0,0,1,1,0]
["Técnico Deportivo Sup. - Fútbol ",0,0,0,4,4,0]
["Técnico Deportivo Sup. - Handball ",0,0,0,3,3,0]
["Técnico Deportivo Sup. - Actividades acuáticas ",0,0,0,1,1,0]
[]
["Área Salud",{"$f":"SUM(C324:D324)","v":312},{"$f":"C326","v":87},{"$f":"D326","v":225},{"$f":"SUM(F324:G324)","v":0},{"$f":"F326","v":0},{"$f":"G326","v":0}]
[]
["Ciclo Inicial Optativo - Área Salud (Paysandú)",{"$f":"SUM(C326:D326)","v":312},87,225,{"$f":"SUM(F326:G326)","v":0},0,0]
[]
["Área Ciencias y Tecnología",{"$f":"SUM(C328:D328)","v":225},{"$f":"SUM(C330:C334)","v":97},{"$f":"SUM(D330:D334)","v":128},{"$f":"SUM(F328:G328)","v":0},{"$f":"SUM(F330:F334)","v":0},{"$f":"SUM(G330:G334)","v":0}]
[]
["Ciclo Inicial Optativo - Área Cs y Tec (Maldonado)",{"$f":"SUM(C330:D330)","v":82},41,41,{"$f":"SUM(F330:G330)","v":0},0,0]
["Ciclo Inicial Optativo - Área Cs y Tec (Rocha)",{"$f":"SUM(C331:D331)","v":30},9,21,{"$f":"SUM(F331:G331)","v":0},0,0]
["Ciclo Inicial Optativo - Área Cs y Tec (Salto)",{"$f":"SUM(C332:D332)","v":55},37,18,0,0,0]
["Ciclo Inicial Optativo - Área CCT Trayectoria Salud (Maldonado)",{"$f":"SUM(C333:D333)","v":34},5,29,0,0,0]
["Ciclo Inicial Optativo - Área CCT Trayectoria Salud (Rocha)",24,5,19,0,0,0]
[]
["Área Social",{"$f":"SUM(C336:D336)","v":752},{"$f":"C337+C341+C345+C350","v":209},{"$f":"D337+D341+D345+D350","v":543},{"$f":"SUM(F336:G336)","v":0},{"$f":"F337+F341+F345+F350","v":0},{"$f":"G337+G341+G345+G350","v":0}]
["Maldonado",{"$f":"SUM(C337:D337)","v":339},{"$f":"SUM(C338:C340)","v":100},{"$f":"SUM(D338:D340)","v":239},0,{"$f":"SUM(F338:F340)","v":0},{"$f":"SUM(G338:G340)","v":0}]
["Ciclo Inicial Optativo - Área Social Tray. Ciencias Sociales ",{"$f":"SUM(C338:D338)","v":37},9,28,0,0,0]
["Ciclo Inicial Optativo - Área Social Tray. Psicología ",{"$f":"SUM(C339:D339)","v":70},21,49,0,0,0]
["Ciclo Inicial Optativo - Área Social Tray. TAC ",232,70,162,0,0,0]
["Rocha",73,{"$f":"SUM(C342:C344)","v":16},{"$f":"SUM(D342:D344)","v":57},0,{"$f":"SUM(F342:F344)","v":0},{"$f":"SUM(G342:G344)","v":0}]
["Ciclo Inicial Optativo - Área Social Tray. Ciencias Sociales ",12,2,10,0,0,0]
["Ciclo Inicial Optativo - Área Social Tray. Psicología",9,2,7,0,0,0]
["Ciclo Inicial Optativo - Área Social Tray. TAC ",52,12,40,0,0,0]
["Salto",302,{"$f":"C346+C347+C348+C349","v":83},{"$f":"D346+D347+D348+D349","v":219},0,{"$f":"F346+F347+F348+F349","v":0},{"$f":"G346+G347+G348+G349","v":0}]
["Ciclo Inicial Optativo - Área Social Tray. Psicología ",{"$f":"SUM(C346:D346)","v":211},54,157,{"$f":"SUM(F346:G346)","v":0},0,0]
["Ciclo Inicial Optativo - Área Social Tray. Turismo ",{"$f":"SUM(C347:D347)","v":19},4,15,0,0,0]
["Ciclo Inicial Optativo - Área Social Tray. Ciencias de la Comunicación ",8,4,4,0,0,0]
["Ciclo Inicial Optativo - Área Social Tray. Ciencias Económicas ",64,21,43,0,0,0]
["Treinta y Tres",38,{"$f":"C351+C352","v":10},{"$f":"D351+D352","v":28},0,{"$f":"F351+F352","v":0},{"$f":"G351+G352","v":0}]
["Ciclo Inicial Optativo - Área Social Tray. TAC ",37,10,27,0,0,0]
["Ciclo Inicial Optativo - Área Social Tray. Turismo ",1,0,1,0,0,0]
[]
["Fac. Ciencias y Fac. Ingeniería ",{"$f":"SUM(C354:D354)","v":55},{"$f":"C355+C356","v":37},{"$f":"D355+D356","v":18},{"$f":"SUM(F354:G354)","v":2},{"$f":"F355+F356","v":1},{"$f":"G355+G356","v":1}]
["Licenciado en Ciencias de la Atmósfera ",{"$f":"SUM(C355:D355)","v":25},20,5,{"$f":"SUM(F355:G355)","v":1},0,1]
["Tecnólogo en Cartografía",{"$f":"SUM(C356:D356)","v":30},17,13,0,1,0]
[]
["Fac. Ingeniería y Fac. Química",{"$f":"SUM(C358:D358)","v":247},{"$f":"SUM(C359:C362)","v":111},{"$f":"SUM(D359:D362)","v":136},{"$f":"SUM(F358:G358)","v":57},{"$f":"SUM(F359:F362)","v":22},{"$f":"SUM(G359:G362)","v":35}]
["Montevideo"]
["Ingeniero Químico",{"$f":"SUM(C360:D360)","v":240},106,134,{"$f":"SUM(F360:G360)","v":57},22,35]
["Salto"]
["Ingeniero Químico ",{"$f":"SUM(C362:D362)","v":7},5,2,0,0,0]
[]
["Ciencias Económicas y Administración y Ciencias",{"$f":"SUM(C364:D364)","v":121},{"$f":"SUM(C365)","v":53},{"$f":"SUM(D365)","v":68},0,{"$f":"SUM(F365)","v":0},{"$f":"SUM(G365)","v":0}]
["Licenciado en Estadística (Plan 2014)",{"$f":"SUM(C365:D365)","v":121},53,68,0,0,0]
[]
["Fac. Ingeniería, Fac. Química, Fac. Agronomía y Fac. Veterinaria",{"$f":"SUM(C367:D367)","v":92},{"$f":"C369","v":25},{"$f":"D369","v":67},{"$f":"SUM(F367:G367)","v":23},{"$f":"F369","v":6},{"$f":"G369","v":17}]
["Montevideo"]
["Ingeniero Alimentario",{"$f":"SUM(C369:D369)","v":92},25,67,{"$f":"SUM(F369:G369)","v":23},6,17]
["Fac. Ciencias, Fac. Humanidades y Ciencias de la Educación, Fac. Medicina y Fac. Odontología",{"$f":"SUM(C370:D370)","v":113},{"$f":"SUM(C372:C380)","v":28},{"$f":"SUM(D372:D380)","v":85},{"$f":"SUM(F370:G370)","v":4},{"$f":"SUM(F372:F380)","v":2},{"$f":"SUM(G372:G380)","v":2}]
["Montevideo"]
["Licenciado en Biología Humana",{"$f":"SUM(C372:D372)","v":67},20,47,{"$f":"SUM(F372:G372)","v":4},2,2]
["Paysandú"]
["Licenciado en Biología Humana ",{"$f":"SUM(C374:D374)","v":5},0,5,{"$f":"SUM(F374:G374)","v":0},0,0]
["Rivera"]
["Licenciado en Biología Humana ",{"$f":"SUM(C376:D376)","v":23},6,17,{"$f":"SUM(F376:G376)","v":0},0,0]
["Salto"]
["Licenciado en Biología Humana ",{"$f":"SUM(C378:D378)","v":10},2,8,{"$f":"SUM(F378:G378)","v":0},0,0]
["Tacuarembó"]
["Licenciado en Biología Humana ",{"$f":"SUM(C380:D380)","v":8},0,8,{"$f":"SUM(F380:G380)","v":0},0,0]
[]
[]
["Fac. Agronomía, Fac. Ingeniería, C.E.T.P. - U.T.U.",{"$f":"SUM(C383:D383)","v":9},{"$f":"SUM(C385)","v":5},{"$f":"SUM(D385)","v":4},{"$f":"SUM(F383:G383)","v":0},{"$f":"SUM(F385)","v":0},{"$f":"SUM(G385)","v":0}]
["Rivera"]
["Tecnólogo en Madera ",{"$f":"SUM(C385:D385)","v":9},5,4,{"$f":"SUM(F385:G385)","v":0},0,0]
[]
["Fac. Agronomía, Fac. Arquitectura, Diseño y Urbanismo",{"$f":"SUM(C387:D387)","v":57},{"$f":"C389","v":17},{"$f":"D389","v":40},{"$f":"SUM(F387:G387)","v":4},{"$f":"SUM(F389)","v":2},{"$f":"SUM(G389)","v":2}]
["Maldonado"]
["Licenciatura en Diseño de Paisaje ",{"$f":"SUM(C389:D389)","v":57},17,40,{"$f":"SUM(F389:G389)","v":4},2,2]
[]
["Fac. Agronomía, Fac. Ingeniería, Fac. Química, Fac. Veterinaria y C.E.T.P. - U.T.U.",{"$f":"SUM(C391:D391)","v":7},{"$f":"SUM(C393)","v":4},{"$f":"SUM(D393)","v":3},{"$f":"SUM(F391:G391)","v":0},{"$f":"SUM(F393)","v":0},{"$f":"SUM(G393)","v":0}]
["Tacuarembó"]
["Tecnólogo Cárnico ",{"$f":"SUM(C393:D393)","v":7},4,3,{"$f":"SUM(F393:G393)","v":0},0,0]
[]
["I.E.N.B.A. y Fac. Arquitectura, Diseño y Urbanismo",{"$f":"SUM(C395:D395)","v":235},{"$f":"SUM(C396)","v":92},{"$f":"SUM(D396)","v":143},{"$f":"SUM(F395:G395)","v":2},{"$f":"SUM(F396)","v":0},{"$f":"SUM(G396)","v":2}]
["Licenciado en Diseño y Comunicación Visual",{"$f":"SUM(C396:D396)","v":235},92,143,{"$f":"SUM(F396:G396)","v":2},0,2]
[]
["Fac. Ciencias y Fac. Medicina",{"$f":"SUM(C398:D398)","v":38},{"$f":"SUM(C399)","v":16},{"$f":"SUM(D399)","v":22},{"$f":"SUM(F398:G398)","v":1},{"$f":"SUM(F399)","v":1},{"$f":"SUM(G399)","v":0}]
["Licenciado en Física Médica",{"$f":"SUM(C399:D399)","v":38},16,22,{"$f":"SUM(F399:G399)","v":1},1,0]
[]
["Agronomía, Ciencias e Ingeniería",{"$f":"SUM(C401:D401)","v":7},{"$f":"C403","v":4},{"$f":"D403","v":3},{"$f":"SUM(F401:G401)","v":2},{"$f":"F403","v":2},{"$f":"G403","v":0}]
["Treinta y Tres"]
["Tecnólogo Minero ",{"$f":"SUM(C403:D403)","v":7},4,3,{"$f":"SUM(F403:G403)","v":2},2,0]
[]
["Agronomía, Ingeniería y Química",{"$f":"SUM(C405:D405)","v":34},{"$f":"C407","v":21},{"$f":"D407","v":13},{"$f":"SUM(F405:G405)","v":0},{"$f":"F407","v":0},{"$f":"G407","v":0}]
["Tacuarembó"]
["Ingeniero Forestal ",{"$f":"SUM(C407:D407)","v":34},21,13,{"$f":"SUM(F407:G407)","v":0},0,0]
[]
["Ingeniería y CETP-UTU",{"$f":"SUM(C409:D409)","v":328},{"$f":"C410+C414+C415+C419","v":288},{"$f":"D410+D414+D415+D419","v":40},{"$f":"SUM(F409:G409)","v":67},{"$f":"F410+F414+F415+F419","v":61},{"$f":"G410+G414+G415+G419","v":6}]
["Montevideo",204,{"$f":"C411+C412","v":177},{"$f":"D411+D412","v":27},36,{"$f":"F411+F412","v":34},{"$f":"G411+G412","v":2}]
["Tecnólogo en Informática (1)",90,73,17,14,12,2]
["Tecnólogo Mecánico  (1)",114,104,10,22,22,0]
["Maldonado"]
["Tecnólogo en Informática   (1)",45,40,5,8,6,2]
["Paysandú",62,{"$f":"C416+C417","v":56},{"$f":"D416+D417","v":6},16,{"$f":"F416+F417","v":14},{"$f":"G416+G417","v":2}]
["Tecnólogo en Informática   (1)",37,32,5,13,11,2]
["Tecnólogo Mecánico   (1)",25,24,1,3,3,0]
["San José"]
["Tecnólogo en Informática  (1)",17,15,2,7,7,0]
[]
["ISEF y ANEP",110,{"$f":"C422","v":70},{"$f":"D422","v":40},0,{"$f":"F422","v":0},{"$f":"G422","v":0}]
["Licenciado en Educación Física (Rivera) (Plan 2014)",110,70,40,0,0,0]
[]
["Química y CETP-UTU",90,{"$f":"C425+C426","v":36},{"$f":"D425+D426","v":54},42,{"$f":"F425+F426","v":8},{"$f":"G425+G426","v":34}]
["Tecnólogo Químico   (1)",68,25,43,42,8,34]
["Tecnólogo Químico (Paysandú)  (1)",22,11,11,0,0,0]
[]
[]
[]
[]
["Bedelías de los Servicios Universitarios y Sistema de Gestión de Bedelías-SeCIU, UdelaR."]
["Notas: "]
["(*) Los estudiantes presentan inscripción simultánea a las dos carreras (Dr. en Derecho - Escribano Público)."]
["(1) Carrera compartida con CETP-UTU (Consejo de Educación Técnico Profesional – Universidad del Trabajo del Uruguay)."]
["(2) L.S.U.: Lenguaje de Señas Uruguayas."]
["(3) Según Res. N°15 del CDC de fecha 23/10/12, se entiende por Generación de Ingreso a Carrera  a todos los estudiantes que ingresan por primera vez a una carrera terciaria y/o de grado, en un año dado. No se consideran los estudiantes que ingresan a la carrera a través de un CIO o de un ciclo básico común en años anteriores. No se incluyen los estudiantes provisorios por previas, ni los de intercambio. Se incluyen los estudiantes de cortesía diplomática."]
["(4) El dato de egreso de UdelaR 2016 es PRELIMINAR"]

{"sheet":"II-7.2.3 ","index":86,"n_rows":190,"n_cols":32,"rows_kept":190,"cut":false,"hidden":false,"merged":[[6,5,6,6],[6,8,6,9],[0,5,1,8],[4,0,4,9],[5,0,7,0],[5,1,7,1],[5,2,5,3],[5,4,7,4],[5,5,5,6],[5,7,7,7],[5,8,5,9],[6,2,6,3]]}
["UNIVERSIDADES PRIVADAS: OFERTA DE GRADO"]
[]
["Cuadro Nº II-7.2.3"]
[]
["ALUMNOS INGRESADOS, MATRICULADOS Y EGRESADOS EN PROGRAMAS DE GRADO EN UNIVERSIDADES PRIVADAS POR SEXO SEGÚN UNIVERSIDAD Y CARRERA. AÑO 2016."]
["UNIVERSIDAD / CARRERA","TOTAL","INGRESADOS",null,"TOTAL","MATRICULADOS",null,"TOTAL","EGRESADOS"]
[null,null,"SEXO",null,null,"SEXO",null,null,"SEXO"]
[null,null,"    M","   F",null,"M","F",null,"M","F"]
["TOTAL",{"$f":"SUM(C9:D9)","v":3221},{"$f":"C11+C89+C121+C151","v":1606},{"$f":"+D11+D89+D121+D151","v":1615},{"$f":"SUM(F9:G9)","v":20726},{"$f":"+F11+F89+F121+F151","v":10537},{"$f":"+G11+G89+G121+G151","v":10189},{"$f":"SUM(I9:J9)","v":1812},{"$f":"+I11+I89+I121+I151","v":831},{"$f":"+J11+J89+J121+J151","v":981},null,null,null,null,null,null,null,null,null,null,null,null,null,null,null,null,null,{"$f":"+AE9+AF9","v":3},null,null,1,2]
[null,null,null,null,null,null,null,null,null,null,null,null,null,null,null,null,null,null,null,null,null,null,null,null,null,null,null,{"$f":"+AE10+AF10","v":24},null,null,10,14]
["UCUDAL",{"$f":"SUM(C11:D11)","v":1248},{"$f":"+C13+C28+C53+C67+C71+C79+C85","v":539},{"$f":"D13+D28+D53+D67+D71+D79+D85","v":709},{"$f":"SUM(F11:G11)","v":7328},{"$f":"+F13+F28+F53+F67+F71+F79+F85","v":3134},{"$f":"+G13+G28+G53+G67+G71+G79+G85","v":4194},{"$f":"SUM(I11:J11)","v":802},{"$f":"+I13+I28+I53+I67+I71+I79+I85","v":310},{"$f":"+J13+J28+J53+J67+J71+J79+J85","v":492}]
[]
["FACULTAD DE CIENCIAS HUMANAS",{"$f":"SUM(C13:D13)","v":194},{"$f":"SUM(C14:C26)","v":66},{"$f":"SUM(D14:D26)","v":128},{"$f":"SUM(F13:G13)","v":1084},{"$f":"SUM(F14:F26)","v":357},{"$f":"SUM(G14:G26)","v":727},{"$f":"SUM(I13:J13)","v":131},{"$f":"SUM(I14:I26)","v":40},{"$f":"SUM(J14:J26)","v":91}]
["Técnico en Educación, Tiempo Libre y Recreación",{"$f":"SUM(C14:D14)","v":0},0,0,7,3,4,3,1,2]
["Técnico en Recreación Educativa",10,6,4,24,16,8,2,1,1]
["Técnico en Educación Social",0,0,0,3,2,1,2,1,1]
["Licenciatura en Comunicación",102,38,64,655,234,421,93,31,62]
["Licenciatura en Ciencias Sociales",0,0,0,35,13,22,4,3,1]
["Licenciatura en Ciencia Política",7,4,3,16,8,8,2,0,2]
["Licenciatura en Trabajo Social",10,2,8,23,4,19,2,0,2]
["Licenciatura en Sociología",6,2,4,24,8,16,3,0,3]
["Licenciatura en Educación Inicial",29,1,28,161,3,158,14,1,13]
["Licenciatura en Educación énfasis en Tiempo Libre y Recreación",0,0,0,55,26,29,6,2,4]
["Licenciatura en Recreación Educativa",11,8,3,47,29,18,0,0,0]
["Licenciatura en Educación Social",0,0,0,2,0,2,0,0,0]
["Licenciatura en Artes Visuales",19,5,14,32,11,21,0,0,0]
[]
["FACULTAD DE CIENCIAS EMPRESARIALES",{"$f":"SUM(C28:D28)","v":451},{"$f":"+C29+C37+C45","v":251},{"$f":"+D29+D37+D45","v":200},{"$f":"SUM(F28:G28)","v":2911},{"$f":"+F29+F37+F45","v":1485},{"$f":"+G29+G37+G45","v":1426},{"$f":"SUM(I28:J28)","v":368},{"$f":"+I29+I37+I45","v":161},{"$f":"+J29+J37+J45","v":207}]
["Montevideo",{"$f":"SUM(C29:D29)","v":326},{"$f":"SUM(C30:C36)","v":184},{"$f":"SUM(D30:D36)","v":142},{"$f":"SUM(F29:G29)","v":2151},{"$f":"SUM(F30:F36)","v":1123},{"$f":"SUM(G30:G36)","v":1028},{"$f":"SUM(I29:J29)","v":274},{"$f":"SUM(I30:I36)","v":119},{"$f":"SUM(J30:J36)","v":155}]
["Licenciatura en Dirección de Empresas",76,50,26,442,271,171,59,26,33]
["Licenciatura en Dirección de Empresas Turísticas",21,10,11,126,52,74,19,9,10]
["Licenciatura en Negocios Internacionales",49,33,16,452,262,190,68,32,36]
["Contador Público",121,63,58,823,394,429,97,41,56]
["Licenciatura en Economía",22,12,10,150,96,54,16,11,5]
["Licenciatura en Gestión Humana",16,3,13,137,35,102,15,0,15]
["Licenciatura en Gestión Logística",21,13,8,21,13,8,0,0,0]
["Maldonado",{"$f":"SUM(B38:B43)","v":36},{"$f":"SUM(C38:C44)","v":21},{"$f":"SUM(D38:D44)","v":16},246,{"$f":"SUM(F38:F44)","v":125},{"$f":"SUM(G38:G44)","v":122},17,{"$f":"SUM(I38:I44)","v":8},{"$f":"SUM(J38:J44)","v":9}]
["Licenciatura en Dirección de Empresas",20,13,7,95,53,42,2,1,1]
["Contador Público",12,4,8,142,65,77,15,7,8]
["Licenciatura en Negocios Internacionales",2,1,1,7,4,3,0,0,0]
["Licenciatura en Dirección de Empresas Turísticas",1,1,0,1,1,0,0,0,0]
["Licenciatura en Economía",1,1,0,1,1,0,0,0,0]
["Licenciatura en Gestión Humana",0,0,0,0,0,0,0,0,0]
["Licenciatura en Gestión Logística",1,1,0,1,1,0,0,0,0]
["Salto",{"$f":"SUM(B46:B51)","v":88},46,42,513,237,276,77,34,43]
["Licenciatura en Dirección de Empresas",16,12,4,86,38,48,15,9,6]
["Contador Público",65,32,33,406,191,215,58,23,35]
["Licenciatura en Negocios Internacionales",2,0,2,5,0,5,0,0,0]
["Licenciatura en Producción y Gestión Agrícola",4,2,2,15,8,7,4,2,2]
["Licenciatura en Gestión Logística",0,0,0,0,0,0,0,0,0]
["Licenciatura en Dirección de Empresas Turísticas",1,0,1,1,0,1,0,0,0]
[]
["FACULTAD DE INGENIERÍA Y TECNOLOGÍAS",{"$f":"B54+B63","v":170},{"$f":"C54+C63","v":120},{"$f":"D54+D63","v":50},1052,802,250,83,65,18]
["Montevideo",{"$f":"SUM(B55:B62)","v":161},{"$f":"SUM(C55:C62)","v":114},{"$f":"SUM(D55:D62)","v":47},1026,781,245,83,65,18]
["Ingeniería en Informática",{"$f":"SUM(C55:D55)","v":51},41,10,{"$f":"SUM(F55:G55)","v":346},298,48,{"$f":"SUM(I55:J55)","v":25},20,5]
["Ingeniería en Electrónica",8,8,0,71,59,12,1,0,1]
["Ingeniería en Telecomunicación",8,6,2,59,41,18,7,4,3]
["Ingeniería Industrial",42,31,11,206,170,36,13,12,1]
["Ingeniería en Sistémas Eléctricos de Potencia",13,9,4,44,36,8,7,7,0]
["Licenciatura en Informática",11,11,0,94,80,14,24,19,5]
["Licenciatura en Ingeniería Audiovisual",11,6,5,112,77,35,6,3,3]
["Ingeniería en Alimentos",17,2,15,94,20,74,0,0,0]
["Salto",{"$f":"SUM(B64:B65)","v":9},{"$f":"SUM(C64:C65)","v":6},3,26,21,5,0,0,0]
["Ingeniería en Informática",3,3,0,7,6,1,0,0,0]
["Licenciatura en Informática",6,3,3,19,15,4,0,0,0]
[]
["FACULTAD DE DERECHO",{"$f":"SUM(C67:D67)","v":53},{"$f":"C68+C69","v":19},{"$f":"D68+D69","v":34},{"$f":"SUM(F67:G67)","v":341},{"$f":"F68+F69","v":148},{"$f":"G68+G69","v":193},{"$f":"SUM(I67:J67)","v":30},{"$f":"I68+I69","v":16},{"$f":"J68+J69","v":14}]
["Dr. en Derecho",{"$f":"SUM(C68:D68)","v":38},14,24,{"$f":"SUM(F68:G68)","v":270},123,147,{"$f":"SUM(I68:J68)","v":30},16,14]
["Notariado",{"$f":"SUM(C69:D69)","v":15},5,10,{"$f":"SUM(F69:G69)","v":71},25,46,{"$f":"SUM(I69:J69)","v":0},0,0]
[]
["FACULTAD DE PSICOLOGÍA",{"$f":"SUM(C71:D71)","v":240},{"$f":"SUM(C72:C77)","v":43},{"$f":"SUM(D72:D77)","v":197},{"$f":"SUM(F71:G71)","v":1284},{"$f":"SUM(F72:F77)","v":210},{"$f":"SUM(G72:G77)","v":1074},{"$f":"SUM(I71:J71)","v":117},{"$f":"SUM(I72:I77)","v":16},{"$f":"SUM(J72:J77)","v":101}]
["Técnico en Acompañamiento Terapéutico",17,4,13,41,7,34,4,1,3]
["Licenciatura en Psicología",118,26,92,741,157,584,66,11,55]
["Licenciatura en Psicopedagogía",45,3,42,210,8,202,16,0,16]
["Licenciatura en Fonoaudiología",9,1,8,41,3,38,2,0,2]
["Licenciatura en Seguridad y Salud Ocupacional",17,8,9,50,27,23,0,0,0]
["Licenciatura en Psicomotricidad",34,1,33,201,8,193,29,4,25]
[]
["FACULTAD DE ENFERMERÍA Y TECNOLOGÍAS DE LA SALUD",{"$f":"SUM(C79:D79)","v":105},{"$f":"SUM(C80:C83)","v":29},{"$f":"SUM(D80:D83)","v":76},{"$f":"SUM(F79:G79)","v":548},{"$f":"SUM(F80:F83)","v":113},{"$f":"SUM(G80:G83)","v":435},{"$f":"SUM(I79:J79)","v":70},{"$f":"SUM(I80:I83)","v":12},{"$f":"SUM(J80:J83)","v":58}]
["Licenciatura en Enfermería",9,2,7,72,8,64,17,0,17]
["Licenciatura en Enfermería - Profesionalización",15,0,15,79,8,71,24,4,20]
["Licenciatura en Nutrición",31,4,27,224,29,195,18,2,16]
["Licenciatura en Fisioterapia",50,23,27,173,68,105,11,6,5]
[]
["FACULTAD DE ODONTOLOGÍA ",{"$f":"SUM(C85:D85)","v":35},{"$f":"C86+C87","v":11},{"$f":"D86+D87","v":24},{"$f":"SUM(F85:G85)","v":108},{"$f":"F86+F87","v":19},{"$f":"G86+G87","v":89},{"$f":"SUM(I85:J85)","v":3},{"$f":"I86+I87","v":0},{"$f":"J86+J87","v":3}]
["Asistente Dental",{"$f":"SUM(C86:D86)","v":3},1,2,{"$f":"SUM(F86:G86)","v":6},1,5,{"$f":"SUM(I86:J86)","v":0},0,0]
["Dr. En Odontología",{"$f":"SUM(C87:D87)","v":32},10,22,{"$f":"SUM(F87:G87)","v":102},18,84,{"$f":"SUM(I87:J87)","v":3},0,3]
[]
["UNIVERSIDAD ORT URUGUAY",{"$f":"SUM(C89:D89)","v":1034},{"$f":"+C91+C97+C101+C109","v":569},{"$f":"+D91+D97+D101+D109","v":465},{"$f":"SUM(F89:G89)","v":7349},{"$f":"+F91+F97+F101+F109","v":4268},{"$f":"+G91+G97+G101+G109","v":3081},{"$f":"SUM(I89:J89)","v":570},{"$f":"+I91+I97+I101+I109","v":298},{"$f":"+J91+J97+J101+J109","v":272}]
[null,null,null,null,null,null,null,null,null,null,null,null,null,null,null,null,null,null,null,null,null,null,null,null,null,null,null,null,null,null,17,15]
["FACULTAD DE ADMINISTRACIÓN Y CIENCIAS SOCIALES",{"$f":"SUM(C91:D91)","v":373},{"$f":"SUM(C92:C95)","v":192},{"$f":"SUM(D92:D95)","v":181},{"$f":"SUM(F91:G91)","v":2395},{"$f":"SUM(F92:F95)","v":1359},{"$f":"SUM(G92:G95)","v":1036},{"$f":"SUM(I91:J91)","v":226},{"$f":"SUM(I92:I95)","v":117},{"$f":"SUM(J92:J95)","v":109},null,null,null,null,null,null,null,null,null,null,null,null,null,null,null,null,null,null,null,null,22,33]
["Licenciatura en Gerencia y Administración",{"$f":"SUM(C92:D92)","v":181},95,86,{"$f":"SUM(F92:G92)","v":1130},686,444,{"$f":"SUM(I92:J92)","v":100},53,47]
["Licenciatura en Estudios Internacionales",{"$f":"SUM(C93:D93)","v":59},25,34,{"$f":"SUM(F93:G93)","v":355},164,191,{"$f":"SUM(I93:J93)","v":40},13,27]
["Licenciatura en Economía",{"$f":"SUM(C94:D94)","v":30},21,9,{"$f":"SUM(F94:G94)","v":168},111,57,{"$f":"SUM(I94:J94)","v":15},8,7]
["Contador Público",{"$f":"SUM(C95:D95)","v":103},51,52,{"$f":"SUM(F95:G95)","v":742},398,344,{"$f":"SUM(I95:J95)","v":71},43,28]
[]
["FACULTAD DE ARQUITECTURA",{"$f":"SUM(C97:D97)","v":92},{"$f":"SUM(C98:C99)","v":30},{"$f":"SUM(D98:D99)","v":62},{"$f":"SUM(F97:G97)","v":735},{"$f":"SUM(F98:F99)","v":248},{"$f":"SUM(G98:G99)","v":487},{"$f":"SUM(I97:J97)","v":66},{"$f":"SUM(I98:I99)","v":23},{"$f":"SUM(J98:J99)","v":43}]
["Arquitectura",{"$f":"SUM(C98:D98)","v":61},25,36,{"$f":"SUM(F98:G98)","v":515},220,295,{"$f":"SUM(I98:J98)","v":55},22,33]
["Licenciatura en Diseño de Interiores",{"$f":"SUM(C99:D99)","v":31},5,26,{"$f":"SUM(F99:G99)","v":220},28,192,{"$f":"SUM(I99:J99)","v":11},1,10]
[]
["FACULTAD DE COMUNICACIÓN Y DISEÑO",{"$f":"SUM(C101:D101)","v":265},{"$f":"SUM(C102:C107)","v":122},{"$f":"SUM(D102:D107)","v":143},{"$f":"SUM(F101:G101)","v":1728},{"$f":"SUM(F102:F107)","v":710},{"$f":"SUM(G102:G107)","v":1018},{"$f":"SUM(I101:J101)","v":113},{"$f":"SUM(I102:I107)","v":35},{"$f":"SUM(J102:J107)","v":78}]
["Licenciatura en Comunicación",69,36,33,586,246,340,46,16,30]
["Licenciatura en Diseño Gráfico",66,25,41,444,161,283,42,14,28]
["Licenciatura en Diseño de Modas",34,1,33,204,5,199,10,0,10]
["Licenciatura en Diseño Industrial",26,13,13,143,65,78,9,2,7]
["Licenciatura en Diseño Multimedia",27,13,14,145,85,60,2,1,1]
["Licenciatura en Animación y Videojuegos",43,34,9,206,148,58,4,2,2]
[]
["FACULTAD DE INGENIERÍA",{"$f":"SUM(C109:D109)","v":304},{"$f":"SUM(C110:C119)","v":225},{"$f":"SUM(D110:D119)","v":79},{"$f":"SUM(F109:G109)","v":2491},{"$f":"SUM(F110:F119)","v":1951},{"$f":"SUM(G110:G119)","v":540},{"$f":"SUM(I109:J109)","v":165},{"$f":"SUM(I110:I119)","v":123},{"$f":"SUM(J110:J119)","v":42}]
["Licenciatura en Sistemas",79,62,17,830,698,132,39,30,9]
["Ingeniería en Telecomunicaciones",10,9,1,125,108,17,7,6,1]
["Ingeniería en Sistemas",146,118,28,1109,932,177,74,64,10]
["Ingeniería en Electrónica",16,14,2,119,104,15,9,9,0]
["Licenciatura  en Electrónica",1,1,0,1,1,0,0,0,0]
["Licenciatura en  Telecomunicaciones",2,2,0,3,3,0,2,2,0]
["Licenciatura en Biotecnología",10,2,8,132,40,92,4,0,4]
["Ingeniería en Biotecnología",34,12,22,158,53,105,19,4,15]
["Técnico Biotecnólogo (terciaria)",0,0,0,4,3,1,7,4,3]
["Licenciatura en Ingeniería de Software",6,5,1,10,9,1,4,4,0]
[]
["UNIVERSIDAD DE MONTEVIDEO",{"$f":"SUM(C121:D121)","v":421},{"$f":"+C123+C129+C135+C144+C148","v":181},{"$f":"+D123+D129+D135+D144+D148","v":240},{"$f":"SUM(F121:G121)","v":2738},{"$f":"+F123+F129+F135+F144+F148","v":1271},{"$f":"+G123+G129+G135+G144+G148","v":1467},{"$f":"SUM(I121:J121)","v":312},{"$f":"+I123+I129+I135+I144+I148","v":143},{"$f":"+J123+J129+J135+J144+J148","v":169}]
[]
["FACULTAD DE CIENCIAS EMPRESARIALES Y ECONOMÍA",{"$f":"SUM(C123:D123)","v":183},{"$f":"SUM(C124:C127)","v":87},{"$f":"SUM(D124:D127)","v":96},{"$f":"SUM(F123:G123)","v":1203},{"$f":"SUM(F124:F127)","v":613},{"$f":"SUM(G124:G127)","v":590},{"$f":"SUM(I123:J123)","v":129},{"$f":"SUM(I124:I127)","v":68},{"$f":"SUM(J124:J127)","v":61}]
["Carrera de Contador Público",{"$f":"SUM(C124:D124)","v":61},27,34,{"$f":"SUM(F124:G124)","v":543},266,277,{"$f":"SUM(I124:J124)","v":61},32,29]
["Lic. en Dir. y Administrac. de Empresas",{"$f":"SUM(C125:D125)","v":52},31,21,{"$f":"SUM(F125:G125)","v":286},165,121,{"$f":"SUM(I125:J125)","v":20},14,6]
["Licenciatura en Economía",44,20,24,{"$f":"SUM(F126:G126)","v":199},110,89,28,18,10]
["Licenciatura en Negocios Internacionales",26,9,17,{"$f":"SUM(F127:G127)","v":175},72,103,20,4,16]
[]
["FACULTAD DE INGENIERÍA",{"$f":"SUM(C129:D129)","v":72},{"$f":"SUM(C130:C133)","v":57},{"$f":"SUM(D130:D133)","v":15},{"$f":"SUM(F129:G129)","v":500},{"$f":"SUM(F130:F133)","v":363},{"$f":"SUM(G130:G133)","v":137},{"$f":"SUM(I129:J129)","v":50},{"$f":"SUM(I130:I133)","v":34},{"$f":"SUM(J130:J133)","v":16}]
["Ingeniería Civil",{"$f":"SUM(C130:D130)","v":21},13,8,{"$f":"SUM(F130:G130)","v":198},127,71,{"$f":"SUM(I130:J130)","v":24},13,11]
["Ingeniería Industrial",{"$f":"SUM(C131:D131)","v":35},29,6,{"$f":"SUM(F131:G131)","v":204},161,43,{"$f":"SUM(I131:J131)","v":21},18,3]
["Ingeniería en Informática",9,8,1,38,28,10,2,2,0]
["Ingeniería Telemática",7,7,0,60,47,13,3,1,2]
[]
["FACULTAD DE HUMANIDADES Y EDUCACIÓN",{"$f":"SUM(C135:D135)","v":70},{"$f":"SUM(C136:C142)","v":10},{"$f":"SUM(D136:D142)","v":60},{"$f":"SUM(F135:G135)","v":403},{"$f":"SUM(F136:F142)","v":86},{"$f":"SUM(G136:G142)","v":317},{"$f":"SUM(I135:J135)","v":45},{"$f":"SUM(I136:I142)","v":10},{"$f":"SUM(J136:J142)","v":35}]
["Licenciatura en Humanidades",{"$f":"SUM(C136:D136)","v":9},5,4,{"$f":"SUM(F136:G136)","v":84},32,52,{"$f":"SUM(I136:J136)","v":4},1,3]
["Licenciatura en Traducción Inglés - Español",{"$f":"SUM(C137:D137)","v":19},3,16,{"$f":"SUM(F137:G137)","v":137},22,115,{"$f":"SUM(I137:J137)","v":14},3,11]
["Magisterio",11,0,11,73,3,70,15,2,13]
["Profesorado de Filosofía",0,0,0,11,4,7,2,1,1]
["Profesorado de Historia",0,0,0,16,10,6,1,0,1]
["Profesorado de Inglés",2,0,2,21,0,21,2,0,2]
["Profesorado de Matemática",29,2,27,61,15,46,7,3,4]
[]
["FACULTAD DE DERECHO",{"$f":"SUM(C144:D144)","v":59},{"$f":"SUM(C145:C146)","v":15},{"$f":"SUM(D145:D146)","v":44},{"$f":"SUM(F144:G144)","v":342},{"$f":"SUM(F145:F146)","v":123},{"$f":"SUM(G145:G146)","v":219},{"$f":"SUM(I144:J144)","v":43},{"$f":"SUM(I145:I146)","v":19},{"$f":"SUM(J145:J146)","v":24}]
["Abogacía",{"$f":"SUM(C145:D145)","v":40},10,30,{"$f":"SUM(F145:G145)","v":243},89,154,{"$f":"SUM(I145:J145)","v":32},16,16]
["Notariado",{"$f":"SUM(C146:D146)","v":19},5,14,{"$f":"SUM(F146:G146)","v":99},34,65,{"$f":"SUM(I146:J146)","v":11},3,8]
[]
["FACULTAD DE COMUNICACIÓN",{"$f":"SUM(C148:D148)","v":37},{"$f":"SUM(C149:C149)","v":12},{"$f":"SUM(D149:D149)","v":25},{"$f":"SUM(F148:G148)","v":290},{"$f":"SUM(F149:F149)","v":86},{"$f":"SUM(G149:G149)","v":204},{"$f":"SUM(I148:J148)","v":45},{"$f":"SUM(I149:I149)","v":12},{"$f":"SUM(J149:J149)","v":33}]
["Licenciatura en Comunicación",{"$f":"SUM(C149:D149)","v":37},12,25,{"$f":"SUM(F149:G149)","v":290},86,204,{"$f":"SUM(I149:J149)","v":45},12,33]
[]
["UNIVERSIDAD DE LA EMPRESA",{"$f":"SUM(C151:D151)","v":518},{"$f":"C153+C157+C163+C176+C180+C183+C186","v":317},{"$f":"D153+D157+D163+D176+D180+D183+D186","v":201},{"$f":"SUM(F151:G151)","v":3311},{"$f":"F153+F157+F163+F176+F180+F183+F186","v":1864},{"$f":"G153+G157+G163+G176+G180+G183+G186","v":1447},{"$f":"SUM(I151:J151)","v":128},{"$f":"I153+I157+I163+I176+I180+I183+I186","v":80},{"$f":"J153+J157+J163+J176+J180+J183+J186","v":48}]
[]
["FACULTAD DE CIENCIAS JURÍDICAS",{"$f":"SUM(C153:D153)","v":14},{"$f":"SUM(C154:C155)","v":3},{"$f":"SUM(D154:D155)","v":11},{"$f":"SUM(F153:G153)","v":135},{"$f":"SUM(F154:F155)","v":35},{"$f":"SUM(G154:G155)","v":100},{"$f":"SUM(I153:J153)","v":6},{"$f":"SUM(I154:I155)","v":2},{"$f":"SUM(J154:J155)","v":4}]
["Doctor en Derecho",{"$f":"SUM(C154:D154)","v":7},2,5,{"$f":"SUM(F154:G154)","v":105},28,77,{"$f":"SUM(I154:J154)","v":6},2,4]
["Escribano Público",{"$f":"SUM(C155:D155)","v":7},1,6,{"$f":"SUM(F155:G155)","v":30},7,23,{"$f":"SUM(I155:J155)","v":0},0,0]
[]
["FACULTAD DE DISEÑO Y COMUNICACIÓN",{"$f":"SUM(C157:D157)","v":33},{"$f":"SUM(C158:C161)","v":7},{"$f":"SUM(D158:D161)","v":26},{"$f":"SUM(F157:G157)","v":239},{"$f":"SUM(F158:F161)","v":128},{"$f":"SUM(G158:G161)","v":111},{"$f":"SUM(I157:J157)","v":4},{"$f":"SUM(I158:I161)","v":2},{"$f":"SUM(J158:J161)","v":2}]
["Licenciatura en Diseño Aplicado",{"$f":"SUM(C158:D158)","v":0},0,0,{"$f":"SUM(F158:G158)","v":24},9,15,{"$f":"SUM(I158:J158)","v":4},2,2]
["Licenciatura en Diseño de Indumentaria",{"$f":"SUM(C159:D159)","v":0},0,0,{"$f":"SUM(F159:G159)","v":10},1,9,{"$f":"SUM(I159:J159)","v":0},0,0]
["Licenciatura en Diseño Gráfico",{"$f":"SUM(C160:D160)","v":16},5,11,{"$f":"SUM(F160:G160)","v":136},112,24,{"$f":"SUM(I160:J160)","v":0},0,0]
["Licenciatura en Diseño Industrial",{"$f":"SUM(C161:D161)","v":17},2,15,{"$f":"SUM(F161:G161)","v":69},6,63,{"$f":"SUM(I161:J161)","v":0},0,0]
[]
["FACULTAD DE CIENCIAS EMPRESARIALES",{"$f":"SUM(C163:D163)","v":214},{"$f":"C164+C168","v":118},{"$f":"D164+D168","v":96},{"$f":"SUM(F163:G163)","v":1918},{"$f":"F164+F168","v":964},{"$f":"G164+G168","v":954},{"$f":"SUM(I163:J163)","v":43},{"$f":"I164+I168","v":18},{"$f":"J164+J168","v":25}]
["Colonia",53,{"$f":"SUM(C165:C167)","v":27},{"$f":"SUM(D165:D167)","v":26},150,{"$f":"SUM(F165:F167)","v":47},{"$f":"SUM(G165:G167)","v":103},0,{"$f":"SUM(I165:I167)","v":0},{"$f":"SUM(J165:J167)","v":0}]
["Contador Público",41,22,19,105,34,71,0,0,0]
["Licenciatura en Administración de Empresas",12,5,7,35,12,23,0,0,0]
["Licenciatura en Recursos Humanos",0,0,0,10,1,9,0,0,0]
["Montevideo",161,{"$f":"SUM(C169:C174)","v":91},{"$f":"SUM(D169:D174)","v":70},1768,{"$f":"SUM(F169:F174)","v":917},{"$f":"SUM(G169:G174)","v":851},43,{"$f":"SUM(I169:I174)","v":18},{"$f":"SUM(J169:J174)","v":25}]
["Contador Público",43,19,24,593,258,335,19,7,12]
["Licenciatura en Administración de Empresas",33,23,10,433,255,178,11,6,5]
["Licenciatura en Comercio Exterior",14,7,7,121,72,49,2,0,2]
["Licenciatura en Marketing",44,28,16,397,233,164,8,4,4]
["Licenciatura en Recursos Humanos",13,6,7,104,31,73,0,0,0]
["Doctor en Derecho",14,8,6,120,68,52,3,1,2]
[]
["FACULTAD DE CIENCIAS DE LA SALUD",{"$f":"SUM(C176:D176)","v":41},{"$f":"SUM(C177:C178)","v":18},{"$f":"SUM(D177:D178)","v":23},{"$f":"SUM(F176:G176)","v":217},{"$f":"SUM(F177:F178)","v":101},{"$f":"SUM(G177:G178)","v":116},{"$f":"SUM(I176:J176)","v":14},{"$f":"SUM(I177:I178)","v":8},{"$f":"SUM(J177:J178)","v":6}]
["Licenciatura en Fisioterapia",{"$f":"SUM(C177:D177)","v":23},12,11,{"$f":"SUM(F177:G177)","v":86},50,36,{"$f":"SUM(I177:J177)","v":4},3,1]
["Licenciatura en Imagenología",{"$f":"SUM(C178:D178)","v":18},6,12,{"$f":"SUM(F178:G178)","v":131},51,80,{"$f":"SUM(I178:J178)","v":10},5,5]
[]
["FACULTAD DE INGENIERÍA",{"$f":"SUM(C180:D180)","v":66},{"$f":"SUM(C181:C182)","v":57},{"$f":"SUM(D181:D182)","v":9},{"$f":"SUM(F180:G180)","v":321},{"$f":"SUM(F181:F182)","v":277},{"$f":"SUM(G181:G182)","v":44},{"$f":"SUM(I180:J180)","v":24},{"$f":"SUM(I181:I182)","v":20},{"$f":"SUM(J181:J182)","v":4}]
["Ingeniería en Informática",16,13,3,85,69,16,4,3,1]
["Licenciatura en Informática",50,44,6,236,208,28,20,17,3]
["FACULTAD DE EDUCACIÓN",27,{"$f":"C184","v":24},{"$f":"D184","v":3},52,{"$f":"F184","v":46},{"$f":"G184","v":6},0,{"$f":"I184","v":0},{"$f":"J184","v":0}]
["Licenciatura en Educación Física, Deportes y Recreación",27,24,3,52,46,6,0,0,0]
[]
["FACULTAD DE CIENCIAS AGRARIAS",{"$f":"SUM(C186:D186)","v":123},{"$f":"SUM(C187:C188)","v":90},{"$f":"SUM(D187:D188)","v":33},{"$f":"SUM(F186:G186)","v":429},{"$f":"SUM(F187:F188)","v":313},{"$f":"SUM(G187:G188)","v":116},{"$f":"SUM(I186:J186)","v":37},{"$f":"SUM(I187:I188)","v":30},{"$f":"SUM(J187:J188)","v":7}]
["Ingeniero Agrónomo",{"$f":"SUM(C187:D187)","v":76},55,21,{"$f":"SUM(F187:G187)","v":248},183,65,{"$f":"SUM(I187:J187)","v":3},3,0]
["Licenciado en Gestión Agropecuaria",{"$f":"SUM(C188:D188)","v":47},35,12,{"$f":"SUM(F188:G188)","v":181},130,51,{"$f":"SUM(I188:J188)","v":34},27,7]
[]
["Fuente: Oficinas Productoras de cada una de las Instituciones. "]

{"sheet":"II-7.2.4","index":87,"n_rows":52,"n_cols":10,"rows_kept":52,"cut":false,"hidden":false,"merged":[[6,5,6,6],[6,8,6,9],[53,0,53,3],[0,5,1,8],[4,0,4,9],[5,0,7,0],[5,1,7,1],[5,2,5,3],[5,4,7,4],[5,5,5,6],[5,7,7,7],[5,8,5,9],[6,2,6,3]]}
["INSTITUTOS UNIVERSITARIOS: OFERTA DE GRADO",null,null,null,null,"ALUMNOS MATRICULADOS"]
[]
["Cuadro Nº II-7.2.4"]
[]
["ALUMNOS INGRESADOS, MATRICULADOS Y EGRESADOS EN PROGRAMAS DE GRADO DE INSTITUTOS UNIVERSITARIOS Y OFERTAS UNIVERSITAREAS DEL ÁREA SEGURIDAD Y DEFENSA POR SEXO SEGÚN INSTITUCIÓN Y CARRERA. AÑO 2016."]
["INSTITUTO UNIVERSITARIO / CARRERA","TOTAL","INGRESADOS",null,"TOTAL","MATRICULADOS",null,"TOTAL","EGRESADOS"]
[null,null,"SEXO",null,null,"SEXO",null,null,"SEXO"]
[null,null,"M","F",null,"M","F",null,"M","F"]
["TOTAL",{"$f":"SUM(C9:D9)","v":404},{"$f":"C11+C18+C26+C29+C32+C39+C44+C48","v":226},{"$f":"+D11+D18+D26+D29+D32+D39+D44+D48","v":178},{"$f":"SUM(F9:G9)","v":1627},{"$f":"+F11+F18+F26+F29+F32+F39+F44+F48","v":771},{"$f":"+G11+G18+G26+G29+G32+G39+G44+G48","v":856},{"$f":"SUM(I9:J9)","v":261},{"$f":"+I11+I18+I26+I29+I32+I39+I44+I48","v":121},{"$f":"+J11+J18+J26+J29+J32+J39+J44+J48","v":140}]
[]
["INST UNIV ASOCIACIÓN CRISTIANA DE JÓVENES",{"$f":"SUM(C11:D11)","v":236},{"$f":"C12+C15","v":170},{"$f":"D12+D15","v":66},{"$f":"SUM(F11:G11)","v":575},{"$f":"F12+F15","v":411},{"$f":"G12+G15","v":164},{"$f":"SUM(I11:J11)","v":138},{"$f":"I12+I15","v":92},{"$f":"J12+J15","v":46}]
["Montevideo",{"$f":"SUM(C12:D12)","v":202},{"$f":"C13+C14","v":145},{"$f":"D13+D14","v":57},{"$f":"SUM(F12:G12)","v":541},{"$f":"F13+F14","v":386},{"$f":"G13+G14","v":155},{"$f":"SUM(I12:J12)","v":138},{"$f":"I13+I14","v":92},{"$f":"J13+J14","v":46}]
["Licenciatura en Educación Física, Recreación y Deporte",137,105,32,403,311,92,111,77,34]
["Tecnicatura en Fitness con orientación en Modalidades de Gimnasia y/o Entrenamiento Personalizado",65,40,25,138,75,63,27,15,12]
["Maldonado",34,{"$f":"C16+C17","v":25},{"$f":"D16+D17","v":9},34,{"$f":"F16+F17","v":25},{"$f":"G16+G17","v":9},0,{"$f":"I16+I17","v":0},{"$f":"J16+J17","v":0}]
["Licenciatura en Educación Física, Recreación y Deporte",19,18,1,19,18,1,0,0,0]
["Tecnicatura en Fitness con orientación en Modalidades de Gimnasia y/o Entrenamiento Personalizado",15,7,8,15,7,8,0,0,0]
["INST UNIV CLAEH",{"$f":"B20+B21","v":79},{"$f":"C20+C21","v":23},56,361,123,238,39,8,31]
["Montevideo"]
["Licenciatura en Gestión Cultural ",{"$f":"SUM(C20:D20)","v":22},6,16,{"$f":"SUM(F20:G20)","v":54},13,41,{"$f":"SUM(I20:J20)","v":9},0,9]
["Maldonado",{"$f":"SUM(B22:B24)","v":57},{"$f":"SUM(C22:C24)","v":17},40,307,110,197,{"$f":"SUM(H22:H24)","v":30},8,22]
["Medicina",{"$f":"SUM(C22:D22)","v":36},12,24,{"$f":"SUM(F22:G22)","v":203},78,125,{"$f":"SUM(I22:J22)","v":12},5,7]
["Abogacia",{"$f":"SUM(C23:D23)","v":19},4,15,{"$f":"SUM(F23:G23)","v":75},22,53,{"$f":"SUM(I23:J23)","v":13},2,11]
["Notariado",{"$f":"SUM(C24:D24)","v":2},1,1,{"$f":"SUM(F24:G24)","v":29},10,19,{"$f":"SUM(I24:J24)","v":5},1,4]
[]
["INST METODISTA UNIV CRANDON ",{"$f":"SUM(C26:D26)","v":1},{"$f":"SUM(C27:C27)","v":0},{"$f":"SUM(D27:D27)","v":1},{"$f":"SUM(F26:G26)","v":48},{"$f":"SUM(F27:F27)","v":3},{"$f":"SUM(G27:G27)","v":45},{"$f":"SUM(I26:J26)","v":0},{"$f":"SUM(I27:I27)","v":0},{"$f":"SUM(J27:J27)","v":0}]
["Licenciatura en Gestión de Empresas",{"$f":"SUM(C27:D27)","v":1},0,1,{"$f":"SUM(F27:G27)","v":48},3,45,{"$f":"SUM(I27:J27)","v":0},0,0]
[]
["INST UNIV MONSEÑOR MARIANO SOLER - ",{"$f":"SUM(C29:D29)","v":19},{"$f":"SUM(C30:C30)","v":16},{"$f":"SUM(D30:D30)","v":3},{"$f":"SUM(F29:G29)","v":71},{"$f":"SUM(F30:F30)","v":64},{"$f":"SUM(G30:G30)","v":7},{"$f":"SUM(I29:J29)","v":9},{"$f":"SUM(I30:I30)","v":9},{"$f":"SUM(J30:J30)","v":0}]
["Licenciado en Ciencias Teológicas",{"$f":"SUM(C30:D30)","v":19},16,3,{"$f":"SUM(F30:G30)","v":71},64,7,{"$f":"SUM(I30:J30)","v":9},9,0]
[]
["INST UNIV FRANCISCO DE ASÍS ",{"$f":"+C32+D32","v":33},{"$f":"SUM(C34:C37)","v":11},{"$f":"SUM(D34:D37)","v":22},{"$f":"+F32+G32","v":433},{"$f":"SUM(F34:F37)","v":150},{"$f":"SUM(G34:G37)","v":283},{"$f":"+I32+J32","v":29},{"$f":"SUM(I34:I37)","v":10},{"$f":"SUM(J34:J37)","v":19}]
["Maldonado"]
["Contador Público",{"$f":"+C34+D34","v":10},5,5,{"$f":"+F34+G34","v":171},54,117,{"$f":"+I34+J34","v":13},3,10]
["Lic. en Administración y Dirección de Empresas",{"$f":"+C35+D35","v":3},2,1,{"$f":"+F35+G35","v":102},40,62,{"$f":"+I35+J35","v":9},3,6]
["Lic. en Turismo",{"$f":"+C36+D36","v":7},2,5,{"$f":"+F36+G36","v":97},37,60,{"$f":"+I36+J36","v":6},4,2]
["Lic. en Psicología",{"$f":"+C37+D37","v":13},2,11,{"$f":"+F37+G37","v":63},19,44,{"$f":"+I37+J37","v":1},0,1]
[]
["INST UNIV CEDIIAP",{"$f":"+C39+D39","v":36},{"$f":"SUM(C40:C42)","v":6},{"$f":"SUM(D40:D42)","v":30},{"$f":"+F39+G39","v":107},{"$f":"SUM(F40:F42)","v":8},{"$f":"SUM(G40:G42)","v":99},{"$f":"+I39+J39","v":44},{"$f":"SUM(I40:I42)","v":2},{"$f":"SUM(J40:J42)","v":42}]
["Lic. Psicomotricidad",{"$f":"+C40+D40","v":7},0,7,{"$f":"+F40+G40","v":49},1,48,{"$f":"+I40+J40","v":24},1,23]
["Lic. Psicopedagogía",{"$f":"+C41+D41","v":21},1,20,{"$f":"+F41+G41","v":50},2,48,{"$f":"+I41+J41","v":16},0,16]
["Lic. en Musicoterapia",{"$f":"+C42+D42","v":8},5,3,{"$f":"+F42+G42","v":8},5,3,{"$f":"+I42+J42","v":4},1,3]
[]
["FUNDACIÓN POLITÉCNICO DE PUNTA DEL ESTE",{"$f":"+C44+D44","v":0},{"$f":"C45+C46","v":0},{"$f":"D45+D46","v":0},{"$f":"+F44+G44","v":32},{"$f":"F45+F46","v":12},{"$f":"G45+G46","v":20},{"$f":"+I44+J44","v":2},{"$f":"I45+I46","v":0},{"$f":"J45+J46","v":2}]
["Contador Público",{"$f":"+C45+D45","v":0},0,0,{"$f":"+F45+G45","v":25},11,14,{"$f":"+I45+J45","v":2},0,2]
["Licenciado en Economía y Finanzas Aplicadas",{"$f":"+C46+D46","v":0},0,0,{"$f":"+F46+G46","v":7},1,6,{"$f":"+I46+J46","v":0},0,0]
[]
["ESCUELA NACIONAL DE POLICÍA*","-","-","-","-","-","-","-","-","-"]
["Licenciatura Seguridad Pública","-","-","-","-","-","-","-","-","-"]
[]
["Fuente: Oficinas Productoras de cada una de las Instituciones. "]
["Nota:   En 2016 la Licenciatura en Seguridad Pública no fue dictada."]

{"sheet":"II-7.2.5","index":88,"n_rows":42,"n_cols":10,"rows_kept":42,"cut":false,"hidden":false,"merged":[[0,2,1,4],[4,0,4,4],[5,0,7,0],[5,1,7,1],[5,2,5,3],[5,4,7,4],[5,5,5,6],[5,7,7,7],[5,8,5,9],[6,2,6,3],[6,5,6,6],[6,8,6,9]]}
["OFERTA UNIVERSITARIA DE POSTGRADO",null,"INSTITUCIONES"]
[]
["Cuadro Nº II-7.2.5"]
[]
["ALUMNOS INGRESADOS, MATRICULADOS Y EGRESADOS EN PROGRAMAS DE POSTGRADO POR SEXO SEGÚN INSTITUCIÓN. AÑO 2016."]
["INSTITUCIÓN","TOTAL","INGRESADOS",null,"TOTAL","MATRICULADOS ",null,"TOTAL","EGRESADOS "]
[null,null,"SEXO",null,null,"SEXO",null,null,"SEXO"]
[null,null,"M","F",null,"M","F",null,"M","F"]
["TOTAL PAIS",{"$f":"C9+D9","v":4517},{"$f":"C10+C11","v":1834},{"$f":"D10+D11","v":2683},{"$f":"F9+G9","v":12379},{"$f":"F10+F11","v":4776},{"$f":"G10+G11","v":7603},{"$f":"I9+J9","v":2114},{"$f":"I10+I11","v":921},{"$f":"J10+J11","v":1193}]
["PÚBLICO",{"$f":"C10+D10","v":2944},{"$f":"C14+C31","v":1291},{"$f":"D14+D31","v":1653},{"$f":"F10+G10","v":7273},{"$f":"F14+F31","v":2958},{"$f":"G14+G31","v":4315},{"$f":"I10+J10","v":1466},{"$f":"I14+I31","v":674},{"$f":"J14+J31","v":792}]
["PRIVADO",1573,{"$f":"C15+C32","v":543},{"$f":"D15+D32","v":1030},5106,{"$f":"F15+F32","v":1818},{"$f":"G15+G32","v":3288},648,{"$f":"I15+I32","v":247},{"$f":"J15+J32","v":401}]
[null,0,null,null,0,null,null,0]
["Montevideo",4458,{"$f":"C14+C15","v":1789},{"$f":"D14+D15","v":2669},12302,{"$f":"F14+F15","v":4724},{"$f":"G14+G15","v":7578},2114,{"$f":"I14+I15","v":921},{"$f":"J14+J15","v":1193}]
["PÚBLICO",2925,{"$f":"C16+SUM(C25:C28)","v":1283},{"$f":"D16+SUM(D25:D28)","v":1642},7236,{"$f":"F16+SUM(F25:F28)","v":2943},{"$f":"G16+SUM(G25:G28)","v":4293},1466,{"$f":"I16+SUM(I25:I28)","v":674},{"$f":"J16+SUM(J25:J28)","v":792}]
["PRIVADO",1533,{"$f":"SUM(C17:C24)","v":506},{"$f":"SUM(D17:D24)","v":1027},5066,{"$f":"SUM(F17:F24)","v":1781},{"$f":"SUM(G17:G24)","v":3285},648,{"$f":"SUM(I17:I24)","v":247},{"$f":"SUM(J17:J24)","v":401}]
["UdelaR *",2496,933,1563,6802,2578,4224,1146,394,752]
["UCUDAL",544,100,444,2045,446,1599,233,60,173]
["Universidad ORT Uruguay",223,81,142,716,265,451,196,73,123]
["Universidad de Montevideo",342,157,185,1315,647,668,145,85,60]
["Universidad de la Empresa",324,139,185,758,343,415,21,14,7]
["Inst Univ CLAEH ",88,25,63,154,50,104,41,13,28]
["Inst Univ de Postgrado en Psicoanálisis",3,0,3,34,3,31,6,0,6]
["Inst Metodista Univ Crandon ",3,1,2,3,1,2,3,1,2]
["Instituto Universitario  Centro de Estudio y Diagnóstico de las Disgnancias del Uruguay (IUCEDDU)",6,3,3,41,26,15,3,1,2]
["Centro de Altos Estudios Nacionales",59,34,25,59,34,25,17,10,7]
["Escuela de Guerra Naval (ESGUE)",110,99,11,110,99,11,63,57,6]
["IPES",20,4,16,25,19,6,0,0,0]
["Escuela Naval",240,213,27,240,213,27,240,213,27]
[]
["Resto del país",59,{"$f":"C31+C32","v":45},{"$f":"D31+D32","v":14},77,{"$f":"F31+F32","v":52},{"$f":"G31+G32","v":25},0,{"$f":"I31+I32","v":0},{"$f":"J31+J32","v":0}]
["PÚBLICO",19,{"$f":"C34+C37","v":8},{"$f":"D34+D37","v":11},37,{"$f":"F34+F37","v":15},{"$f":"G34+G37","v":22},0,{"$f":"I34+I37","v":0},{"$f":"J34+J37","v":0}]
["PRIVADO",40,{"$f":"C35","v":37},{"$f":"D35","v":3},40,{"$f":"F35","v":37},{"$f":"G35","v":3},0,{"$f":"I35","v":0},{"$f":"J35","v":0}]
["Maldonado",55,{"$f":"C34+C35","v":42},{"$f":"D34+D35","v":13},64,{"$f":"F34+F35","v":49},{"$f":"G34+G35","v":15},0,{"$f":"I34+I35","v":0},{"$f":"J34+J35","v":0}]
["UdelaR",15,5,10,24,12,12,0,0,0]
["Inst Univ Asociación Cristiana de Jóvenes",40,37,3,40,37,3,0,0,0]
["Salto",4,{"$f":"C37","v":3},{"$f":"D37","v":1},13,{"$f":"F37","v":3},{"$f":"G37","v":10},0,{"$f":"I37","v":0},{"$f":"J37","v":0}]
["UdelaR",4,3,1,13,3,10,0,0,0]
[]
["Fuente: Bedelías de los Servicios Universitarios y Sistema de Gestión de Bedelías-SeCIU"]
["UdelaR:"]
["El dato de Egresos de Posgrado  2016 es PRELIMINAR"]
["* La matrícula de UdelaR corresponde al I Censo de Estudiantes de Posgrado 2012.  "]

{"sheet":"II-7.2.6 ","index":89,"n_rows":322,"n_cols":7,"rows_kept":322,"cut":false,"hidden":false,"merged":[[0,3,1,6],[4,0,4,3],[5,0,7,0],[5,1,7,1],[5,2,5,3],[5,4,7,4],[5,5,5,6],[6,2,6,3],[6,5,6,6],[330,0,330,6],[331,0,331,6],[332,0,332,6],[324,0,324,6],[325,0,325,6],[326,0,326,6],[327,0,327,6],[328,0,328,6],[329,0,329,6]]}
["UNIVERSIDAD DE LA REPÚBLICA: OFERTA DE POSTGRADO",null,null,"ALUMNOS MATRICULADOS"]
[]
["Cuadro Nº II-7.2.6"]
[]
["ALUMNOS INGRESADOS 2016 Y EGRESADOS PRELIMINARES 2016 EN PROGRAMAS DE POSTGRADO DE LA UNIVERSIDAD DE LA REPÚBLICA POR SEXO SEGÚN SERVICIO UNIVERSITARIO Y ACREDITACIÓN. "]
["SERVICIO UNIVERSITARIO / ACREDITACIÓN","TOTAL","INGRESADOS",null,"TOTAL","EGRESADOS (datos preliminares)"]
[null,null,"SEXO",null,null,"SEXO"]
[null,null,"M","F",null,"M","F"]
["TOTAL",{"$f":"SUM(C9:D9)","v":2515},{"$f":"C11+C30+C41+C72+C100+C187+C196+C208+C216+C225+C233+C241+C254+C266+C275+C278+C281+C284+C288+C292+C296+C302+C305+C308+C311+C314","v":941},{"$f":"D11+D30+D41+D72+D100+D187+D196+D208+D216+D225+D233+D241+D254+D266+D275+D278+D281+D284+D288+D292+D296+D302+D305+D308+D311+D314","v":1574},{"$f":"SUM(F9:G9)","v":1146},{"$f":"F11+F30+F41+F72+F100+F187+F196+F208+F216+F225+F233+F241+F254+F266+F275+F278+F281+F284+F288+F292+F296+F302+F305+F308+F311+F314","v":394},{"$f":"G11+G30+G41+G72+G100+G187+G196+G208+G216+G225+G233+G241+G254+G266+G275+G278+G281+G284+G288+G292+G296+G302+G305+G308+G311+G314","v":752}]
[]
["FACULTAD DE CIENCIAS ECONÓMICAS Y ADMINISTRACIÓN",{"$f":"+C11+D11","v":273},{"$f":"SUM(C12:C28)","v":112},{"$f":"SUM(D12:D28)","v":161},{"$f":"+F11+G11","v":160},{"$f":"SUM(F12:F28)","v":63},{"$f":"SUM(G12:G28)","v":97}]
["Diploma de Especialización en Costos y Gestión Empresarial",17,8,9,19,8,11]
["Diploma de Posgrado en Economía, Derecho y Gestión del Deporte",0,0,0,1,0,1]
["Posgrado de Especialización  en Administración",20,7,13,16,5,11]
["Posgrado de Especialización en Finanzas",22,12,10,15,10,5]
["Posgrado de Especialización en Marketing",9,6,3,12,7,5]
["Diploma de Posgrado en Sistemas de Información de las Organizaciones y Gestión de Empresas de TI",17,7,10,10,3,7]
["Maestría en Economía",32,13,19,6,4,2]
["Maestría en Finanzas",16,7,9,5,1,4]
["Maestría en Gerencia y Administración (MBA) ",23,12,11,29,14,15]
["Maestría en Tributaria",27,12,15,6,2,4]
["Posgrado de Especialización en Tributaria",18,2,16,21,7,14]
["Diploma en Economía",0,0,0,1,0,1]
["Posgrado de Especialización en Contabilidad",21,9,12,4,0,4]
["Posgrado de Especialización en Auditoria",0,0,0,3,1,2]
["Diploma de Posgrado en Gestión Financiera en Instituciones Públicas",16,1,15,12,1,11]
["Especialización en economía y gestión para la inclusión",33,15,18,0,0,0]
["Maestría en contabilidad y auditoría",2,1,1,0,0,0]
[]
["FACULTAD DE DERECHO",{"$f":"+C30+D30","v":56},{"$f":"SUM(C31:C39)","v":19},{"$f":"SUM(D31:D39)","v":37},{"$f":"+F30+G30","v":8},{"$f":"SUM(F31:F39)","v":0},{"$f":"SUM(G31:G39)","v":8}]
["Especialización en Derecho Comercial",{"$f":"+C31+D31","v":0},0,0,1,0,1]
["Especialización en Derecho de Daños",3,1,2,2,0,2]
["Especialización en Derecho del Trabajo y de la Seguridad Social",4,3,1,1,0,1]
["Especialización en Derecho Procesal",0,0,0,1,0,1]
["Maestría en Derecho con orientación en Derecho de Daños",11,1,10,0,0,0]
["Maestría en Derecho con orientación en Derecho del Trabajo y de la Seguridad Social",4,1,3,2,0,2]
["Maestría en Relaciones  Internacionales",18,6,12,0,0,0]
["Maestría en Derecho orientación Derecho Comercial",4,1,3,1,0,1]
["Especialización en Derecho Financiero",12,6,6,0,0,0]
[]
["FACULTAD DE INGENIERÍA",{"$f":"+C41+D41","v":151},{"$f":"SUM(C42:C70)","v":103},{"$f":"SUM(D42:D70)","v":48},{"$f":"+F41+G41","v":52},{"$f":"SUM(F42:F70)","v":36},{"$f":"SUM(G42:G70)","v":16}]
["Diploma en Especialización en Gestión de Tecnologías",15,6,9,13,9,4]
["Diploma en Especialización en Ingeniería de Software",5,3,2,2,2,0]
["Diploma en Especialización en Seguridad Informática",4,4,0,3,3,0]
["Diploma en Especialización en Sist. de Información y Tecnologías de Gestión de Datos",9,9,0,1,0,1]
["Diploma en Sistemas Eléctricos de Potencia",7,7,0,2,2,0]
["Diploma de Especialización en Telecomunicaciones",2,2,0,4,4,0]
["Diploma en Ingeniería de la Energía",7,6,1,1,0,1]
["Doctorado en Informática (PEDECIBA) ",3,3,0,3,3,0]
["Doctorado en Ingeniería Eléctrica",0,0,0,1,1,0]
["Doctorado en Ingeniería Química",2,1,1,1,0,1]
["Doctorado Ingeniería Estructural",1,1,0,1,1,0]
["Maestría en Gestión de la Innovación",1,0,1,1,1,0]
["Maestría en Informática (PEDECIBA) ",13,10,3,5,3,2]
["Maestría en Ingeniería Ambiental",5,3,2,0,0,0]
["Maestría en Ingeniería de la Energía",19,13,6,1,0,1]
["Maestría en Ingeniería de Software",1,0,1,0,0,0]
["Maestría en Ingeniería Eléctrica",10,7,3,3,2,1]
["Maestría en Ingeniería en Computación",1,1,0,1,1,0]
["Maestría en Ingeniería en Mecánica de los Fluidos Aplicada",3,2,1,1,0,1]
["Maestría en Ingeniería Estructural",4,2,2,0,0,0]
["Maestría en Ingeniería Física",1,1,0,1,1,0]
["Maestría en Ingeniería Matemática",7,4,3,3,1,2]
["Maestría en Ingeniería Química",1,1,0,1,0,1]
["Maestría en Sistemas de Información y Gestión de Datos",0,0,0,1,1,0]
["Maestría en Investigación de Operaciones",17,11,6,0,0,0]
["Doctorado en Ingeniería de la Energía ",1,1,0,0,0,0]
["Diploma de Especialización en Ingeniería de Minas",9,5,4,0,0,0]
["Doctorado en Ingeniería Ambiental",1,0,1,0,0,0]
["Doctorado en Ingeniería en Mecánica de los Fluidos Aplicada",2,0,2,2,1,1]
[]
["FACULTAD DE CIENCIAS SOCIALES",{"$f":"+C72+D72","v":453},{"$f":"SUM(C73:C98)","v":187},{"$f":"SUM(D73:D98)","v":266},{"$f":"+F72+G72","v":108},{"$f":"SUM(F73:F98)","v":36},{"$f":"SUM(G73:G98)","v":72}]
["Diploma de Intervención Familiar",0,0,0,10,0,10]
["Diploma de Políticas de Drogas, Regulación y Control",34,9,25,8,3,5]
["Diploma en Carnaval y Patrimonio",0,0,0,6,2,4]
["Diploma en Ciencia Política",0,0,0,4,3,1]
["Diploma en Economía para No Economistas",23,10,13,5,2,3]
["Diploma en Economía y Gestión Bancaria",50,22,28,20,2,18]
["Diploma en Estudios Internacionales, Sistema Internacional e Integración",39,16,23,11,3,8]
["Diploma en Género y Políticas Públicas",35,1,34,6,2,4]
["Diploma en Historia Económica",0,0,0,4,0,4]
["Diploma en Investigación Social aplicada a Estudios de Mercado, Publicidad y Opinión Pública",1,0,1,0,0,0]
["Diploma Jóvenes, Juventud y Políticas Públicas",23,4,19,5,1,4]
["Doctorado en Ciencia Política",8,7,1,1,1,0]
["Doctorado en Ciencias Sociales",9,5,4,2,1,1]
["Doctorado en Economía",5,2,3,0,0,0]
["Doctorado en Sociología",10,4,6,2,1,1]
["Maestría Bimodal en Estudios Contemp. de América Latina",0,0,0,1,1,0]
["Maestría en Ciencia Política",33,21,12,4,4,0]
["Maestría en Demografía y Estudios de Población",0,0,0,3,2,1]
["Maestría en Economía Internacional",20,11,9,8,4,4]
["Maestría en Historia Económica",35,23,12,2,0,2]
["Maestría en Sociología",20,11,9,3,1,2]
["Maestría en Trabajo Social",15,2,13,0,0,0]
["Diploma en Estudios Urbanos e Intervenciones Territoriales",39,10,29,0,0,0]
["Maestría en Sociología y Métodos Avanzados en Investigación",29,12,17,0,0,0]
["Maestría en Historia Política",25,17,8,0,0,0]
["Diploma en Historia Política",0,0,0,3,3,0]
[]
["FACULTAD DE MEDICINA ",{"$f":"+C100+D100","v":532},{"$f":"SUM(C101:C185)","v":175},{"$f":"SUM(D101:D185)","v":357},{"$f":"+F100+G100","v":416},{"$f":"SUM(F101:F185)","v":133},{"$f":"SUM(G101:G185)","v":283}]
["Diploma en Banco de Multitejidos para Trasplante",1,1,0,0,0,0]
["Diploma en Coordinación de Trasplantes",6,4,2,0,0,0]
["Diploma en Cuidados Paliativos del Adulto",0,0,0,2,1,1]
["Diploma en Ecografía Gineco-Obstétrica (2)",2,1,1,0,0,0]
["Diploma en Emergentología ",9,3,6,0,0,0]
["Especialización en Emergentología Pediátrica(2)",0,0,0,1,1,0]
["Diploma en Endoscopia Digestiva",0,0,0,2,2,0]
["Diploma en Neurodesarrollo",7,1,6,1,0,1]
["Diploma en Neurofisiología Clínica ",5,2,3,0,0,0]
["Diploma en Psicoterapia en Servicios de Salud ",25,3,22,1,1,0]
["Especialización en Adm. en Servicio de la Salud",6,2,4,4,0,4]
["Especialización en Alergología",3,1,2,0,0,0]
["Especialización en Anatomía Patológica",0,0,0,3,0,3]
["Especialización en Anestesiología",16,8,8,23,10,13]
["Especialización en Cardiología",10,2,8,17,7,10]
["Especialización en Cirugía Cardíaca ",1,1,0,1,1,0]
["Especialización en Cirugía General",13,8,5,5,3,2]
["Especialización en Cirugía Pedíatrica",2,1,1,1,1,0]
["Especialización en Cirugía Plástica, Reparadora y Estética",4,2,2,3,0,3]
["Especialización en Cirugía Vascular Periférica",2,1,1,1,1,0]
["Especialización en Dermatología Médico Quirúrgica",8,1,7,13,2,11]
["Especialización en Endocrinología y Metabolismo",8,1,7,16,5,11]
["Especialización en Enfermedades Infecciosas",4,1,3,0,0,0]
["Especialización en Epidemiología ",1,0,1,1,1,0]
["Especialización en Farmacología y Terapéutica (1)",1,0,1,1,0,1]
["Especialización en Gastroenterología, Hepatología, Nutrición Pediátrica",0,0,0,1,1,0]
["Especialización en Gastroenterología",7,4,3,5,3,2]
["Especialización en Geriatría",2,0,2,2,0,2]
["Especialización en Gerontopsicomotricidad",7,1,6,0,0,0]
["Especialización en Ginecotocología",26,5,21,21,7,14]
["Especialización en Hematología",1,0,1,4,0,4]
["Especialización en Hemoterapia y Medicina Transfusional",4,1,3,1,1,0]
["Especialización en Imagenología",15,9,6,9,4,5]
["Especialización en Laboratorio de Patología Clínica",2,0,2,2,1,1]
["Especialización en Medicina del Deporte",6,2,4,2,2,0]
["Especialización en Medicina Familiar y Comunitaria",18,6,12,3,0,3]
["Especialización en Medicina Familiar y Comunitaria (1)",1,1,0,1,1,0]
["Especialización en Medicina Intensiva",24,13,11,16,8,8]
["Especialización en Medicina Interna",26,10,16,15,2,13]
["Especialización en Medicina Legal ",6,1,5,0,0,0]
["Especialización en Microbiología",0,0,0,1,0,1]
["Especialización en Nefrología (1)",1,0,1,3,0,3]
["Especialización en Nefrología ",10,5,5,9,1,8]
["Especialización en Neonatología ",19,6,13,12,2,10]
["Especialización en Neonatología (1)",6,1,5,6,1,5]
["Especialización en Neumología (1)",3,2,1,3,2,1]
["Especialización en Neumología",4,2,2,4,1,3]
["Especialización en Neurocirugía",2,0,2,2,2,0]
["Especialización en Neurología ",5,1,4,1,1,0]
["Especialización en Neurología (1)",1,1,0,1,1,0]
["Especialización en Neuropediatría",1,0,1,1,0,1]
["Especialización en Oftalmología",9,2,7,14,6,8]
["Especialización en Oncología Médica",5,2,3,3,0,3]
["Especialización en Oncología Radioterápica",0,0,0,1,0,1]
["Especialización en Otorrinolaringología",4,1,3,6,4,2]
["Especialización en Pediatría",46,7,39,82,16,66]
["Especialización en Psiquiatría",10,2,8,1,0,1]
["Especialización en Psiquiatría Pediátrica",12,1,11,0,0,0]
["Especialización en Salud Ocupacional",13,5,8,1,0,1]
["Especialización en Terapia Intensiva Pediátrica",2,0,2,6,1,5]
["Especialización en Traumatología y Ortopedia ",8,8,0,4,4,0]
["Especialización en Urología",6,4,2,6,4,2]
["Especialización Rehabilitación y Medicina Física",6,3,3,4,1,3]
["Especialización Reumatología",2,1,1,1,0,1]
["Especialización Toxicología Clínica",1,0,1,0,0,0]
["Doctorado en Ciencias Médicas (PROINBIO) ",7,2,5,3,1,2]
["Maestría en Ciencias Médicas (PROINBIO)",23,9,14,7,4,3]
["Diploma en Diabetología (2)",0,0,0,7,1,6]
["Diploma en Psicoterapia en Servicios de Salud (1)",3,0,3,4,0,4]
["Especialización en Cirugía Torácica (1)",1,1,0,1,1,0]
["Especialización en Cardiología Pediátrica",0,0,0,2,0,2]
["Especialización en Medicina Nuclear",3,0,3,2,2,0]
["Diploma en Genética Médica - Adultos",3,1,2,0,0,0]
["Diploma en Genética Médica - Adultos (2)",1,0,1,1,0,1]
["Diploma en Genética Médica - Pediatría (2)",{"$f":"+C175+D175","v":1},1,0,{"$f":"+F175+G175","v":1},1,0]
["Especialización en Epidemiología (1)",1,1,0,1,1,0]
["Especialización en Hemoterapia y Medicina Transfusional (1)",1,1,0,1,1,0]
["Especialización en Rehabilitación y Medicina Física (1)",1,1,0,1,1,0]
["Diplomatura de bases inmunogenéticas de los transplantes",3,1,2,2,1,1]
["Diplomatura en infectología pediátrica",2,0,2,0,0,0]
["Diplomatura en transplante de progenitores hematopoyéticos",5,0,5,10,1,9]
["Diploma de estabilización y traslado pediátrico neonatal (2)",6,3,3,6,3,3]
["Diploma en Hepatología del adulto (2)",1,0,1,3,0,3]
["Diploma en Medicina Sexual (2)",3,1,2,3,1,2]
["Diploma en Salud Pública",12,2,10,11,1,10]
[]
["FACULTAD DE ODONTOLOGÍA ",{"$f":"+C187+D187","v":40},{"$f":"SUM(C188:C194)","v":6},{"$f":"SUM(D188:D194)","v":34},{"$f":"+F187+G187","v":15},{"$f":"SUM(F188:F194)","v":6},{"$f":"SUM(G188:G194)","v":9}]
["Especialización en Cirugía y Traumatología Buco Maxilo Facial",7,2,5,0,0,0]
["Especialización en Implantología Oral",0,0,0,8,6,2]
["Especialización en Endodoncia",8,1,7,5,0,5]
["Especialización en Odontopediatría",0,0,0,2,0,2]
["Especialización en Odontopediatría",3,0,3,0,0,0]
["Maestría en Ciencias Odontológicas",5,0,5,0,0,0]
["Especialización en Ortopedia y Ortodoncia Dento Maxilo Facial",17,3,14,0,0,0]
[]
["FACULTAD DE HUMANIDADES Y CIENCIAS DE LA EDUCACIÓN",{"$f":"+C196+D196","v":182},{"$f":"SUM(C197:C206)","v":67},{"$f":"SUM(D197:D206)","v":115},{"$f":"+F196+G196","v":23},{"$f":"SUM(F197:F206)","v":9},{"$f":"SUM(G197:G206)","v":14}]
["Maestría en Ciencias Humanas - Antropología de la Cuenca del Plata",22,9,13,4,1,3]
["Maestría en Ciencias Humanas - Filosofía Contemporánea",7,6,1,3,2,1]
["Maestría en Ciencias Humanas - Historia Rioplatense",7,3,4,1,0,1]
["Maestría en Ciencias Humanas - Lenguaje, Cultura y Sociedad",22,8,14,4,1,3]
["Maestría en Ciencias Humanas - Literatura Latinoamericana",13,5,8,1,1,0]
["Maestría en Ciencias Humanas - Teoría e Historia del Teatro",18,6,12,3,0,3]
["Diploma Esp. Lengua Extranjera",22,2,20,0,0,0]
["Maestría en Ciencias Humanas: Estudios Latinoamericanos",30,11,19,7,4,3]
["Maestría en Ciencias Humanas: Filosofía y Sociedad",1,1,0,0,0,0]
["Maestría en Ciencias Humanas: Teorías y Prácticas en Educación",40,16,24,0,0,0]
[]
["FACULTAD DE AGRONOMÍA",{"$f":"+C208+D208","v":73},{"$f":"SUM(C209:C214)","v":33},{"$f":"SUM(D209:D214)","v":40},{"$f":"+F208+G208","v":28},{"$f":"SUM(F209:F214)","v":12},{"$f":"SUM(G209:G214)","v":16}]
["Diploma en Agronomía",5,3,2,0,0,0]
["Diploma en Desarrollo Rural Sustentable",3,1,2,2,0,2]
["Doctorado en Ciencias Agrarias",6,2,4,2,1,1]
["Maestría en Agronomía",8,7,1,2,2,0]
["Maestría en Ciencias Agrarias",48,19,29,22,9,13]
["Maestría en Desarrollo Rural Sustentable",3,1,2,0,0,0]
[]
["FACULTAD DE ARQUITECTURA, DISEÑO Y URBANISMO",{"$f":"+C216+D216","v":96},{"$f":"SUM(C217:C223)","v":42},{"$f":"SUM(D217:D223)","v":54},{"$f":"+F216+G216","v":28},{"$f":"SUM(F217:F223)","v":12},{"$f":"SUM(G217:G223)","v":16}]
["Diploma en Inv. Proyectual",6,3,3,16,10,6]
["Diploma de Especialización en Intervención del Patrimonio Arquitectónico",16,3,13,0,0,0]
["Diploma de Especialización en Proyecto Mobiliario",0,0,0,2,0,2]
["Maestría en Ordenamiento Territorial y Desarrollo Urbano",4,2,2,5,2,3]
["Especialización en Proyecto de Paisaje",0,0,0,5,0,5]
["Doctorado en arquitectura",20,11,9,0,0,0]
["Maestría en arquitectura",50,23,27,0,0,0]
[]
["FACULTAD DE QUÍMICA",{"$f":"+C225+D225","v":45},{"$f":"SUM(C226:C231)","v":18},{"$f":"SUM(D226:D231)","v":27},{"$f":"+F225+G225","v":20},{"$f":"SUM(F226:F231)","v":9},{"$f":"SUM(G226:G231)","v":11}]
["Diploma de Especialización en Farmacia Industrial",1,1,0,0,0,0]
["Doctorado en Química ",33,13,20,15,7,8]
["Diploma de Especialización en Farmacia Hospitalaria",2,0,2,0,0,0]
["Maestría en Química ",4,2,2,3,1,2]
["Doctorado en Química - Educación en Química",1,1,0,0,0,0]
["Diploma de especialista de Radiofarmacia",4,1,3,2,1,1]
[]
["FACULTAD DE VETERINARIA",{"$f":"+C233+D233","v":20},{"$f":"SUM(C234:C239)","v":6},{"$f":"SUM(D234:D239)","v":14},{"$f":"+F233+G233","v":16},{"$f":"SUM(F234:F239)","v":7},{"$f":"SUM(G234:G239)","v":9}]
["Doctorado en Producción Animal",1,0,1,3,2,1]
["Doctorado en Salud Animal",6,2,4,1,1,0]
["Maestría en Nutrición de Rumiantes",0,0,0,2,1,1]
["Maestría en Producción Animal",5,2,3,2,0,2]
["Maestría en Reproducción Animal",4,0,4,1,0,1]
["Maestría en Salud Animal",4,2,2,7,3,4]
[]
["FACULTAD DE CIENCIAS",{"$f":"+C241+D241","v":192},{"$f":"SUM(C242:C252)","v":77},{"$f":"SUM(D242:D252)","v":115},{"$f":"+F241+G241","v":95},{"$f":"SUM(F242:F252)","v":43},{"$f":"SUM(G242:G252)","v":52}]
["Doctorado en Ciencias Biológicas (PEDECIBA) ",65,27,38,20,10,10]
["Doctorado en Física (PEDECIBA)",1,0,1,2,1,1]
["Doctorado en Matemática (PEDECIBA)",2,1,1,2,2,0]
["Maestría en Biotecnología",10,4,6,3,1,2]
["Maestría en Ciencias Ambientales",2,0,2,4,1,3]
["Maestría en Ciencias Biológicas (PEDECIBA) ",70,19,51,52,23,29]
["Maestría en Geociencias (PEDECIBA) ",15,7,8,6,2,4]
["Maestría en Matemática (PEDECIBA) ",11,10,1,2,1,1]
["Doctorado en Biotecnología (PEDECIBA)",7,2,5,0,0,0]
["Maestría en Física (PEDECIBA)",7,7,0,4,2,2]
["Doctorado en Geociencias (PEDECIBA) ",2,0,2,0,0,0]
[]
["FACULTAD DE ENFERMERÍA",{"$f":"+C254+D254","v":93},{"$f":"SUM(C255:C264)","v":10},{"$f":"SUM(D255:D264)","v":83},{"$f":"+F254+G254","v":52},{"$f":"SUM(F255:F264)","v":6},{"$f":"SUM(G255:G264)","v":46}]
["Especialización en Enf. Cuidados Intensivos",{"$f":"+C255+D255","v":90},8,82,{"$f":"+F255+G255","v":0},0,0]
["Maestría en Atención a la Salud en el Primer Nivel",0,0,0,3,0,3]
["Maestría en Gestión de Servicios de Salud",0,0,0,6,1,5]
["Especialización en Enfermería en Salud Familiar y Comunitaria",0,0,0,15,0,15]
["Especialización en Block Quirúrgico (1)",1,1,0,1,1,0]
["Especialización en Enfermería en Neonatología",1,0,1,0,0,0]
["Especialización en Enfermería en Neonatología (1)",1,1,0,1,1,0]
["Maestría en Salud Comunitaria",0,0,0,3,0,3]
["Especialización en administración de servicios de salud",0,0,0,20,3,17]
["Maestría en salud mental",0,0,0,3,0,3]
[]
["FACULTAD DE PSICOLOGÍA",{"$f":"+C266+D266","v":47},{"$f":"SUM(C267:C273)","v":7},{"$f":"SUM(D267:D273)","v":40},{"$f":"+F266+G266","v":54},{"$f":"SUM(F267:F273)","v":5},{"$f":"SUM(G267:G273)","v":49}]
["Diploma en Psicogerontología",{"$f":"+C267+D267","v":31},4,27,{"$f":"C267=+F267+G267","v":false},1,18]
["Maestría en Psicología Clínica",{"$f":"+C268+D268","v":0},0,0,{"$f":"+F268+G268","v":9},0,9]
["Maestría en Psicología Social",0,0,0,7,2,5]
["Doctorado en Psicología",8,2,6,0,0,0]
["Maestría en Psicología y Educación",{"$f":"+C271+D271","v":0},0,0,{"$f":"+F271+G271","v":11},1,10]
["Especialización en Evaluación Psicológica Opción Judicial y Forense",{"$f":"+C272+D272","v":0},0,0,{"$f":"+F272+G272","v":2},0,2]
["Especialización en Servicios de Salud",{"$f":"+C273+D273","v":8},1,7,{"$f":"+F273+G273","v":6},1,5]
[]
["FACULTAD DE INFORMACIÓN Y COMUNICACIÓN (F.I.C.) ",{"$f":"+C275+D275","v":0},{"$f":"SUM(C276:C276)","v":0},{"$f":"SUM(D276:D276)","v":0},{"$f":"+F275+G275","v":3},{"$f":"SUM(F276:F276)","v":0},{"$f":"SUM(G276:G276)","v":3}]
["Maestría en Información y Comunicación",{"$f":"+C276+D276","v":0},0,0,{"$f":"+F276+G276","v":3},0,3]
[]
["ESCUELA DE NUTRICIÓN",{"$f":"+C278+D278","v":37},{"$f":"SUM(C279:C279)","v":1},{"$f":"SUM(D279:D279)","v":36},{"$f":"+F278+G278","v":15},{"$f":"SUM(F279:F279)","v":1},{"$f":"SUM(G279:G279)","v":14}]
["Especialización en Nutrición Enfermedades Crónicas No Transmisibles ",{"$f":"+C279+D279","v":37},1,36,{"$f":"+F279+G279","v":15},1,14]
[]
["Área Social - Comisión Sectorial de Enseñanza",{"$f":"+C281+D281","v":48},{"$f":"SUM(C282:C282)","v":17},{"$f":"SUM(D282:D282)","v":31},{"$f":"+F281+G281","v":3},{"$f":"SUM(F282:F282)","v":1},{"$f":"SUM(G282:G282)","v":2}]
["Maestría en Enseñanza Universitaria",{"$f":"+C282+D282","v":48},17,31,{"$f":"+F282+G282","v":3},1,2]
[]
["CCEE y Medicina",{"$f":"+C284+D284","v":18},{"$f":"C285+C286","v":5},{"$f":"D285+D286","v":13},{"$f":"+F284+G284","v":23},{"$f":"F285+F286","v":7},{"$f":"G285+G286","v":16}]
["Posgrado en Especialización en Gestión de Servicios de Salud",{"$f":"+C285+D285","v":0},0,0,{"$f":"+F285+G285","v":23},7,16]
["Posgrado Gestión de servicios de salud",{"$f":"+C286+D286","v":18},5,13,{"$f":"+F286+G286","v":0},0,0]
[]
["Ciencias, Ingeniería, Química, PEDECIBA, Instituto de Investigaciones Biológicas Clemente Estable, Instituto Pasteur y ANII",{"$f":"SUM(B289:B289)","v":18},{"$f":"SUM(C289:C289)","v":12},{"$f":"SUM(D289:D289)","v":6},{"$f":"+F288+G288","v":2},{"$f":"SUM(F289:F289)","v":2},{"$f":"SUM(G289:G289)","v":0}]
["Maestría en Bioinformática (PEDECIBA) ",{"$f":"+C289+D289","v":18},12,6,{"$f":"+F289+G289","v":2},2,0]
[]
[]
["Ciencias Sociales, Derecho, Medicina y Psicología",{"$f":"+C292+D292","v":0},{"$f":"C293+C294","v":0},{"$f":"D293+D294","v":0},{"$f":"+F292+G292","v":14},{"$f":"F293+F294","v":5},{"$f":"G293+G294","v":9}]
["Maestría en Derechos de Infancia y Políticas Públicas",{"$f":"+C293+D293","v":0},0,0,{"$f":"+F293+G293","v":3},2,1]
["Especialización en Derechos de Infancia y Políticas Públicas",{"$f":"+C294+D294","v":0},0,0,{"$f":"+F294+G294","v":11},3,8]
[]
["IPES (ANEP) - UdelaR",{"$f":"+C296+D296","v":59},{"$f":"SUM(C297:C300)","v":22},{"$f":"SUM(D297:D300)","v":37},{"$f":"+F296+G296","v":6},{"$f":"SUM(F297:F300)","v":1},{"$f":"SUM(G297:G300)","v":5}]
["Diploma en Gestión de Instituciones Educativas",{"$f":"+C297+D297","v":0},0,0,{"$f":"+F297+G297","v":1},0,1]
["Diploma en Matemática",35,15,20,2,0,2]
["Diploma en Matemática (Salto)",4,3,1,0,0,0]
["Diploma de Posgrado en Geografía",20,4,16,3,1,2]
[]
["Ciencias Sociales, Arquitectura, Diseño y Urbanismo, Ciencias, Derecho e Ingeniería",{"$f":"+C302+D302","v":15},{"$f":"C303","v":5},{"$f":"D303","v":10},{"$f":"+F302+G302","v":0},{"$f":"F303","v":0},{"$f":"G303","v":0}]
["Maestría en Manejo Costero Integrado del Cono Sur (Maldonado)",{"$f":"+C303+D303","v":15},5,10,{"$f":"+F303+G303","v":0},0,0]
[]
["Ciencias Económicas, Cs. Sociales y Psicología",{"$f":"+C305+D305","v":8},{"$f":"SUM(C306:C306)","v":2},{"$f":"SUM(D306:D306)","v":6},{"$f":"+F305+G305","v":4},{"$f":"SUM(F306)","v":0},{"$f":"SUM(G306)","v":4}]
["Especialización en Transformación Organizacional",8,2,6,{"$f":"+F306+G306","v":4},0,4]
[]
["Facultades de Ciencias y Agronomía ",{"$f":"+C308+D308","v":3},{"$f":"C309","v":1},{"$f":"D309","v":2},{"$f":"+F308+G308","v":0},{"$f":"F309","v":0},{"$f":"G309","v":0}]
["Maestría en Ciencias Nutricionales",{"$f":"+C309+D309","v":3},1,2,{"$f":"+F309+G309","v":0},0,0]
[]
["Área Social y Artística - Esp. Interdisciplinario",{"$f":"+C311+D311","v":0},{"$f":"C312","v":0},{"$f":"D312","v":0},1,{"$f":"F312","v":0},{"$f":"G312","v":1}]
["Especialización en Gestión Cultural",0,0,0,1,0,1]
[]
["Ciencias, Ingeniería y Psicología",56,{"$f":"C315","v":14},{"$f":"D315","v":42},0,{"$f":"F315","v":0},{"$f":"G315","v":0}]
["Maestría en Ciencias Cognitivas",56,14,42,0,0,0]
[]
["Fuente: Bedelías de los Servicios Universitarios y Sistema de Gestión de Bedelías-SeCIU"]
["Nota:"]
["(1) Egresos por Competencia Notoria"]
["(2) Egresos por Actuación Documentada"]
["PEDECIBA : Programa de Desarrollo de las Ciencias Básicas"]
["El dato de Egresos de Posgrado  2016 es PRELIMINAR"]

{"sheet":"II-7.2.7 ","index":90,"n_rows":171,"n_cols":10,"rows_kept":171,"cut":false,"hidden":false,"merged":[[1,2,3,4],[4,0,4,9],[6,5,6,6],[6,8,6,9],[5,0,7,0],[5,1,7,1],[5,2,5,3],[5,4,7,4],[5,5,5,6],[5,7,7,7],[5,8,5,9],[6,2,6,3],[0,5,1,8]]}
["UNIVERSIDADES PRIVADAS: OFERTA DE POSTGRADO",null,null,null,null,"ALUMNOS MATRICULADOS"]
[]
["Cuadro Nº II-7.2.7"]
[]
["ALUMNOS INGRESADOS, MATRICULADOS Y EGRESADOS EN PROGRAMAS DE POSTGRADO DE UNIVERSIDADES PRIVADAS POR SEXO SEGÚN UNIVERSIDAD Y ACREDITACIÓN. AÑO 2016."]
["UNIVERSIDAD / ACREDITACIÓN","TOTAL","INGRESADOS",null,"TOTAL","MATRICULADOS",null,"TOTAL","EGRESADOS"]
[null,null,"SEXO",null,null,"SEXO",null,null,"SEXO"]
[null,null,"M","F",null,"M","F",null,"M","F"]
["TOTAL",{"$f":"C9+D9","v":1433},{"$f":"C11+C84+C116+C153","v":477},{"$f":"D11+D84+D116+D153","v":956},{"$f":"F9+G9","v":4834},{"$f":"F11+F84+F116+F153","v":1701},{"$f":"G11+G84+G116+G153","v":3133},{"$f":"I9+J9","v":595},{"$f":"I11+I84+I116+I153","v":232},{"$f":"J11+J84+J116+J153","v":363}]
[]
["UCUDAL",{"$f":"C11+D11","v":544},{"$f":"C13+C25+C41+C61+C69+C74+C81","v":100},{"$f":"D13+D25+D41+D61+D69+D74+D81","v":444},{"$f":"F11+G11","v":2045},{"$f":"F13+F25+F41+F61+F69+F74+F81","v":446},{"$f":"G13+G25+G41+G61+G69+G74+G81","v":1599},{"$f":"I11+J11","v":233},{"$f":"I13+I25+I41+I61+I69+I74+I81","v":60},{"$f":"J13+J25+J41+J61+J69+J74+J81","v":173}]
[]
["FACULTAD DE CIENCIAS EMPRESARIALES",{"$f":"C13+D13","v":66},{"$f":"SUM(C14:C23)","v":32},{"$f":"SUM(D14:D23)","v":34},{"$f":"F13+G13","v":275},{"$f":"SUM(F14:F23)","v":141},{"$f":"SUM(G14:G23)","v":134},{"$f":"I13+J13","v":51},{"$f":"SUM(I14:I23)","v":27},{"$f":"SUM(J14:J23)","v":24}]
["Postgrado en Finanzas Corporativas",{"$f":"C14+D14","v":0},0,0,{"$f":"F14+G14","v":7},2,5,{"$f":"I14+J14","v":1},0,1]
["Postgrado en Finanzas Bancarias",0,0,0,1,1,0,{"$f":"I15+J15","v":0},0,0]
["Postgrado en Tributaria",7,3,4,17,6,11,{"$f":"I16+J16","v":6},3,3]
["Postgrado en Marketing",3,0,3,30,6,24,6,3,3]
["Postgrado en Gestión de RRHH",7,2,5,17,5,12,1,1,0]
["Postgrado en Dirección y Administración de Empresas",1,0,1,15,7,8,2,1,1]
["Postgrado en Finanzas",4,1,3,18,8,10,2,1,1]
["Maestría en Dirección de Empresas",21,14,7,144,92,52,31,17,14]
["Maestría en Finanzas",9,7,2,12,9,3,2,1,1]
["Maestría en Marketing (plan 2016)",14,5,9,14,5,9,0,0,0]
[]
["FACULTAD DE CIENCIAS HUMANAS",207,{"$f":"SUM(C26:C39)","v":29},{"$f":"SUM(D26:D39)","v":178},618,{"$f":"SUM(F26:F39)","v":124},{"$f":"SUM(G26:G39)","v":494},96,{"$f":"SUM(I26:I39)","v":17},{"$f":"SUM(J26:J39)","v":79}]
["Postgrado en Cambio Organizacional ",10,1,9,16,1,15,2,1,1]
["Postgrado en Comunicación y Cultura",1,0,1,7,1,6,0,0,0]
["Postgrado en Estrategias Comunicacionales",4,2,2,21,8,13,2,1,1]
["Postgrado en Comunicación Organizacional",14,1,13,42,9,33,2,0,2]
["Postgrado en Gestión Educativa",64,17,47,132,30,102,32,6,26]
["Postgrado en Gestión de Centros Educativos",0,0,0,14,5,9,0,0,0]
["Postgrado en Dificultades de Aprendizaje ",53,0,53,136,3,133,29,1,28]
["Postgrado en Orientación Educativa",11,1,10,31,4,27,6,0,6]
["Maestría en Comunicación - énfasis en Recepción y Cultura",5,0,5,24,8,16,2,0,2]
["Maestría en Educación",19,4,15,79,19,60,9,2,7]
["Maestría en Estudios Organizacionales",5,0,5,36,10,26,3,1,2]
["Maestría en Evaluación de Sistemas Educativos",0,0,0,9,0,9,0,0,0]
["Maestría en Políticas Públicas",21,3,18,66,24,42,8,4,4]
["Maestría en Comunicación Política ",0,0,0,5,2,3,1,1,0]
[]
["FACULTAD DE PSICOLOGÍA",105,{"$f":"SUM(C42:C59)","v":15},{"$f":"SUM(D42:D59)","v":90},572,{"$f":"SUM(F42:F59)","v":79},{"$f":"SUM(G42:G59)","v":493},35,{"$f":"SUM(I42:I59)","v":8},{"$f":"SUM(J42:J59)","v":27}]
["Postgrado en Psiconeuroinmunoendocrinología",28,4,24,69,6,63,1,0,1]
["Postgrado en Psicología Educacional",10,0,10,75,4,71,0,0,0]
["Postgrado en Psicología del Trabajo y Organización",9,1,8,47,3,44,3,0,3]
["Postgrado en Psicología Clínica orientación Cognitiva",13,3,10,50,10,40,3,0,3]
["Postgrado en Drogodependencia",0,0,0,15,5,10,1,0,1]
["Postgrado en Psicología Infantil y del Adolescente",22,2,20,60,4,56,1,0,1]
["Postgrado en Psicología Analítica",2,0,2,13,3,10,0,0,0]
["Postgrado en Psicología Sistémica y Familias",0,0,0,28,2,26,6,0,6]
["Postgrado en Intervención Psicosocial",0,0,0,15,1,14,0,0,0]
["Postgrado en Diabetología",0,0,0,23,5,18,12,5,7]
["Maestría en Intervención Psicopedagógica",2,0,2,18,0,18,0,0,0]
["Maestría en Psicología Educacional",14,5,9,43,8,35,4,0,4]
["Maestría en Psicología Clínica Niños y Adolescentes",5,0,5,33,8,25,0,0,0]
["Maestría en Psicoterapia Jungiana",0,0,0,37,15,22,2,2,0]
["Maestría en Psicología Clínica Familiar Sistémica",0,0,0,8,0,8,2,1,1]
["Maestría en Psicología Clínica orientación Cognitiva",0,0,0,12,2,10,0,0,0]
["Maestría en Atención Temprana",0,0,0,13,0,13,0,0,0]
["Doctorado en Psicología",0,0,0,13,3,10,0,0,0]
[]
["FACULTAD DE ENFERMERÍA Y TECNOLOGÍAS DE LA SALUD",69,{"$f":"SUM(C62:C67)","v":7},{"$f":"SUM(D62:D67)","v":62},191,{"$f":"SUM(F62:F67)","v":15},{"$f":"SUM(G62:G67)","v":176},21,{"$f":"SUM(I62:I67)","v":2},{"$f":"SUM(J62:J67)","v":19}]
["Postgrado en Gestión de Servicios de Salud",32,2,30,91,9,82,3,2,1]
["Postgrado en Enfermería Oncológica",0,0,0,1,0,1,0,0,0]
["Postgrado en Enfermería Cuidados Intensivos",20,3,17,42,2,40,8,0,8]
["Postgrado en Urgencias y Emergencias Hospitalarias",0,0,0,19,0,19,2,0,2]
["Maestría en Nutrición",0,0,0,19,2,17,8,0,8]
["Maestría en Cuidados Paliativos (plan 2016)",17,2,15,19,2,17,0,0,0]
[]
["FACULTAD DE ODONTOLOGÍA",84,{"$f":"SUM(C70:C72)","v":9},{"$f":"SUM(D70:D72)","v":75},266,{"$f":"SUM(F70:F72)","v":35},{"$f":"SUM(G70:G72)","v":231},27,{"$f":"SUM(I70:I72)","v":5},{"$f":"SUM(J70:J72)","v":22}]
["Postgrado de especialización en Cirugía para Implantes y Prótesis Óseointegradas",0,0,0,14,3,11,13,2,11]
["Postgrado de Especialización en Ortodoncia y Ortopedia Bucomaxilofacial",74,7,67,244,30,214,14,3,11]
["Postgrado en Odontología Restauradora y Prostodoncia Fija",10,2,8,8,2,6,0,0,0]
[]
["FACULTAD DE INGENIERÍA Y TECNOLOGÍAS ",13,{"$f":"SUM(C75:C79)","v":8},{"$f":"SUM(D75:D79)","v":5},65,{"$f":"SUM(F75:F79)","v":36},{"$f":"SUM(G75:G79)","v":29},3,{"$f":"SUM(I75:I79)","v":1},{"$f":"SUM(J75:J79)","v":2}]
["Postgrado en Ciencia y Tecnología de Alimentos",2,1,1,18,2,16,2,0,2]
["Maestría en Ciencias de la Ingeniería Eléctrica",0,0,0,4,4,0,1,1,0]
["Maestría en Gerencia de Energía",5,5,0,17,13,4,0,0,0]
["Maestría en Gerencia de Tecnologías de la Información",5,2,3,23,16,7,0,0,0]
["Maestría en Tecnología y Gestión de Industria de los alimentos",{"$f":"C79+D79","v":1},0,1,{"$f":"F79+G79","v":3},1,2,{"$f":"I79+J79","v":0},0,0]
[]
["FACULTAD DE DERECHO",0,{"$f":"C82","v":0},{"$f":"D82","v":0},58,{"$f":"F82","v":16},{"$f":"G82","v":42},0,{"$f":"I82","v":0},{"$f":"J82","v":0}]
["Maestría en Derecho Civíl",0,0,0,58,16,42,0,0,0]
[]
["UNIVERSIDAD ORT URUGUAY",223,{"$f":"C86+C103+C106+C109","v":81},{"$f":"D86+D103+D106+D109","v":142},716,{"$f":"F86+F103+F106+F109","v":265},{"$f":"G86+G103+G106+G109","v":451},196,{"$f":"I86+I103+I106+I109","v":73},{"$f":"J86+J103+J106+J109","v":123}]
[]
["FACULTAD DE ADMINISTRACIÓN Y CIENCIAS SOCIALES",158,{"$f":"SUM(C87:C101)","v":60},{"$f":"SUM(D87:D101)","v":98},505,{"$f":"SUM(F87:F101)","v":189},{"$f":"SUM(G87:G101)","v":316},135,{"$f":"SUM(I87:I101)","v":49},{"$f":"SUM(J87:J101)","v":86}]
["Diploma de Especialización en Recursos Humanos",15,2,13,46,9,37,13,2,11]
["Diploma de Especialización en Finanzas",7,5,2,27,13,14,12,6,6]
["Master en Administración de Empresas",43,26,17,115,64,51,30,17,13]
["Master en Políticas Públicas",0,0,0,0,0,0,0,0,0]
["MBA en Agronegocios",0,0,0,0,0,0,0,0,0]
["Master en Dirección de Recursos Humanos",17,3,14,43,6,37,4,1,3]
["Master en Dirección Financiera",11,6,5,24,14,10,5,2,3]
["Diploma de Especialización en Impuestos",23,6,17,80,24,56,19,4,15]
["Diploma de Especialización en Dirección de Marketing",18,7,11,47,13,34,22,4,18]
["Diploma de Especialización en Contabilidad",15,4,11,39,8,31,6,1,5]
["Master en Impuestos y Normas de Contabilidad - NIIF",5,0,5,24,4,20,4,1,3]
["Diploma de Especialización en Economía",0,0,0,0,0,0,2,1,1]
["Master en Economía",0,0,0,9,6,3,1,0,1]
["Master en Gerencia de Empresas Tecnológicas TIC",0,0,0,33,25,8,11,9,2]
["Master en Contabilidad y Finanzas",4,1,3,18,3,15,6,1,5]
[]
["FACULTAD DE INGENIERÍA",2,{"$f":"C104","v":2},{"$f":"D104","v":0},22,{"$f":"F104","v":18},{"$f":"G104","v":4},5,{"$f":"I104","v":3},{"$f":"J104","v":2}]
["Master en Ingeniería",2,2,0,22,18,4,5,3,2]
[]
["FACULTAD DE ARQUITECTURA",20,{"$f":"C107","v":11},{"$f":"D107","v":9},31,{"$f":"F107","v":21},{"$f":"G107","v":10},8,{"$f":"I107","v":7},{"$f":"J107","v":1}]
["Diploma de Especialización en Negocios Inmobiliarios",20,11,9,31,21,10,8,7,1]
[]
["INSTITUTO DE EDUCACIÓN",43,{"$f":"SUM(C110:C114)","v":8},{"$f":"SUM(D110:D114)","v":35},158,{"$f":"SUM(F110:F114)","v":37},{"$f":"SUM(G110:G114)","v":121},48,{"$f":"SUM(I110:I114)","v":14},{"$f":"SUM(J110:J114)","v":34}]
["Diploma en Educación (a distancia)",0,0,0,0,0,0,17,4,13]
["Master en Educación",17,2,15,83,18,65,20,7,13]
["Diploma en Planificación y Gestión Educativa (a distancia)",5,0,5,6,0,6,1,0,1]
["Master en Gestión Educativa",21,6,15,45,13,32,8,2,6]
["Doctorado en Educación",0,0,0,24,6,18,2,1,1]
[]
["UNIVERSIDAD DE MONTEVIDEO",342,{"$f":"C118+C122+C130+C135+C142+C145+C149","v":157},{"$f":"D118+D122+D130+D135+D142+D145+D149","v":185},1315,{"$f":"F118+F122+F130+F135+F142+F145+F149","v":647},{"$f":"G118+G122+G130+G135+G142+G145+G149","v":668},145,{"$f":"I118+I122+I130+I135+I142+I145+I149","v":85},{"$f":"J118+J122+J130+J135+J142+J145+J149","v":60}]
[]
["FACULTAD DE CIENCIAS EMPRESARIALES Y ECONOMÍA",53,{"$f":"C119+C120","v":29},{"$f":"D119+D120","v":24},160,{"$f":"F119+F120","v":91},{"$f":"G119+G120","v":69},12,{"$f":"I119+I120","v":5},{"$f":"J119+J120","v":7}]
["Maestría en Finanzas",40,21,19,111,64,47,11,4,7]
["Maestría en Economía",13,8,5,49,27,22,1,1,0]
[]
["FACULTAD DE DERECHO",73,{"$f":"SUM(C123:C128)","v":25},{"$f":"SUM(D123:D128)","v":48},403,{"$f":"SUM(F123:F128)","v":155},{"$f":"SUM(G123:G128)","v":248},24,{"$f":"SUM(I123:I128)","v":6},{"$f":"SUM(J123:J128)","v":18}]
["Maestría en Derecho Administrativo Económico",6,2,4,40,18,22,3,1,2]
["Maestría en Derecho de la Empresa",0,0,0,42,16,26,1,1,0]
["Maestría en Derecho y Técnica Tributaria",15,8,7,114,44,70,11,4,7]
["Maestría en Derecho LL.M.",28,11,17,95,40,55,0,0,0]
["Maestría en Comercio Internacional e Integración",2,1,1,34,17,17,1,0,1]
["Maestría en Contabilidad y Técnica Tributaria",22,3,19,78,20,58,8,0,8]
[]
["INSTITUTO DE ESTUDIOS EMPRESARIALES",128,{"$f":"SUM(C131:C133)","v":77},{"$f":"SUM(D131:D133)","v":51},454,{"$f":"SUM(F131:F133)","v":287},{"$f":"SUM(G131:G133)","v":167},87,{"$f":"SUM(I131:I133)","v":59},{"$f":"SUM(J131:J133)","v":28}]
["Maestría en Profesional Dirección y Administración de Empresas  ",107,64,43,351,225,126,71,49,22]
["Maestría en Dirección de Empresas de Salud",21,13,8,76,48,28,16,10,6]
["Maestría en Gestión Humana de las Organizaciones",0,0,0,27,14,13,0,0,0]
[]
["CENTRO DE CIENCIAS BIOMÉDICAS",29,{"$f":"SUM(C136:C140)","v":13},{"$f":"SUM(D136:D140)","v":16},204,{"$f":"SUM(F136:F140)","v":74},{"$f":"SUM(G136:G140)","v":130},14,{"$f":"SUM(I136:I140)","v":7},{"$f":"SUM(J136:J140)","v":7}]
["Maestría en Medicina Familiar",1,0,1,37,8,29,7,0,7]
["Maestría en Farmacología Clínica",0,0,0,27,5,22,0,0,0]
["Especialización en Medicina de Emergencia",26,11,15,105,36,69,2,2,0]
["Especialización en Traumatología y Ortopedia",2,2,0,22,20,2,5,5,0]
["Especialización en Mastología",0,0,0,13,5,8,0,0,0]
[]
["FACULTAD DE HUMANIDADES",{"$f":"C142+D142","v":14},{"$f":"C143","v":4},{"$f":"D143","v":10},{"$f":"F142+G142","v":37},{"$f":"F143","v":22},{"$f":"G143","v":15},{"$f":"I142+J142","v":1},{"$f":"I143","v":1},{"$f":"J143","v":0}]
["Maestría en Historia",14,4,10,37,22,15,1,1,0]
[]
["FACULTAD DE COMUNICACIÓN",43,{"$f":"C146+C147","v":8},{"$f":"D146+D147","v":35},45,{"$f":"F146+F147","v":8},{"$f":"G146+G147","v":37},0,{"$f":"I146+I147","v":0},{"$f":"J146+J147","v":0}]
["Maestría en Estudios Latinoamericanos",0,0,0,2,0,2,0,0,0]
["Maestría en Dirección de Comunicación",43,8,35,43,8,35,0,0,0]
[]
["FACULTAD DE INGENIERÍA",2,{"$f":"C150+C151","v":1},{"$f":"D150+D151","v":1},12,{"$f":"F150+F151","v":10},{"$f":"G150+G151","v":2},7,{"$f":"I150+I151","v":7},{"$f":"J150+J151","v":0}]
["Maestría en Investigación Aplicada en Ingeniería",2,1,1,5,3,2,0,0,0]
["Especializacion en Producción más Limpia",0,0,0,7,7,0,7,7,0]
[]
["UNIVERSIDAD DE LA EMPRESA",324,{"$f":"C155+C159+C163+C166","v":139},{"$f":"D155+D159+D163+D166","v":185},758,{"$f":"F155+F159+F163+F166","v":343},{"$f":"G155+G159+G163+G166","v":415},21,{"$f":"I155+I159+I163+I166","v":14},{"$f":"J155+J159+J163+J166","v":7}]
[]
["FACULTAD DE CIENCIAS EMPRESARIALES ",86,{"$f":"SUM(C156:C157)","v":45},{"$f":"SUM(D156:D157)","v":41},281,{"$f":"SUM(F156:F157)","v":165},{"$f":"SUM(G156:G157)","v":116},11,{"$f":"SUM(I156:I157)","v":8},{"$f":"SUM(J156:J157)","v":3}]
["Maestría en Dirección y Administración de Empresas ",68,35,33,246,143,103,10,7,3]
["Maestría en Marketing y Dirección Comercial",18,10,8,35,22,13,1,1,0]
[]
["FACULTAD DE CIENCIAS JURIDÍCAS",67,{"$f":"C160+C161","v":31},{"$f":"D160+D161","v":36},104,{"$f":"F160+F161","v":51},{"$f":"G160+G161","v":53},3,{"$f":"I160+I161","v":3},{"$f":"J160+J161","v":0}]
["Maestría en Ciencias Criminológico Forenses",27,16,11,25,15,10,1,1,0]
["Maestría en Derecho de las Relaciones Internacionales",40,15,25,79,36,43,2,2,0]
[]
["FACULTAD DE CIENCIAS DE LA  EDUCACIÓN",152,{"$f":"C164","v":50},{"$f":"D164","v":102},344,{"$f":"F164","v":108},{"$f":"G164","v":236},5,{"$f":"I164","v":2},{"$f":"J164","v":3}]
["Maestría en Educación",152,50,102,344,108,236,5,2,3]
[]
["FACULTAD DE CIENCIAS AGRARIAS",19,{"$f":"C167+C168","v":13},{"$f":"D167+D168","v":6},29,{"$f":"F167+F168","v":19},{"$f":"G167+G168","v":10},2,{"$f":"I167+I168","v":1},{"$f":"J167+J168","v":1}]
["Maestría en Administración de Agronegocios",12,9,3,19,14,5,2,1,1]
["Posgrado en Administración de Agronegocios",7,4,3,10,5,5,0,0,0]
[]
[]
["Fuente: Oficinas Productoras de cada una de las Instituciones. "]

{"sheet":"II-7.2.8 ","index":91,"n_rows":52,"n_cols":10,"rows_kept":52,"cut":false,"hidden":false,"merged":[[6,5,6,6],[6,8,6,9],[53,0,53,5],[0,5,1,8],[4,0,4,9],[5,0,7,0],[5,1,7,1],[5,2,5,3],[5,4,7,4],[5,5,5,6],[5,7,7,7],[5,8,5,9],[6,2,6,3]]}
["INSTITUTOS UNIVERSITARIOS: OFERTA DE POSTGRADO",null,null,null,null,"ALUMNOS MATRICULADOS"]
[]
["Cuadro Nº II-7.2.8"]
[]
["ALUMNOS INGRESADOS, MATRICULADOS Y EGRESADOS EN PROGRAMAS DE POSTGRADO DE INSTITUTOS UNIVERSITARIOS POR SEXO SEGÚN INSTITUTO UNIVERSITARIO Y ACREDITACIÓN. AÑO 2016."]
["INSTITUTO UNIVERSITARIO / ACREDITACIÓN","TOTAL","INGRESADOS",null,"TOTAL","MATRICULADOS",null,"TOTAL","EGRESADOS"]
[null,null,"SEXO",null,null,"SEXO",null,null,"SEXO"]
[null,null,"M","F",null,"M","F",null,"M","F"]
["TOTAL",{"$f":"SUM(C9:D9)","v":569},{"$f":"C11+C25+C28+C31+C34+C37+C41+C47+C50","v":416},{"$f":"D11+D25+D28+D31+D34+D37+D41+D47+D50","v":153},{"$f":"SUM(F9:G9)","v":706},{"$f":"F11+F25+F28+F31+F34+F37+F41+F47+F50","v":482},{"$f":"G11+G25+G28+G31+G34+G37+G41+G47+G50","v":224},{"$f":"SUM(I9:J9)","v":373},{"$f":"I11+I25+I28+I31+I34+I37+I41+I47+I50","v":295},{"$f":"J11+J25+J28+J31+J34+J37+J41+J47+J50","v":78}]
[]
["INST UNIV CLAEH ",{"$f":"+C11+D11","v":88},{"$f":"SUM(C12:C23)","v":25},{"$f":"SUM(D12:D23)","v":63},{"$f":"+F11+G11","v":154},{"$f":"SUM(F12:F23)","v":50},{"$f":"SUM(G12:G23)","v":104},{"$f":"I11+J11","v":41},{"$f":"SUM(I12:I23)","v":13},{"$f":"SUM(J12:J23)","v":28}]
["Especialización en Didáctica de la Historia",{"$f":"+C12+D12","v":0},0,0,{"$f":"+F12+G12","v":22},6,16,{"$f":"+I12+J12","v":0},0,0]
["Especialización en Gestión de Servicios de  Salud",29,7,22,51,17,34,11,4,7]
["Especialización en Didácticas de la Educación Básica",3,0,3,5,0,5,3,1,2]
["Especialización en Docencia de la Educación Media",9,3,6,11,4,7,1,0,1]
["Especialización en Didáctica de la Educación Superior",20,6,14,18,7,11,13,5,8]
["Especialización en Tecnología Educativa",10,3,7,6,3,3,4,1,3]
["Maestria en Tecnología Educativa",0,0,0,6,1,5,2,0,2]
["Maestría en Docencia de la Educación Media",0,0,0,3,1,2,4,1,3]
["Maestría en Didáctica de la Educación Superior",0,0,0,9,3,6,2,1,1]
["Maestría en Política y Gestión de la Salud",17,6,11,0,0,0,0,0,0]
["Especialización en Historia del Arte y Patrimonio",0,0,0,23,8,15,0,0,0]
["Especialización en Política y Gestión de la Educación",0,0,0,0,0,0,1,0,1]
[]
["INSTITUTO UNIVERSITARIO DE POSTGRADO EN PSICOANÁLISIS (IUPP) ",{"$f":"+C25+D25","v":3},{"$f":"SUM(C26)","v":0},{"$f":"SUM(D26)","v":3},{"$f":"+F25+G25","v":34},{"$f":"SUM(F26)","v":3},{"$f":"SUM(G26)","v":31},{"$f":"+I25+J25","v":6},{"$f":"SUM(I26)","v":0},{"$f":"SUM(J26)","v":6}]
["Maestría en Psicoanálisis",{"$f":"+C26+D26","v":3},0,3,{"$f":"+F26+G26","v":34},3,31,{"$f":"+I26+J26","v":6},0,6]
[]
["INST METODISTA UNIV CRANDON* ",{"$f":"+C28+D28","v":3},{"$f":"SUM(C29)","v":1},{"$f":"SUM(D29)","v":2},{"$f":"+F28+G28","v":3},{"$f":"SUM(F29)","v":1},{"$f":"SUM(G29)","v":2},{"$f":"+I28+J28","v":3},{"$f":"SUM(I29)","v":1},{"$f":"SUM(J29)","v":2}]
["Posgrado de Especialización en la lengua inglesa",{"$f":"+C29+D29","v":3},1,2,{"$f":"+F29+G29","v":3},1,2,{"$f":"+I29+J29","v":3},1,2]
[]
["INSTITUTO UNIVERSITARIO CENTRO DE ESTUDIO Y DIAGNOSTICO DE LAS DISGNANCIAS DEL URUGUAY (IUCEDDU)",{"$f":"+C31+D31","v":6},{"$f":"C32","v":3},{"$f":"D32","v":3},{"$f":"+F31+G31","v":41},{"$f":"F32","v":26},{"$f":"G32","v":15},{"$f":"+I31+J31","v":3},{"$f":"I32","v":1},{"$f":"J32","v":2}]
["Especialización en Ortopedia y Ortodoncia Maxilo facial",6,3,3,41,26,15,3,1,2]
[]
["INST UNIV ASOCIACIÓN CRISTIANA DE JÓVENES",{"$f":"+C34+D34","v":40},{"$f":"C35","v":37},{"$f":"D35","v":3},{"$f":"+F34+G34","v":40},{"$f":"F35","v":37},{"$f":"G35","v":3},{"$f":"+I34+J34","v":0},{"$f":"I35","v":0},{"$f":"J35","v":0}]
["Maestría en Alto Rendimiento en Deportes de Equipo (Maldonado)",40,37,3,{"$f":"E36","v":0},37,3,{"$f":"H36","v":0},0,0]
[]
["Centro de Altos Estudios Nacionales (CALEN)",{"$f":"+C37+D37","v":59},{"$f":"C38+C39","v":34},{"$f":"D38+D39","v":25},{"$f":"+F37+G37","v":59},{"$f":"F38+F39","v":34},{"$f":"G38+G39","v":25},{"$f":"+I37+J37","v":17},{"$f":"I38+I39","v":10},{"$f":"J38+J39","v":7}]
["Primer Año Maestría en Estrategia Nacional",{"$f":"+C38+D38","v":35},22,13,{"$f":"+F38+G38","v":35},22,13,{"$f":"+I38+J38","v":13},7,6]
["Segundo Año Maestría en Estrategia Nacional",{"$f":"+C39+D39","v":24},12,12,{"$f":"+F39+G39","v":24},12,12,4,3,1]
[]
["Escuela de Guerra Naval (ESGUE)",{"$f":"C41+D41","v":110},{"$f":"SUM(C42:C45)","v":99},{"$f":"SUM(D42:D45)","v":11},{"$f":"F41+G41","v":110},{"$f":"SUM(F42:F45)","v":99},{"$f":"SUM(G42:G45)","v":11},{"$f":"I41+J41","v":63},{"$f":"SUM(I42:I45)","v":57},{"$f":"SUM(J42:J45)","v":6}]
["Curso de Pasaje de Grado de TTNN para CCCC",50,45,5,{"$f":"F42+G42","v":50},45,5,24,20,4]
["Curso de Pasaje de Grado de AANN para TTNN",33,27,6,{"$f":"F43+G43","v":33},27,6,20,18,2]
["Curso de Pasaje de Grado de CCCC para CCFF",18,18,0,{"$f":"F44+G44","v":18},18,0,10,10,0]
["Curso Estado Mayor Naval",9,9,0,{"$f":"F45+G45","v":9},9,0,9,9,0]
[]
["Instituto de Perfeccionamiento y Estudios Superiores -IPES",20,{"$f":"SUM(C48:C48)","v":4},{"$f":"SUM(D48:D48)","v":16},{"$f":"F47+G47","v":25},{"$f":"SUM(F48:F48)","v":19},{"$f":"SUM(G48:G48)","v":6},0,{"$f":"SUM(I48:I48)","v":0},{"$f":"SUM(J48:J48)","v":0}]
["Diploma en Geografía",20,4,16,25,19,6,0,0,0]
[]
["Escuela Naval",{"$f":"C50+D50","v":240},{"$f":"SUM(C51:C51)","v":213},{"$f":"SUM(D51:D51)","v":27},{"$f":"F50+G50","v":240},{"$f":"SUM(F51:F51)","v":213},{"$f":"SUM(G51:G51)","v":27},{"$f":"I50+J50","v":240},{"$f":"SUM(I51:I51)","v":213},{"$f":"SUM(J51:J51)","v":27}]
["CURSOS OMI (ORGANIZACIÓN MARITIMA INTERNACIONAL)",240,213,27,240,213,27,240,213,27]
["Fuente: Oficinas Productoras de cada una de las Instituciones. "]

{"sheet":"II-7.2.9","index":92,"n_rows":49,"n_cols":18,"rows_kept":49,"cut":false,"hidden":false,"merged":[[47,0,47,8],[47,9,47,11],[48,0,48,8],[48,9,48,11],[42,0,42,8],[43,0,43,8],[44,0,44,9],[45,0,45,9],[46,0,46,8],[46,9,46,11],[0,0,0,2],[2,0,2,16],[3,0,3,16],[4,1,4,16],[41,0,41,8]]}
["UNIVERSIDADES E INSTITUTOS UNIVERSITARIOS"]
[]
["Cuadro II-7.2.9"]
["EVOLUCIÓN DE LA MATRÍCULA DE LAS INSTITUCIONES UNIVERSITARIAS (2000 – 2016)."]
["INSTITUCIONES","AÑO LECTIVO"]
["UNIVERSITARIAS",2000,2001,2002,2003,2004,2005,2006,2007,2008,2009,2010,2011,2012,2013,2014,2015,2016]
[]
["TOTAL  ",{"$f":"B10+B23","v":82932},{"$f":"C10+C23","v":88538},93462,98700,103941,115096,123020,131000,136304,138574,{"$f":"L10+L23","v":145795},{"$f":"M10+M23+M37","v":151169},155916,159788,163322,{"$f":"Q10+Q23+Q37","v":166622},{"$f":"R10+R23+R37","v":170462}]
[]
["Total Universidades   ",{"$f":"B12+B18","v":82717},88200,93054,98287,103348,113698,121371,129122,133535,136284,143233,148133,153627,157511,161200,{"$f":"Q12+Q18","v":164341},{"$f":"R12+R18","v":168129}]
[]
["Universidades Públicas",{"$f":"B14+B16","v":74454},{"$f":"C14+C16","v":79016},83857,88994,94447,100233,106374,112891,116290,119791,123398,127114,130941,{"$f":"O14+O16","v":133911},{"$f":"P14+P16","v":136993},{"$f":"Q14+Q16","v":139923},{"$f":"R14+R16","v":142569}]
[]
["UdelaR **",74454,79016,83857,88994,94447,100233,106374,112891,116290,119791,123398,127114,130941,133911,136938,139754,142211]
[]
["UTEC",null,null,null,null,null,null,null,null,null,null,null,null,null,null,55,169,358]
[]
["Universidades Privadas  ",8263,9184,9197,9293,{"$f":"SUM(F19:F22)","v":8901},13465,14997,16231,17245,16493,19835,21019,22686,{"$f":"SUM(O19:O22)","v":23600},{"$f":"SUM(P19:P22)","v":24207},{"$f":"SUM(Q19:Q22)","v":24418},{"$f":"SUM(R19:R22)","v":25560}]
["Univ Católica del Uruguay  ",4057,4180,3591,3849,3286,5580,5911,6401,7126,7227,7996,{"$f":"6655+2244","v":8899},9478,9402,9349,9496,9373]
["Univ ORT Uruguay  ",3445,3572,3900,3777,3827,5674,5863,6118,6442,7202,7199,{"$f":"6991+631","v":7622},7511,8208,8345,8194,8065]
["Univ de la Empresa ",0,609,909,790,872,911,1611,1756,1739,2064,2465,{"$f":"1667+472","v":2139},3475,3743,4155,4134,4069]
["Univ de Montevideo  ",575,775,749,824,916,1300,1612,1956,1938,null,2175,{"$f":"1780+579","v":2359},2222,2247,2358,2594,4053]
["Total Institutos Universitarios  ",{"$f":"SUM(B24:B34)","v":215},338,408,413,593,1398,1649,1878,2769,2290,2562,2930,2132,2132,1937,{"$f":"SUM(Q24:Q36)","v":2121},{"$f":"SUM(R24:R36)","v":1924}]
["IU Autónomo del Sur ",215,211,218,184,195,318,428,414,428,515,605,691,"n/c","n/c","n/c","n/c","n/c"]
["IU Asoc Cristiana de Jóvenes ",0,93,140,141,184,407,508,449,352,346,427,515,587,639,603,520,615]
["IU CLAEH ",0,0,0,39,91,283,412,483,483,740,651,{"$f":"354+352","v":706},532,607,679,680,515]
["IU Monseñor Mariano Soler ",0,0,0,0,59,65,50,83,54,50,42,61,61,59,64,70,71]
["IU Asoc Psico del Uruguay",0,0,0,0,35,25,31,29,34,38,40,48,42,45,35,41,34]
["IU Crandon ",0,0,0,0,29,60,59,72,21,89,78,{"$f":"48+9","v":57},48,41,20,20,51]
["IU San Francisco de Asis ",0,0,0,0,0,83,161,202,202,237,380,489,441,435,393,437,433]
["IU Bios",0,0,0,0,0,157,0,146,178,112,109,94,68,"n/c","n/c","n/c","n/c"]
["IU Maldonado-Punta del Este","n/c","n/c","n/c","n/c","n/c","n/c","n/c","n/c",1017,"n/c","n/c","n/c","n/c","n/c","n/c","n/c","n/c"]
["Fundación Politécnico Punta del Este","n/c","n/c","n/c","n/c","n/c","n/c","n/c","n/c","n/c","n/c","n/c","n/c",42,41,39,41,32]
["IU CEDIIAP ",0,34,50,49,0,0,0,0,0,163,230,{"$f":"227+42","v":269},311,265,104,89,107]
["IUCEDDU",null,null,null,null,null,null,null,null,null,null,null,null,null,null,null,34,41]
["IPES",null,null,null,null,null,null,null,null,null,null,null,null,null,null,null,189,25]
["Total Área Seguridad y Defensa","n/c","n/c","n/c","n/c","n/c","n/c","n/c","n/c","n/c","n/c","n/c",{"$f":"SUM(M38:M52)","v":106},{"$f":"SUM(N38:N52)","v":157},{"$f":"SUM(O38:O41)","v":145},{"$f":"SUM(P38:P41)","v":185},{"$f":"SUM(Q38:Q41)","v":160},{"$f":"SUM(R38:R41)","v":409}]
["Escuela Nacional de Policía *","n/c","n/c","n/c","n/c","n/c","n/c","n/c","n/c","n/c","n/c","n/c","s/d",77,52,27,"-","-"]
["Escuela Naval","n/c","n/c","n/c","n/c","n/c","n/c","n/c","n/c","n/c","n/c","n/c","s/d",25,"s/d","s/d","s/d",240]
["CALEN","n/c","n/c","n/c","n/c","n/c","n/c","n/c","n/c","n/c","n/c","n/c",106,55,62,49,43,59]
["Escuela de Guerra Naval",null,null,null,null,null,null,null,null,null,null,null,null,null,31,109,117,110]
["Fuentes: Oficinas productoras de cada una de las instituciones"]
[" (**) Proyección de Matrícula de Estudiantes de Grado de la UdelaR (División de Estadística, año 2015). (Incluye carreras técnicas, tecnológicas y de grado)."]
["Las Universidades privadas e Institutos Universitarios incluyen grado y postgrado. "]
["Para el instituto CEDIIAP no se incluye información de los años anteriores por no haber reportado información en el períodos 2004-2008. "]
["El Instituto Universitario \"Instituto de Estudios para la Salud y el Desarrollo Florence Ninghtingale\" (INSADE), que registrara actividad en los años 2000 a 2003 de la serie presentada, luego no reportó información, por lo cual fue retirado de la tabla. Sin embargo la matrícula correspondiente a dichos años sigue incluida en el ítem \"Total de Institutos Universitarios\"."]
["* En la Escuela Nacional de Policía durante el 2015 no se dictó  la Licenciatura en Seguridad Pública"]
["**IPES: La oferta educativa no se abre hasta que no culmine la cohorte que comenzó el año anterior. "]
["Escuela Naval : corresponden a los cursos OMI (Organización Marítima Internacional)"]

{"sheet":"II-7.2.10 ","index":93,"n_rows":171,"n_cols":11,"rows_kept":171,"cut":false,"hidden":false,"merged":[[172,0,172,5],[0,3,1,6],[4,0,4,10],[5,0,8,0],[5,1,5,10],[6,1,8,1],[6,2,6,4],[6,5,6,7],[6,8,6,10],[7,2,8,2],[7,3,7,4],[7,5,8,5],[7,6,7,7],[7,8,8,8],[7,9,7,10],[170,0,170,10]]}
["UNIVERSIDADES E INSTITUTOS UNIVERSITARIOS",null,null,"PERSONAL ACADÉMICO"]
[]
["Cuadro Nº II-7.2.10"]
[]
["PERSONAL DOCENTE Y NO DOCENTE DE INSTITUCIONES UNIVERSITARIAS PÚBLICAS Y PRIVADAS EXPRESADAS EN POSICIONES FUNCIONALES POR CARGA HORARIA SEMANAL SEGÚN INSTITUCIÓN, ACTIVIDAD Y SEXO. AÑO 2016."]
["INSTITUCIÓN / ACTIVIDAD","Carga horaria semanal"]
[null,"TOTAL","19 y -",null,null,"20 a 39",null,null,"40 y +"]
[null,null,"Total","Sexo",null,"Total","Sexo",null,"Total","Sexo"]
[null,null,null,"M","F",null,"M","F",null,"M","F"]
["TOTAL DOCENTE Y NO DOCENTE",{"$f":"+C10+F10+I10","v":25552},{"$f":"+C11+C12","v":9406},{"$f":"SUM(D11:D12)","v":3185},{"$f":"SUM(E11:E12)","v":2441},{"$f":"+F11+F12","v":9208},{"$f":"SUM(G11:G12)","v":1016},{"$f":"SUM(H11:H12)","v":512},{"$f":"+I11+I12","v":6938},{"$f":"SUM(J11:J12)","v":389},{"$f":"SUM(K11:K12)","v":440}]
["Total Personal Docente",{"$f":"+C11+F11+I11","v":18311},{"$f":"C15+C23+C27","v":9143},{"$f":"D15+D23+D27","v":3085},{"$f":"E15+E23+E27","v":2279},{"$f":"F15+F23+F27","v":6556},921,328,{"$f":"I15+I23+I27","v":2612},169,147]
["Total Personal NO Docente",{"$f":"+C12+F12+I12","v":7241},{"$f":"C16+C24+C28","v":263},{"$f":"D16+D24+D28","v":100},162,{"$f":"F16+F24+F28","v":2652},{"$f":"G16+G24+G28","v":95},{"$f":"H16+H24+H28","v":184},{"$f":"I16+I24+I28","v":4326},220,293]
[]
["TOTAL INSTITUCIONES UNIVERSITARIAS PÚBLICAS DOCENTE Y NO DOCENTE",{"$f":"+C14+F14+I14","v":17763},{"$f":"+C15+C16","v":3806},{"$f":"SUM(D15:D16)","v":13},{"$f":"SUM(E15:E16)","v":13},{"$f":"+F15+F16","v":7759},{"$f":"SUM(G15:G16)","v":42},{"$f":"SUM(H15:H16)","v":37},{"$f":"+I15+I16","v":6198},{"$f":"SUM(J15:J16)","v":40},{"$f":"SUM(K15:K16)","v":49}]
["Personal Docente de Universidades e Institutos Públicos",{"$f":"+C15+F15+I15","v":11493},{"$f":"C19+C31+C155","v":3804},{"$f":"D19+SUM(D31:D35)+SUM(D155:D159)","v":12},{"$f":"E19+SUM(E31:E35)+SUM(E155:E159)","v":13},{"$f":"F19+F31+F155","v":5368},{"$f":"G19+SUM(G31:G35)+SUM(G155:G159)","v":33},{"$f":"H19+SUM(H31:H35)+SUM(H155:H159)","v":28},{"$f":"I19+I31+I155","v":2321},{"$f":"J19+SUM(J31:J35)+SUM(J155:J159)","v":17},{"$f":"K19+SUM(K31:K35)+SUM(K155:K159)","v":8}]
["Personal NO Docente de Universidades e Institutos Públicos",{"$f":"+C16+F16+I16","v":6270},{"$f":"C20+C36+C160","v":2},1,0,2391,9,9,3877,23,41]
[]
["TOTAL UDELAR DOCENTE Y NO DOCENTE*",{"$f":"+C18+F18+I18","v":17569},{"$f":"+C19+C20","v":3780},"s/d","s/d",{"$f":"+F19+F20","v":7680},"s/d","s/d",{"$f":"+I19+I20","v":6109},"s/d","s/d"]
["Personal Docente UDELAR",{"$f":"+C19+F19+I19","v":11382},3779,"s/d","s/d",5307,"s/d","s/d",2296,"s/d","s/d"]
["Personal NO Docente UDELAR",{"$f":"+C20+F20+I20","v":6187},1,"s/d","s/d",2373,"s/d","s/d",3813,"s/d","s/d"]
[]
["TOTAL PRIVADOS DOCENTE Y NO DOCENTE",{"$f":"+C22+F22+I22","v":7119},{"$f":"+D22+E22","v":5341},{"$f":"+D23+D24","v":2970},{"$f":"+E23+E24","v":2371},{"$f":"+G22+H22","v":1449},{"$f":"+G23+G24","v":974},{"$f":"+H23+H24","v":475},{"$f":"+J22+K22","v":329},{"$f":"+J23+J24","v":329}]
["Personal Docente de Universidades e Institutos Privados",{"$f":"+C23+F23+I23","v":6588},{"$f":"+D23+E23","v":5109},{"$f":"SUM(D39:D43,D47:D51,D55:D59,D63:D67,D71:D74,D78:D81,D85:D89,D100:D104,D108:D111,D115:D119,D123:D127,D163:D167)","v":2875},{"$f":"SUM(E39:E43,E47:E51,E55:E59,E63:E67,E71:E74,E78:E81,E85:E89,E100:E104,E108:E111,E115:E119,E123:E127,E163:E167)","v":2234},{"$f":"+G23+H23","v":1188},{"$f":"SUM(G39:G43,G47:G51,G55:G59,G63:G67,G71:G74,G78:G81,G85:G89,G100:G104,G108:G111,G115:G119,G123:G127,G163:G167)","v":888},{"$f":"SUM(H39:H43,H47:H51,H55:H59,H63:H67,H71:H74,H78:H81,H85:H89,H100:H104,H108:H111,H115:H119,H123:H127,H163:H167)","v":300},{"$f":"+J23+K23","v":291},{"$f":"SUM(J39:J43,J47:J51,J55:J59,J63:J67,J71:J74,J78:J81,J85:J89,J100:J104,J108:J111,J115:J119,J123:J127,J163:J167)","v":152},{"$f":"SUM(K39:K43,K47:K51,K55:K59,K63:K67,K71:K74,K78:K81,K85:K89,K100:K104,K108:K111,K115:K119,K123:K127,K163:K167)","v":139}]
["Personal NO Docente de Universidades e Institutos Privados",{"$f":"+C24+F24+I24","v":908},{"$f":"+D24+E24","v":232},{"$f":"D44+D52+D60+D68+D75+D83+D90+D105+D113+D120+D128+D168","v":95},{"$f":"E44+E52+E60+E68+E75+E83+E90+E105+E113+E120+E128+E168","v":137},{"$f":"+G24+H24","v":261},{"$f":"G44+G52+G60+G68+G75+G83+G90+G105+G113+G120+G128+G168","v":86},{"$f":"H44+H52+H60+H68+H75+H83+H90+H105+H113+H120+H128+H168","v":175},{"$f":"+J24+K24","v":415},{"$f":"J44+J52+J60+J68+J75+J83+J90+J105+J113+J120+J128+J168","v":177},{"$f":"K44+K52+K60+K68+K75+K83+K90+K105+K113+K120+K128+K168","v":238}]
[]
["TOTAL SEGURIDAD Y DEFENSA DOCENTE Y NO DOCENTE",{"$f":"+C26+F26+I26","v":293},{"$f":"+D26+E26","v":259},{"$f":"+D27+D28","v":202},{"$f":"+E27+E28","v":57},{"$f":"+G26+H26","v":0},{"$f":"+G27+G28","v":0},{"$f":"+H27+H28","v":0},{"$f":"+J26+K26","v":34},{"$f":"+J27+J28","v":20},{"$f":"+K27+K28","v":14}]
["Personal Docente Área Seguridad y Defensa",{"$f":"+C27+F27+I27","v":230},{"$f":"+D27+E27","v":230},{"$f":"SUM(D131:D135,D139:D143,D147:D151)","v":198},{"$f":"SUM(E131:E135,E139:E143,E147:E151)","v":32},{"$f":"+G27+H27","v":0},{"$f":"SUM(G131:G135,G139:G143,G147:G151)","v":0},{"$f":"SUM(H131:H135,H139:H143,H147:H151)","v":0},{"$f":"+J27+K27","v":0},{"$f":"SUM(J131:J135,J139:J143,J147:J151)","v":0},{"$f":"SUM(K131:K135,K139:K143,K147:K151)","v":0}]
["Personal NO Docente Área Seguridad y Defensa",{"$f":"+C28+F28+I28","v":63},{"$f":"+D28+E28","v":29},{"$f":"D136+D144+D152","v":4},{"$f":"E136+E144+E152","v":25},{"$f":"+G28+H28","v":0},{"$f":"G136+G144+G152","v":0},{"$f":"H136+H144+H152","v":0},{"$f":"+J28+K28","v":34},{"$f":"J136+J144+J152","v":20},{"$f":"K136+K144+K152","v":14}]
[]
["UNIVERSIDAD TECNOLÓGICA (UTEC)",{"$f":"C30+F30+I30","v":171},{"$f":"D30+E30","v":25},{"$f":"SUM(D31:D36)","v":12},{"$f":"SUM(E31:E36)","v":13},{"$f":"G30+H30","v":73},{"$f":"SUM(G31:G36)","v":36},{"$f":"SUM(H31:H36)","v":37},{"$f":"J30+K30","v":73},{"$f":"SUM(J31:J36)","v":35},{"$f":"SUM(K31:K36)","v":38}]
["Personal Docente",{"$f":"C31+F31+I31","v":105},{"$f":"D31+E31","v":24},11,13,{"$f":"G31+H31","v":59},31,28,{"$f":"J31+K31","v":22},14,8]
["Personal de Investigación y Extensión",0,0,0,0,0,0,0,0,0,0]
["Docente-Investigador",0,0,0,0,0,0,0,0,0,0]
["Personal de Gestión Universitaria",0,0,0,0,0,0,0,0,0,0]
["No desagregable por función",0,0,0,0,0,0,0,0,0,0]
["Personal no docente",66,1,1,0,14,5,9,51,21,30]
[null,0]
["UCUDAL",2437,{"$f":"+D38+E38","v":1878},{"$f":"SUM(D39:D44)","v":950},{"$f":"SUM(E39:E44)","v":928},{"$f":"+G38+H38","v":306},{"$f":"SUM(G39:G44)","v":139},{"$f":"SUM(H39:H44)","v":167},{"$f":"+J38+K38","v":253},{"$f":"SUM(J39:J44)","v":107},{"$f":"SUM(K39:K44)","v":146}]
["Personal Docente",1624,1624,853,771,0,0,0,0,0,0]
["Personal de Investigación y Extensión",0,0,0,0,0,0,0,0,0,0]
["Docente-Investigador",267,65,20,45,137,59,78,65,35,30]
["Personal de Gestión Universitaria",196,86,36,50,48,21,27,62,28,34]
["No desagregable por función",34,0,0,0,34,34,0,0,0,0]
["Personal no docente",316,103,41,62,87,25,62,126,44,82]
[]
["UNIVERSIDAD ORT URUGUAY ",{"$f":"C46+F46+I46","v":2284},{"$f":"+D46+E46","v":1845},{"$f":"SUM(D47:D52)","v":1125},{"$f":"SUM(E47:E52)","v":720},{"$f":"+G46+H46","v":217},{"$f":"SUM(G47:G52)","v":125},{"$f":"SUM(H47:H52)","v":92},{"$f":"+J46+K46","v":222},{"$f":"SUM(J47:J52)","v":111},{"$f":"SUM(K47:K52)","v":111}]
["Personal Docente",{"$f":"C47+F47+I47","v":1500},1488,908,580,11,6,5,1,0,1]
["Personal de Investigación y Extensión",48,36,24,12,10,9,1,2,0,2]
["Docente-Investigador",0,0,0,0,0,0,0,0,0,0]
["Personal de Gestión Universitaria",446,241,163,78,94,43,51,111,57,54]
["No desagregable por función",54,0,0,0,54,54,0,0,0,0]
["Personal no docente",236,80,30,50,48,13,35,108,54,54]
[]
["UNIVERSIDAD DE MONTEVIDEO",{"$f":"C54+F54+I54","v":922},{"$f":"+D54+E54","v":476},{"$f":"SUM(D55:D60)","v":294},{"$f":"SUM(E55:E60)","v":182},{"$f":"+G54+H54","v":314},{"$f":"SUM(G55:G60)","v":201},{"$f":"SUM(H55:H60)","v":113},{"$f":"+J54+K54","v":132},{"$f":"SUM(J55:J60)","v":62},{"$f":"SUM(K55:K60)","v":70}]
["Personal Docente",{"$f":"C55+F55+I55","v":0},0,0,0,0,0,0,0,0,0]
["Personal de Investigación y Extensión",0,0,0,0,0,0,0,0,0,0]
["Docente-Investigador",{"$f":"C57+F57+I57","v":733},461,284,177,252,182,70,20,16,4]
["Personal de Gestión Universitaria",0,0,0,0,0,0,0,0,0,0]
["No desagregable por función",0,0,0,0,0,0,0,0,0,0]
["Personal no docente",{"$f":"C60+F60+I60","v":189},15,10,5,62,19,43,112,46,66]
[]
["UNIVERSIDAD DE LA EMPRESA",{"$f":"C62+F62+I62","v":1461},{"$f":"+D62+E62","v":765},{"$f":"SUM(D63:D68)","v":444},{"$f":"SUM(E63:E68)","v":321},{"$f":"+G62+H62","v":603},{"$f":"SUM(G63:G68)","v":506},{"$f":"SUM(H63:H68)","v":97},{"$f":"+J62+K62","v":93},{"$f":"SUM(J63:J68)","v":48},{"$f":"SUM(K63:K68)","v":45}]
["Personal Docente",{"$f":"C63+F63+I63","v":850},713,419,294,126,78,48,11,7,4]
["Personal de Investigación y Extensión",17,6,5,1,10,5,5,1,1,0]
["Docente-Investigador",412,17,7,10,395,385,10,0,0,0]
["Personal de Gestión Universitaria",22,0,0,0,6,4,2,16,8,8]
["No desagregable por función",8,0,0,0,8,8,0,0,0,0]
["Personal no docente",152,29,13,16,58,26,32,65,32,33]
[]
["INST UNIV CLAEH ",{"$f":"C70+F70+I70","v":0},{"$f":"+D70+E70","v":0},{"$f":"SUM(D71:D75)","v":0},{"$f":"SUM(E71:E75)","v":0},{"$f":"+G70+H70","v":0},{"$f":"SUM(G71:G75)","v":0},{"$f":"SUM(H71:H75)","v":0},{"$f":"+J70+K70","v":0},{"$f":"SUM(J71:J75)","v":0},{"$f":"SUM(K71:K75)","v":0}]
["Personal Docente",0,0,"s/d","s/d",0,"s/d","s/d",0,"s/d","s/d"]
["Personal de Investigación y Extensión",0,0,"s/d","s/d",0,"s/d","s/d",0,"s/d","s/d"]
["Docente-Investigador",0,0,"s/d","s/d",0,"s/d","s/d",0,"s/d","s/d"]
["Personal de Gestión Universitaria",0,0,"s/d","s/d",0,"s/d","s/d",0,"s/d","s/d"]
["Personal no docente",0,0,"s/d","s/d",0,"s/d","s/d",0,"s/d","s/d"]
[]
["INST METODISTA UNIV CRANDON ",{"$f":"C77+F77+I77","v":45},{"$f":"+D77+E77","v":45},{"$f":"SUM(D78:D82)","v":16},{"$f":"SUM(E78:E82)","v":29},{"$f":"+G77+H77","v":0},{"$f":"SUM(G78:G82)","v":0},{"$f":"SUM(H78:H82)","v":0},{"$f":"+J77+K77","v":0},{"$f":"SUM(J78:J82)","v":0},{"$f":"SUM(K78:K82)","v":0}]
["Personal Docente",45,45,16,29,0,0,0,0,0,0]
["Personal de Investigación y Extensión",0,0,0,0,0,0,0,0,0,0]
["Docente-Investigador",0,0,0,0,0,0,0,0,0,0]
["Personal de Gestión Universitaria",0,0,0,0,0,0,0,0,0,0]
["No desagregable por función",0,0,0,0,0,0,0,0,0,0]
["Personal no docente",0,0,0,0,0,0,0,0,0,0]
["INST UNIV DE POSTGRADO EN PSICOANÁLISIS (APU)",82,82,{"$f":"SUM(D85:D90)","v":18},{"$f":"SUM(E85:E90)","v":64},0,{"$f":"SUM(G85:G90)","v":0},{"$f":"SUM(H85:H90)","v":0},0,{"$f":"SUM(J85:J90)","v":0},{"$f":"SUM(K85:K90)","v":0}]
["Personal Docente",38,38,8,30,0,0,0,0,0,0]
["Personal de Investigación y Extensión",44,44,10,34,0,0,0,0,0,0]
["Docente-Investigador",0,0,0,0,0,0,0,0,0,0]
["Personal de Gestión Universitaria",0,0,0,0,0,0,0,0,0,0]
["No desagregable por función",0,0,0,0,0,0,0,0,0,0]
["Personal no docente",0,0,0,0,0,0,0,0,0,0]
[]
["INST UNIV ASOCIACIÓN CRISTIANA DE JÓVENES ",{"$f":"C92+F92+I92","v":0},{"$f":"+D92+E92","v":0},{"$f":"SUM(D93:D97)","v":0},{"$f":"SUM(E93:E97)","v":0},{"$f":"+G92+H92","v":0},{"$f":"SUM(G93:G97)","v":0},{"$f":"SUM(H93:H97)","v":0},{"$f":"+J92+K92","v":0},{"$f":"SUM(J93:J97)","v":0},{"$f":"SUM(K93:K97)","v":0}]
["Personal Docente",0,0,"s/d","s/d",0,"s/d","s/d",0,"s/d","s/d"]
["Personal de Investigación y Extensión",0,0,"s/d","s/d",0,"s/d","s/d",0,"s/d","s/d"]
["Docente-Investigador",0,0,"s/d","s/d",0,"s/d","s/d",0,"s/d","s/d"]
["Personal de Gestión Universitaria",0,0,"s/d","s/d",0,"s/d","s/d",0,"s/d","s/d"]
["Personal no docente",0,0,"s/d","s/d",0,"s/d","s/d",0,"s/d","s/d"]
[]
["INST UNIV MONSEÑOR MARIANO SOLER ",{"$f":"C99+F99+I99","v":41},{"$f":"+D99+E99","v":41},{"$f":"SUM(D100:D105)","v":36},{"$f":"SUM(E100:E105)","v":5},{"$f":"+G99+H99","v":0},{"$f":"SUM(G100:G105)","v":0},{"$f":"SUM(H100:H105)","v":0},{"$f":"+J99+K99","v":0},{"$f":"SUM(J100:J105)","v":0},{"$f":"SUM(K100:K105)","v":0}]
["Personal Docente",{"$f":"C100+F100+I100","v":41},41,36,5,0,0,0,0,0,0]
["Personal de Investigación y Extensión",0,0,0,0,0,0,0,0,0,0]
["Docente-Investigador",0,0,0,0,0,0,0,0,0,0]
["Personal de Gestión Universitaria",0,0,0,0,0,0,0,0,0,0]
["No desagregable por función",0,0,0,0,0,0,0,0,0,0]
["Personal no docente",0,0,0,0,0,0,0,0,0,0]
[]
["INST UNIV FRANCISCO DE ASÍS",{"$f":"C107+F107+I107","v":103},{"$f":"+D107+E107","v":93},{"$f":"SUM(D108:D113)","v":46},{"$f":"SUM(E108:E113)","v":47},{"$f":"+G107+H107","v":6},{"$f":"SUM(G108:G113)","v":3},{"$f":"SUM(H108:H113)","v":3},{"$f":"+J107+K107","v":4},{"$f":"SUM(J108:J113)","v":1},{"$f":"SUM(K108:K113)","v":3}]
["Personal Docente",84,84,43,41,0,0,0,0,0,0]
["Personal de Investigación y Extensión",0,0,0,0,0,0,0,0,0,0]
["Docente-Investigador",0,0,0,0,0,0,0,0,0,0]
["Personal de Gestión Universitaria",5,5,2,3,0,0,0,0,0,0]
["No desagregable por función",0,0,0,0,0,0,0,{"$f":"+J112+K112","v":0},0,0]
["Personal no docente",14,4,1,3,6,3,3,{"$f":"+J113+K113","v":4},1,3]
["INST UNIV CEDIIAP",{"$f":"C114+F114+I114","v":68},67,{"$f":"SUM(D115:D120)","v":13},{"$f":"SUM(E115:E120)","v":54},1,{"$f":"SUM(G115:G120)","v":0},{"$f":"SUM(H115:H120)","v":1},{"$f":"+J114+K114","v":0},{"$f":"SUM(J115:J120)","v":0},{"$f":"SUM(K115:K120)","v":0}]
["Personal Docente",{"$f":"C115+F115+I115","v":68},67,13,54,1,0,1,0,0,0]
["Personal de Investigación y Extensión",{"$f":"C116+F116+I116","v":0},0,0,0,0,0,0,0,0,0]
["Docente-Investigador",0,0,0,0,0,0,0,0,0,0]
["Personal de Gestión Universitaria",0,0,0,0,0,0,0,0,0,0]
["No desagregable por función",0,0,0,0,0,0,0,0,0,0]
["Personal no docente",0,0,0,0,0,0,0,0,0,0]
[]
["Fundación Politécnico de Punta del Este",34,34,{"$f":"SUM(D123:D128)","v":23},{"$f":"SUM(E123:E128)","v":11},0,{"$f":"SUM(G123:G128)","v":0},{"$f":"SUM(H123:H128)","v":0},0,{"$f":"SUM(J123:J128)","v":0},{"$f":"SUM(K123:K128)","v":0}]
["Personal Docente",34,34,23,11,0,0,0,0,0,0]
["Personal de Investigación y Extensión",0,0,0,0,0,0,0,0,0,0]
["Docente-Investigador",0,0,0,0,0,0,0,0,0,0]
["Personal de Gestión Universitaria",0,0,0,0,0,0,0,0,0,0]
["No desagregable por función",0,0,0,0,0,0,0,0,0,0]
["Personal no docente",0,0,0,0,0,0,0,0,0,0]
[]
["Escuela Nacional de Policía",53,53,{"$f":"SUM(D131:D135)","v":40},{"$f":"SUM(E131:E135)","v":13},0,{"$f":"SUM(G131:G135)","v":0},{"$f":"SUM(H131:H135)","v":0},0,{"$f":"SUM(J131:J135)","v":0},{"$f":"SUM(K131:K135)","v":0}]
["Personal Docente",53,53,40,13,0,0,0,0,0,0]
["Personal de Investigación y Extensión",0,0,0,0,0,0,0,0,0,0]
["Docente-Investigador",0,0,0,0,0,0,0,0,0,0]
["Personal de Gestión Universitaria",0,0,0,0,0,0,0,0,0,0]
["No desagregable por función",0,0,0,0,0,0,0,0,0,0]
["Personal no docente",0,0,0,0,0,0,0,0,0,0]
[]
["Centro de Altos Estudios Nacionales",{"$f":"C138+F138+I138","v":98},{"$f":"+D138+E138","v":98},{"$f":"SUM(D139:D144)","v":61},{"$f":"SUM(E139:E144)","v":37},{"$f":"+G138+H138","v":0},{"$f":"SUM(G139:G144)","v":0},{"$f":"SUM(H139:H144)","v":0},{"$f":"+J138+K138","v":0},{"$f":"SUM(J139:J144)","v":0},{"$f":"SUM(K139:K144)","v":0}]
["Personal Docente",{"$f":"C139+F139+I139","v":69},69,57,12,0,0,0,0,0,0]
["Personal de Investigación y Extensión",0,0,0,0,0,0,0,0,0,0]
["Docente-Investigador",0,0,0,0,0,0,0,0,0,0]
["Personal de Gestión Universitaria",0,0,0,0,0,0,0,0,0,0]
["No desagregable por función",0,0,0,0,0,0,0,0,0,0]
["Personal no docente",29,29,4,25,0,0,0,0,0,0]
[]
["Escuela de Guerra Naval (ESGUE)",{"$f":"C146+F146+I146","v":142},{"$f":"D146+E146","v":108},{"$f":"SUM(D147:D152)","v":101},{"$f":"SUM(E147:E152)","v":7},{"$f":"G146+H146","v":0},{"$f":"SUM(G147:G152)","v":0},{"$f":"SUM(H147:H152)","v":0},{"$f":"J146+K146","v":34},{"$f":"SUM(J147:J152)","v":20},{"$f":"SUM(K147:K152)","v":14}]
["Personal Docente",{"$f":"C147+F147+I147","v":108},{"$f":"D147+E147","v":108},101,7,0,0,0,0,0,0]
["Personal de Investigación y Extensión",0,{"$f":"D148+E148","v":0},0,0,0,0,0,0,0,0]
["Docente-Investigador",0,0,0,0,0,0,0,0,0,0]
["Personal de Gestión Universitaria",0,0,0,0,0,0,0,0,0,0]
["No desagregable por función",0,0,0,0,0,0,0,0,0,0]
["Personal no docente",34,0,0,0,0,0,0,34,20,14]
[]
["IPES",23,1,{"$f":"SUM(D155:D160)","v":1},{"$f":"SUM(E155:E160)","v":0},6,{"$f":"SUM(G155:G160)","v":6},{"$f":"SUM(H155:H160)","v":0},16,{"$f":"SUM(J155:J160)","v":5},{"$f":"SUM(K155:K160)","v":11}]
["Personal Docente",6,1,1,0,2,2,0,3,3,0]
["Personal de Investigación y Extensión",0,0,0,0,0,0,0,0,0,0]
["Docente-Investigador",0,0,0,0,0,0,0,0,0,0]
["Personal de Gestión Universitaria",0,0,0,0,0,0,0,0,0,0]
["No desagregable por función",0,0,0,0,0,0,0,0,0,0]
["Personal no docente",17,0,0,0,4,4,0,13,2,11]
[]
["IUCEDDU",{"$f":"C162+F162+I162","v":19},15,{"$f":"SUM(D163:D168)","v":5},{"$f":"SUM(E163:E168)","v":10},2,{"$f":"SUM(G163:G168)","v":0},{"$f":"SUM(H163:H168)","v":2},2,{"$f":"SUM(J163:J168)","v":0},{"$f":"SUM(K163:K168)","v":2}]
["Personal Docente",{"$f":"C163+F163+I163","v":17},13,5,8,2,0,2,2,0,2]
["Personal de Investigación y Extensión",0,0,0,0,0,0,0,0,0,0]
["Docente-Investigador",0,0,0,0,0,0,0,0,0,0]
["Personal de Gestión Universitaria",1,1,0,1,0,0,0,0,0,0]
["No desagregable por función",0,0,0,0,0,0,0,0,0,0]
["Personal no docente",1,1,0,1,0,0,0,0,0,0]
[]
["Fuente: Oficinas Productoras de cada una de las Instituciones. "]
["Nota:* Padrón Setiembre 2016 - SECIU. No se dispone de la información discriminada por sexo. "]

{"sheet":"II-7.2.11 ","index":94,"n_rows":84,"n_cols":7,"rows_kept":84,"cut":false,"hidden":false,"merged":[[82,0,82,6],[83,0,83,7],[0,2,1,4],[4,0,4,6],[5,0,6,0],[5,1,6,1],[5,2,5,5],[81,0,81,6]]}
["UNIVERSIDADES  E INSTITUTOS UNIVERSITARIOS",null,"ALUMNOS MATRICULADOS"]
[]
["Cuadro Nº II-7.2. 11"]
[]
["ALUMNOS INGRESADOS Y MATRICULADOS DE GRADO EN UNIVERSIDADES E INSTITUTOS UNIVERSITARIOS, SEGÚN INSTITUCIÓN Y LUGAR DE ORIGEN. AÑO 2016."]
["INSTITUCIÓN / FORMACIÓN","TOTAL","ORIGEN DE LOS ESTUDIANTES"]
[null,null,"Total Uruguay","Montevideo","Interior","Extranjero","Sin dato"]
[]
["UDELAR (*)"]
["Ingresados",{"$f":"SUM(D10:G10)","v":28030},{"$f":"SUM(D10:E10)","v":27470},12361,15109,448,112]
["Ingresados Posgrado",{"$f":"SUM(D11:G11)","v":2515},{"$f":"SUM(D11:E11)","v":0},"s/d","s/d","s/d",2515]
[]
["UNIVERSIDAD TECNOLÓGICA (UTEC)"]
["Ingresados",{"$f":"SUM(D14:G14)","v":245},{"$f":"SUM(D14:E14)","v":245},13,232,0,0]
["Ingresados Posgrado","na.","na.","na.","na.","na.","na."]
[]
["UCUDAL"]
["Ingresados",{"$f":"SUM(D18:G18)","v":1248},{"$f":"SUM(D18:E18)","v":1218},758,460,0,30]
["Ingresados Posgrado",{"$f":"SUM(D19:G19)","v":544},{"$f":"SUM(D19:E19)","v":540},404,136,4,0]
[]
["UNIVERSIDAD ORT URUGUAY"]
["Ingresados",{"$f":"SUM(D22:G22)","v":1034},{"$f":"SUM(D22:E22)","v":1020},781,239,14,0]
["Ingresados Posgrado",{"$f":"SUM(D23:G23)","v":223},{"$f":"SUM(D23:E23)","v":0},"s/d","s/d","s/d",223]
[]
["UNIVERSIDAD DE MONTEVIDEO"]
["Ingresados",{"$f":"SUM(D26:G26)","v":421},{"$f":"SUM(D26:E26)","v":421},308,113,0,0]
["Ingresados Posgrado",{"$f":"SUM(D27:G27)","v":342},{"$f":"SUM(D27:E27)","v":0},"s/d","s/d","s/d",342]
[]
["UNIVERSIDAD DE LA EMPRESA"]
["Ingresados",{"$f":"SUM(D30:G30)","v":526},{"$f":"SUM(D30:E30)","v":526},346,180,0,0]
["Ingresados Posgrado",{"$f":"SUM(D31:G31)","v":324},{"$f":"SUM(D31:E31)","v":30},21,9,286,8]
[]
["INST UNIV ASOCIACIÓN CRISTIANA DE JÓVENES"]
["Ingresados",{"$f":"SUM(D34:G34)","v":236},{"$f":"SUM(D34:E34)","v":154},135,19,2,80]
["Ingresados Posgrado",{"$f":"SUM(D35:G35)","v":40},{"$f":"SUM(D35:E35)","v":38},38,0,2,0]
[]
["INST UNIV CLAEH "]
["Ingresados",{"$f":"SUM(D38:G38)","v":79},{"$f":"SUM(D38:E38)","v":67},17,50,12,0]
["Ingresados Posgrado",{"$f":"SUM(D39:G39)","v":88},{"$f":"SUM(D39:E39)","v":0},"s/d","s/d","s/d",88]
[]
["INST METODISTA UNIV CRANDON "]
["Ingresados",{"$f":"SUM(D42:G42)","v":1},{"$f":"SUM(D42:E42)","v":1},1,0,0,0]
["Ingresados Posgrado",{"$f":"SUM(D43:G43)","v":3},{"$f":"SUM(D43:E43)","v":3},3,0,0,0]
[]
["INST UNIV MONSEÑOR MARIANO SOLER"]
["Ingresados",{"$f":"SUM(D46:G46)","v":19},{"$f":"SUM(D46:E46,G46)","v":19},"s/d","s/d","s/d",19]
["Ingresados Posgrado","na.","na.","na.","na.","na.","na."]
[]
["INST UNIV FRANCISCO DE ASÍS"]
["Ingresados",{"$f":"SUM(D50:G50)","v":33},{"$f":"SUM(D50:E50)","v":30},5,25,3,0]
["Ingresados Posgrado","na.","na.","na.","na.","na.","na."]
[]
["INST UNIV CEDIIAP"]
["Ingresados",{"$f":"SUM(D54:G54)","v":37},{"$f":"SUM(D54:E54)","v":37},31,6,0,0]
["Ingresados Posgrado","na.","na.","na.","na.","na.","na."]
[]
["FUNDACIÓN POLITÉCNICO DE PUNTA DEL ESTE"]
["Ingresados",{"$f":"SUM(D58:G58)","v":0},{"$f":"SUM(D58:E58)","v":0},0,0,0,0]
["Ingresados Posgrado","na.","na.","na.","na.","na.","na."]
[]
["ESCUELA NACIONAL DE POLICÍA "]
["Ingresados",{"$f":"SUM(D62:G62)","v":112},{"$f":"D62+E62","v":109},29,80,3,0]
["Ingresados Posgrado","na.","na.","na.","na.","na.","na."]
[]
["ESCUELA NAVAL"]
["Ingresados",{"$f":"SUM(D66:G66)","v":54},{"$f":"D66+E66","v":54},31,23,0,0]
["Ingresados Posgrado",{"$f":"SUM(D67:G67)","v":240},{"$f":"D67+E67","v":240},183,57,0,0]
[]
["ESCUELA MILITAR"]
["Ingresados",{"$f":"SUM(D70:G70)","v":105},{"$f":"D70+E70","v":105},40,65,0,0]
["Ingresados Posgrado","na.","na.","na.","na.","na.","na."]
[]
["IPES",{"$f":"SUM(D73:G73)","v":0},{"$f":"D73+E73","v":0}]
["Ingresados","na.","na.","na.","na.","na.","na."]
["Ingresados Posgrado",25,25,25,0,0,0]
[]
["IUCEDDU",0,0]
["Ingresados","na.","na.","na.","na.","na.","na."]
["Ingresados Posgrado",6,6,5,1,0,0]
[]
["Fuente: Oficinas Productoras de cada una de las Instituciones. "]
["Nota:  La categoría \"Sin dato\" refiere a los  alumnos de los cuales no se cuenta con información de origen. "]
["* Censo de Estudiantes 2012 - UdelaR. El dato corresponde a la cantidad de personas."]
["\"na.\", No aplica se refiere, en este caso, a instituciones que no imparten cursos de grado o posgrado."]

{"sheet":"EDUCACIÓN DE JÓVENES Y ADUL ","index":95,"n_rows":87,"n_cols":2,"rows_kept":87,"cut":false,"hidden":false,"merged":[]}
[]
[]
[]
[]
[]
[]
[]
[]
["Cuadro II-8.1.1","ALUMNOS MATRICULADOS EN EDUCACIÓN PRIMARIA POR SEXO SEGÚN GRANDES ÁREAS Y DEPARTAMENTO. AÑO 2014. "]
[""]
["Cuadro II-8.1.2","ALUMNOS MATRICULADOS EN TALLERES SEGÚN SEXO, GRANDES ÁREAS Y DEPARTAMENTOS. AÑO 2014."]
[""]
["Cuadro II-8.1.3","CANTIDAD DE PRUEBAS DE ACREDITACIÓN SEGÚN SEXO, GRANDES ÁREAS Y DEPARTAMENTOS. AÑO 2014."]
[""]
["Cuadro II-8.1.4","ALUMNOS MATRICULADOS EN CURSOS DE EDUCACIÓN TÉCNICA PARA JÓVENES Y ADULTOS POR GRANDES ÁREAS Y SEXO SEGÚN TIPO DE CURSO. AÑO 2016. "]
[""]
["Cuadro II-8.1.5","ALUMNOS MATRICULADOS EN CURSOS DE EDUCACIÓN TÉCNICA PARA JÓVENES Y ADULTOS POR EDAD SEGÚN TIPO DE CURSO. AÑO 2016."]
[""]
["Cuadro II-8.1.6","ALUMNOS MATRICULADOS EN EDUCACIÓN  TÉCNICA EN NIVEL DE FORMACION PROFESIONAL. AÑO 2016."]
[""]
["Cuadro II-8.1.7","ALUMNOS MATRICULADOS EN EDUCACIÓN TÉCNICA POR TIPO DE CURSO SEGÚN ÁREAS Y SECTORES DE ESTUDIO. AÑO 2016."]
[""]
["Cuadro II-8.1.8","ALUMNOS INGRESADOS, MATRICULADOS Y EGRESADOS EN CECAP POR SEXO, SEGÚN DEPARTAMENTO Y EDAD. AÑO 2016."]
[""]
["Cuadro II-8.1.9","ALUMNOS CON EGRESO ANTICIPADO Y DESVINCULADOS DE CECAP POR SEXO, SEGÚN DEPARTAMENTO Y EDAD. AÑO 2016."]
[""]
["Cuadro II-8.1.10","ALUMNOS INGRESADOS, MATRICULADOS Y EGRESADOS EN OFERTAS EDUCATIVAS NO TERCIARIAS DE UNIVERSIDADES PRIVADAS POR SEXO. AÑO 2016."]
[""]
[""]
[]
["Cuadro II-8.2.1","PERSONAL DOCENTE  DE CECAP, TITULADO Y NO TITULADO, POR SEXO, REGIÓN Y DEPARTAMENTO SEGÚN CARGA HORARIA SEMANAL. AÑO 2016. "]
[""]
["Cuadro II-8.2.2","DOCENTES POR SEXO SEGÚN GRANDES ÁREAS Y DEPARTAMENTO. AÑO 2013."]
[""]
[""]
["Cuadro II-8.3.1","CANTIDAD DE CURSOS, DE HORAS Y DE ALUMNOS MATRICULADOS SEGÚN TIPO DE CURSO Y ÁREA DE FORMACIÓN COCAP. AÑO 2016."]
[""]
[""]
[]
["Cuadro II-8.4.1 ","MATRÍCULA Y PERSONAL DOCENTE POR SEXO SEGÚN TIPO DE INSTITUCIÓN, ÁREAS DE CONOCIMIENTO E INSTITUCIONES. AÑO 2016."]
[""]
["Cuadro II-8.4.2","INGRESADOS, MATRÍCULA  Y EGRESADOS DEL RELEVAMIENTO DE INSTITUCIONES DE FORMACIÓN TÉCNICO-PROFESIONAL SEGÚN REGIÓN Y ÁREAS DE CONOCIMIENTO. AÑO 2016."]
["Cuadro II-8.4.3"," DOCENTES POR TIPO DE FORMACIÓN, FORMA DE ADMINISTRACIÓN Y POR ÁREA DE CONOCIMIENTO. AÑO 2016."]
[""]
[" "]
[]
[]
[]
[]
[]
[]
[]
[]
[]
[]
[]
[{"$f":"MID(B22,1,20)","v":""}]
[]
[]
[]
[]
[]
[{"$f":"MID(B28,1,20)","v":""}]
[{"$f":"MID(B29,1,20)","v":""}]
[]
[{"$f":"MID(B32,1,20)","v":""}]
[]
[]
[{"$f":"MID(B35,1,20)","v":""}]
[]
[{"$f":"MID(B37,1,20)","v":""}]
[{"$f":"MID(B38,1,20)","v":""}]
[]
[{"$f":"MID(B41,1,20)","v":""}]
[]
[" DOCENTES POR TIPO D"]
[""]
[""]
[""]
[""]
[""]
[""]
[""]
[""]
[""]
[""]
[""]

{"sheet":" II-8.1.1","index":96,"n_rows":35,"n_cols":10,"rows_kept":35,"cut":false,"hidden":false,"merged":[[7,7,8,7],[7,8,7,9],[0,2,0,4],[2,0,2,1],[3,2,4,3],[6,0,6,6],[7,0,8,0],[7,1,8,1],[7,2,7,3],[7,4,8,4],[7,5,7,6]]}
["ANEP",null,"ALUMNOS MATRICULADOS"]
["CODICEN – PROGRAMA NACIONAL DE JÓVENES Y ADULTOS"]
[]
[]
["Cuadro Nº  II-8.1.1"]
[]
["ALUMNOS MATRICULADOS EN EDUCACIÓN PRIMARIA POR SEXO SEGÚN GRANDES ÁREAS Y DEPARTAMENTO. AÑO 2016*."]
["GRANDES ÁREAS Y DEPARTAMENTOS","TOTAL","PRIMER  TRAMO: NIVEL I",null,"TOTAL","SEGUNDO TRAMO: NIVEL II",null,"TOTAL","CICLO PRIMARIO TOTAL"]
[null,null,"M","F",null,"M","F",null,"M","F"]
["TOTAL",{"$f":"+B11+B12","v":1097},{"$f":"+C11+C12","v":543},554,2039,1075,964,3136,1618,1518]
["MONTEVIDEO",{"$f":"C11+D11","v":538},276,262,{"$f":"F11+G11","v":1019},564,455,{"$f":"I11+J11","v":1557},840,717]
["RESTO DEL PAÍS",{"$f":"SUM(B13:B30)","v":559},{"$f":"SUM(C13:C30)","v":267},292,1020,511,509,1579,778,801]
["Artigas",{"$f":"C13+D13","v":14},6,8,{"$f":"F13+G13","v":36},10,26,{"$f":"I13+J13","v":50},16,34]
["Canelones",136,78,58,228,99,129,364,177,187]
["Cerro Largo",12,7,5,57,24,33,69,31,38]
["Colonia",47,16,31,25,12,13,72,28,44]
["Durazno",10,7,3,29,9,20,39,16,23]
["Flores","-","-","-","-","-","-","-","-","-"]
["Florida",18,7,11,19,10,9,37,17,20]
["Lavalleja",2,1,1,35,24,11,37,25,12]
["Maldonado",60,26,34,60,53,7,120,79,41]
["Paysandú",41,19,22,133,48,85,174,67,107]
["Río Negro",17,8,9,50,19,31,67,27,40]
["Rivera",32,10,22,75,23,52,107,33,74]
["Rocha",14,3,11,8,1,7,22,4,18]
["Salto",33,9,24,15,5,10,48,14,34]
["San José",38,26,12,149,118,31,187,144,43]
["Soriano",38,28,10,47,22,25,85,50,35]
["Tacuarembó",47,16,31,33,18,15,80,34,46]
["Treinta y Tres",{"$f":"C30+D30","v":0},0,0,21,16,5,21,16,5]
[]
["Fuente: ANEP - CODICEN - Dirección Sectorial de Educación de Adultos."]
["Nota: *Los datos corresponden a 2013 pues son los últimos disponibles"]
["Observaciones: "]
["El departamento de Flores no cuenta con cargo de Maestro para el período 2013"]

{"sheet":" II-8.1.2","index":97,"n_rows":35,"n_cols":4,"rows_kept":35,"cut":false,"hidden":false,"merged":[[0,1,0,3],[1,0,1,1],[2,2,3,3],[5,0,6,0],[5,1,6,1],[5,2,5,3],[4,0,4,3]]}
["ANEP","ALUMNOS MATRICULADOS"]
["CODICEN – DIRECCIÓN SECTORIAL DE JÓVENES Y ADULTOS"]
[]
["Cuadro Nº  II-8.1.2"]
["ALUMNOS MATRICULADOS EN TALLERES POR SEXO SEGÚN GRANDES ÁREAS Y DEPARTAMENTO. AÑO 2016 *."]
["GRANDES ÁREAS Y DEPARTAMENTOS","TOTAL","TALLERES"]
[null,null,"M","F"]
["TOTAL",{"$f":"+B9+B10","v":4065},{"$f":"C9+C10","v":1587},{"$f":"D9+D10","v":2478}]
["MONTEVIDEO",{"$f":"C9+D9","v":3248},1119,2129]
["RESTO DEL PAÍS",817,468,349]
["Artigas",0,"-","-"]
["Canelones",{"$f":"C12+D12","v":243},184,59]
["Cerro Largo",12,7,5]
["Colonia",33,9,24]
["Durazno",{"$f":"C15+D15","v":0},"-","-"]
["Flores",14,7,7]
["Florida",0,"-","-"]
["Lavalleja",67,22,45]
["Maldonado",18,18,0]
["Paysandú",13,9,4]
["Río Negro",12,11,1]
["Rivera",118,40,78]
["Rocha",0,"-","-"]
["Salto",{"$f":"C24+D24","v":148},84,64]
["San José",0,"-","-"]
["Soriano",37,22,15]
["Tacuarembó",102,55,47]
["Treinta y Tres",0,"-","-"]
["Fuente: ANEP - CODICEN - Dirección Sectorial de Educación de Adultos."]
["Nota:* Los datos corresponden a 2013 pues son los últimos disponibles"]
["Observaciones: "]
["Los departamentos de Artigas, Durazno, Florida Rocha, San José y Treinta y Tres no cuentan con docentes de Talleres en el período 2013"]
[]
[]
[" "]

{"sheet":"II-8.1.3","index":98,"n_rows":30,"n_cols":4,"rows_kept":30,"cut":false,"hidden":false,"merged":[[0,3,0,4],[29,0,29,6],[31,0,31,6],[2,0,2,4],[3,0,3,3],[4,0,6,0],[4,1,6,1],[4,2,4,3],[5,2,5,3],[1,0,1,2]]}
["ANEP",null,null,"PRUEBAS DE ACREDITACIÓN"]
["CODICEN – DIRECCIÓN SECTORIAL DE EDUCACIÓN DE ADULTOS"]
["Cuadro Nº II-8.1.3"]
["CANTIDAD DE PRUEBAS DE ACREDITACIÓN SEGÚN SEXO, GRANDES ÁREAS Y DEPARTAMENTOS. AÑO 2016*."]
["GRANDES ÁREAS Y DEPARTAMENTOS","TOTAL","Prueba de Acreditación"]
[null,null,"SEXO"]
[null,null,"M","F"]
["TOTAL",{"$f":"+B9+B10","v":1151},{"$f":"C9+C10","v":591},{"$f":"D9+D10","v":560}]
["MONTEVIDEO",{"$f":"C9+D9","v":263},134,129]
["RESTO DEL PAÍS",{"$f":"C10+D10","v":888},457,431]
["Artigas",{"$f":"C11+D11","v":34},4,30]
["Canelones",200,101,99]
["Cerro Largo",45,14,31]
["Colonia",21,9,12]
["Durazno",23,13,10]
["Flores",12,4,8]
["Florida",5,0,5]
["Lavalleja",9,2,7]
["Maldonado",61,39,22]
["Paysandú",82,31,51]
["Río Negro",17,7,10]
["Rivera",62,35,27]
["Rocha",26,7,19]
["Salto",18,5,13]
["San José",177,154,23]
["Soriano",34,12,22]
["Tacuarembó",44,12,32]
["Treinta y Tres",18,8,10]
["Fuente: ANEP - CODICEN - Dirección Sectorial de Educación de Adultos"]
["Nota: *Los datos corresponden a 2013 pues son los últimos disponibles"]

{"sheet":"II-8.1.4","index":99,"n_rows":26,"n_cols":11,"rows_kept":26,"cut":false,"hidden":false,"merged":[[10,6,10,7],[10,9,10,10],[0,10,1,11],[7,0,11,0],[7,2,9,4],[7,5,8,10],[9,6,9,7],[9,9,9,10],[10,2,11,2],[10,3,10,4],[4,0,5,9]]}
["CONSEJO DE EDUCACIÓN TÉCNICO PROFESIONAL (U.T.U.)",null,null,null,null,null,null,null,null,null,"ALUMNOS MATRICULADOS"]
[]
["Cuadro Nº II-8.1.4"]
[]
["ALUMNOS MATRICULADOS EN CURSOS DE EDUCACIÓN TÉCNICA PARA JÓVENES Y ADULTOS POR GRANDES ÁREAS Y SEXO SEGÚN TIPO DE CURSO. AÑO 2016."]
[]
[]
["TIPO DE CURSO",null,"TOTAL",null,null,"GRANDES ÁREAS"]
[]
[null,"TOTAL ",null,null,null,null,"MONTEVIDEO ",null,null,"RESTO DEL PAÍS"]
[null,null,"Total","SEXO",null,null,"SEXO",null,null,"SEXO"]
[null,"Total ",null,"Masculino","Femenino","Total ","Masculino ","Femenino ","Total","Masculino ","Femenino"]
["TOTAL",null,{"$f":"SUM(C16:C25)","v":5248},2511,2737,3171,1529,1642,2077,982,1095]
[]
["Nivel Formación profesional "]
["CAP. PROFUNDIZACIÓN PROFESIONAL",null,{"$f":"+D16+E16","v":366},{"$f":"G16+J16","v":199},{"$f":"H16+K16","v":167},{"$f":"+G16+H16","v":103},66,37,{"$f":"+J16+K16","v":263},133,130]
["CAPACITACIÓN PROFESIONAL",null,{"$f":"+D17+E17","v":52},{"$f":"G17+J17","v":35},{"$f":"H17+K17","v":17},{"$f":"+G17+H17","v":47},34,13,{"$f":"+J17+K17","v":5},1,4]
["CAPACITACIÓN PROFESIONAL INICIAL",null,2831,1358,1473,1294,643,651,1537,715,822]
["CAPACITACIÓN TECNICA",null,37,32,5,37,32,5,0,0,0]
["CURSO BÁSICO",null,428,169,259,359,122,237,69,47,22]
["CURSO BÁSICO ESPECIALIZACIÓN",null,286,110,176,215,79,136,71,31,40]
["FORM. PROFES. EN ARTES Y ARTESANÍAS",null,553,188,365,552,187,365,1,1]
["FORMACIÓN PROFESIONAL BÁSICA",null,553,316,237,440,275,165,113,41,72]
["FORMACIÓN PROFESIONAL ESPECIALIZADA",null,119,88,31,119,88,31,0,0,0]
["PROYECTOS DE EXTENSIÓN",null,23,16,7,5,3,2,18,13,5]
["Fuente: CETP-UTU"]

{"sheet":"II-8.1.5.","index":100,"n_rows":19,"n_cols":14,"rows_kept":19,"cut":false,"hidden":false,"merged":[[0,12,1,13],[4,0,4,13],[5,0,6,0],[5,1,6,1],[5,2,5,12]]}
["CONSEJO DE EDUCACIÓN TÉCNICO PROFESIONAL (U.T.U.)",null,null,null,null,null,null,null,null,null,null,null,"ALUMNOS MATRICULADOS"]
[]
["Cuadro Nº II-8.1.5"]
[]
["ALUMNOS MATRICULADOS EN CURSOS DE EDUCACIÓN TÉCNICA PARA JÓVENES Y ADULTOS POR EDAD SEGÚN TIPO DE CURSO. AÑO 2016."]
["TIPO DE CURSO","TOTAL","EDAD"]
[null,null,"11 y 12 años","13 años","14 años","15 años","16 años","17 años","18años","19años","20 a 24 años","25 a 29 años","30 años y más","Edad desco"]
["TOTAL",{"$f":"SUM(B9:B18)","v":5249},0,0,28,268,440,530,386,297,902,552,1844,2]
["CAP. PROFUNDIZACIÓN PROFESIONAL",{"$f":"SUM(C9:N9)","v":366},{"$f":"SUM(C10:C19)","v":0},0,0,3,21,20,35,26,73,53,135,0]
["CAPACITACIÓN PROFESIONAL",{"$f":"SUM(C10:N10)","v":52},0,0,0,1,1,1,0,2,8,8,31,0]
["CAPACITACION PROFESIONAL INICIAL",2831,0,0,24,186,259,294,206,171,446,268,976,1]
["CAPACITACIÓN TÉCNICA",37,0,0,0,0,1,3,3,3,10,6,11,0]
["CURSO BÁSICO",428,0,0,1,27,65,68,30,21,74,56,86,0]
["CURSO BÁSICO ESPECIALIZACIÓN",286,0,0,1,7,23,43,44,25,41,19,83,0]
["FORM. PROFES. EN ARTES Y ARTESANÍAS",554,0,0,0,7,15,13,11,13,103,75,316,1]
["FORMACIÓN PROFESIONAL BÁSICA",553,0,0,2,30,42,63,36,28,122,53,177,0]
["FORMACIÓN PROFESIONAL ESPECIALIZADA",119,0,0,0,0,8,23,19,8,22,11,28,0]
["PROYECTOS DE EXTENSIÓN",23,0,0,0,7,5,2,2,0,3,3,1,0]
["Fuente: DE - CETP (UTU)"]

{"sheet":"II-8.1.6","index":101,"n_rows":29,"n_cols":5,"rows_kept":29,"cut":false,"hidden":false,"merged":[[4,0,5,0],[4,1,5,1],[3,0,3,2],[0,4,0,6]]}
["CONSEJO DE EDUCACIÓN TÉCNICO PROFESIONAL (U.T.U.)",null,null,null,"ALUMNOS MATRICULADOS"]
[]
["Cuadro Nº II-8.1.6"]
["ALUMNOS MATRICULADOS EN EDUCACIÓN TÉCNICA EN NIVEL DE FORMACIÓN PROFESIONAL. AÑO 2016."]
["DEPARTAMENTO ","Total "]
[]
["TOTAL ",{"$f":"SUM(B8:B9)","v":5249}]
["MONTEVIDEO ",3171]
["RESTO DEL PAÍS",{"$f":"SUM(B10:B27)","v":2078}]
["Artigas",340]
["Canelones",392]
["Cerro Largo",12]
["Colonia",120]
["Durazno",25]
["Flores",54]
["Florida",77]
["Lavalleja",0]
["Maldonado",148]
["Paysandú",255]
["Río Negro",0]
["Rivera",0]
["Rocha",19]
["Salto",332]
["San José",155]
["Soriano",27]
["Tacuarembó",91]
["Treinta y Tres",31]
[]
["Fuente: DE - CETP (UTU)"]

{"sheet":"II-8.1.7","index":102,"n_rows":45,"n_cols":3,"rows_kept":45,"cut":false,"hidden":false,"merged":[[0,0,1,1],[0,2,0,3],[4,0,4,3],[6,0,7,0],[6,1,7,1]]}
["CONSEJO DE EDUCACIÓN TÉCNICO PROFESIONAL (UTU)",null,"ALUMNOS MATRICULADOS"]
[]
["Cuadro Nº II-8.1.7"]
[]
["ALUMNOS MATRICULADOS EN EDUCACIÓN TÉCNICA POR TIPO DE CURSO SEGÚN ÁREAS Y SECTORES DE ESTUDIO. AÑO 2016."]
[]
["ÁREAS Y SECTOR DE ESTUDIO","Total"]
[]
["TOTAL",{"$f":"B10+B14+B28+B30+B32+B35+B38+B41","v":5249}]
["AGRICULTURA Y PESCA",{"$f":"B12+B11+B13","v":202}]
["Agropecuario",91]
["Hortifruticultura y jardinería",80]
["Náutica y Pesca",31]
["INDUSTRIA",{"$f":"B15+B16+B17+B18+B19+B20+B21+B22+B23+B24+B25+B26+B27","v":2023}]
["Caucho, Plástico y Fibra de Vidrio",76]
["Cerámica",108]
["Cuero y Calzado",63]
["Electricidad y Electrónica",137]
["Gráficos",31]
["Madera y Muebles",261]
["Mant. Rep. y Serv. a la Producción",71]
["Mantenimiento y Rep. de Vehículos",85]
["Metal - Mecánica",466]
["Producción de Alimentos",319]
["Química, Termodinámica y Agroener.",114]
["Comunicación óptica",26]
["Textil y Confección de Vestimenta",266]
["PERIODISMO Y COMUNICACIÓN",{"$f":"B29","v":23}]
["Comunicación",23]
["CONSTRUCCIÓN",{"$f":"B31","v":309}]
["Construcción y Arquitectura",309]
["COMERCIO,ADMINIST,INFORM Y COMUNICACIÓN",{"$f":"B33+B34","v":635}]
["Comercio y administración",163]
["Informática",472]
["SERVICIOS",{"$f":"B36+B37","v":1096}]
["Gastronomía",778]
["Servicios personales",318]
["ARTES Y HUMANIDADES",{"$f":"B39+B40","v":938}]
["Artes y artesanías",917]
["Idiomas",21]
["SECTOR NO ESPECIFICADO ",{"$f":"B42","v":23}]
["Actividades Científicas y Técnicas ",23]
["Fuente: DE - UTU"]
["Nota: El presente cuadro no incluye las Áreas y Sectores de Estudios contenidos en Educación "]
["      Media Básica y Superior, en tanto solo aplican para dichos niveles "]

{"sheet":"II-8.1.8  ","index":103,"n_rows":90,"n_cols":10,"rows_kept":90,"cut":false,"hidden":false,"merged":[[84,0,84,9],[89,0,89,13],[0,5,1,7],[6,0,6,9],[7,0,9,0],[7,1,9,1],[7,2,7,3],[7,4,9,4],[7,5,7,6],[7,7,9,7],[7,8,7,9],[8,2,8,3],[8,5,8,6],[8,8,8,9]]}
["MEC - DIRECCIÓN DE EDUCACIÓN",null,null,null,null,"ALUMNOS MATRICULADOS"]
["ÁREA DE EDUCACIÓN NO FORMAL"]
[]
[]
["Cuadro Nº II-8.1.8"]
[]
["ALUMNOS INGRESADOS, MATRICULADOS Y EGRESADOS EN CECAP POR SEXO, SEGÚN DEPARTAMENTO Y EDAD. AÑO 2016."]
["DEPARTAMENTO Y EDAD","TOTAL ","INGRESADOS",null,"TOTAL ","MATRICULADOS",null,"TOTAL ","EGRESADOS"]
[null,null,"SEXO",null,null,"SEXO",null,null,"SEXO"]
[null,null,"M","F",null,"M","F",null,"M","F"]
["TOTAL",{"$f":"SUM(C11:D11)","v":1491},{"$f":"+C13+C21","v":830},{"$f":"+D13+D21","v":661},{"$f":"SUM(E13+E21)","v":2360},{"$f":"+F13+F21","v":1357},{"$f":"+G13+G21","v":1003},{"$f":"I11+J11","v":415},{"$f":"+I13+I21","v":256},{"$f":"+J13+J21","v":159}]
[]
["MONTEVIDEO",{"$f":"SUM(C13:D13)","v":363},{"$f":"C14+C17","v":192},{"$f":"D14+D17","v":171},{"$f":"F13+G13","v":549},{"$f":"F14+F17","v":294},{"$f":"G14+G17","v":255},{"$f":"I13+J13","v":129},{"$f":"I14+I17","v":70},{"$f":"J14+J17","v":59}]
["Montevideo",{"$f":"SUM(C14:D14)","v":308},{"$f":"C15+C16","v":157},{"$f":"D15+D16","v":151},{"$f":"F14+G14","v":447},{"$f":"F15+F16","v":230},{"$f":"G15+G16","v":217},{"$f":"I14+J14","v":119},{"$f":"I15+I16","v":64},{"$f":"J15+J16","v":55}]
["    14 a 17 años",295,147,148,427,213,214,106,55,51]
["    18 años y más",13,10,3,20,17,3,13,9,4]
["Montevideo Oeste*",55,{"$f":"C18+C19","v":35},{"$f":"D18+D19","v":20},102,{"$f":"F18+F19","v":64},{"$f":"G18+G19","v":38},10,{"$f":"I18+I19","v":6},{"$f":"J18+J19","v":4}]
["    14 a 17 años",50,32,18,95,61,34,5,3,2]
["    18 años y más",5,3,2,7,3,4,5,3,2]
[]
["RESTO DEL PAÍS",{"$f":"C21+D21","v":1128},{"$f":"C22+C23","v":638},{"$f":"D22+D23","v":490},{"$f":"F21+G21","v":1811},{"$f":"F22+F23","v":1063},{"$f":"G22+G23","v":748},{"$f":"I21+J21","v":286},{"$f":"I22+I23","v":186},{"$f":"J22+J23","v":100}]
["    14 a 17 años",{"$f":"C22+D22","v":988},{"$f":"C26+C31+C34+C37+C40+C43+C47+C51+C55+C59+C63+C68+C71+C75+C79+C83","v":563},{"$f":"D26+D31+D34+D37+D40+D43+D47+D51+D55+D59+D63+D68+D71+D75+D79+D83","v":425},{"$f":"F22+G22","v":1553},{"$f":"F26+F31+F34+F37+F40+F43+F47+F51+F55+F59+F63+F68+F71+F75+F79+F83","v":919},{"$f":"G26+G31+G34+G37+G40+G43+G47+G51+G55+G59+G63+G68+G71+G75+G79+G83","v":634},{"$f":"I22+J22","v":205},{"$f":"I26+I31+I34+I37+I40+I43+I47+I51+I55+I59+I63+I68+I71+I75+I79+I83","v":145},{"$f":"J26+J31+J34+J37+J40+J43+J47+J51+J55+J59+J63+J68+J71+J75+J79+J83","v":60}]
["    18 años y más",{"$f":"C23+D23","v":140},{"$f":"C27+C32+C35+C38+C41+C44+C48+C52+C56+C60+C64+C69+C72+C76+C80+C84","v":75},{"$f":"D27+D32+D35+D38+D41+D44+D48+D52+D56+D60+D64+D69+D72+D76+D80+D84","v":65},{"$f":"F23+G23","v":258},{"$f":"F27+F32+F35+F38+F41+F44+F48+F52+F56+F60+F64+F69+F72+F76+F80+F84","v":144},{"$f":"G27+G32+G35+G38+G41+G44+G48+G52+G56+G60+G64+G69+G72+G76+G80+G84","v":114},{"$f":"I23+J23","v":81},{"$f":"I27+I32+I35+I38+I41+I44+I48+I52+I56+I60+I64+I69+I72+I76+I80+I84","v":41},{"$f":"J27+J32+J35+J38+J41+J44+J48+J52+J56+J60+J64+J69+J72+J76+J80+J84","v":40}]
[]
["Artigas",{"$f":"C25+D25","v":66},{"$f":"C26+C27","v":40},{"$f":"D26+D27","v":26},{"$f":"F25+G25","v":119},{"$f":"F26+F27","v":73},{"$f":"G26+G27","v":46},{"$f":"I25+J25","v":13},{"$f":"I26+I27","v":8},{"$f":"J26+J27","v":5}]
["    14 a 17 años",60,36,24,100,62,38,{"$f":"I26+J26","v":11},7,4]
["    18 años y más",{"$f":"C27+D27","v":6},4,2,{"$f":"F27+G27","v":19},11,8,{"$f":"I27+J27","v":2},1,1]
[]
["Canelones",{"$f":"C29+D29","v":258},{"$f":"C30+C33+C36+C39+C42","v":147},{"$f":"D30+D33+D36+D39+D42","v":111},{"$f":"F29+G29","v":477},{"$f":"F30+F33+F36+F39+F42","v":264},{"$f":"G30+G33+G36+G39+G42","v":213},{"$f":"I29+J29","v":61},{"$f":"I30+I33+I36+I39+I42","v":36},{"$f":"J30+J33+J36+J39+J42","v":25}]
["   Barros Blancos",{"$f":"C30+D30","v":51},{"$f":"C31+C32","v":33},{"$f":"D31+D32","v":18},{"$f":"F30+G30","v":144},{"$f":"F31+F32","v":76},{"$f":"G31+G32","v":68},{"$f":"I30+J30","v":13},{"$f":"I31+I32","v":7},{"$f":"J31+J32","v":6}]
["    14 a 17 años",49,32,17,135,73,62,9,5,4]
["    18 años y más",2,1,1,9,3,6,4,2,2]
["   La Paz",65,{"$f":"C34+C35","v":35},{"$f":"D34+D35","v":30},96,{"$f":"F34+F35","v":53},{"$f":"G34+G35","v":43},16,{"$f":"I34+I35","v":10},{"$f":"J34+J35","v":6}]
["    14 a 17 años",62,32,30,83,46,37,9,7,2]
["    18 años y más",3,3,0,13,7,6,7,3,4]
["   Las Piedras",65,{"$f":"C37+C38","v":41},{"$f":"D37+D38","v":24},117,{"$f":"F37+F38","v":72},{"$f":"G37+G38","v":45},16,{"$f":"I37+I38","v":10},{"$f":"J37+J38","v":6}]
["    14 a 17 años",60,38,22,103,62,41,14,9,5]
["    18 años y más",5,3,2,14,10,4,2,1,1]
["   Paso Carrasco",19,{"$f":"C40+C41","v":8},{"$f":"D40+D41","v":11},39,{"$f":"F40+F41","v":20},{"$f":"G40+G41","v":19},7,{"$f":"I40+I41","v":4},{"$f":"J40+J41","v":3}]
["    14 a 17 años",18,8,10,35,18,17,4,2,2]
["    18 años y más",1,0,1,4,2,2,3,2,1]
["  Toledo",58,{"$f":"C43+C44","v":30},{"$f":"D43+D44","v":28},81,{"$f":"F43+F44","v":43},{"$f":"G43+G44","v":38},9,{"$f":"I43+I44","v":5},{"$f":"J43+J44","v":4}]
["    14 a 17 años",55,30,25,69,39,30,4,2,2]
["    18 años y más",3,0,3,12,4,8,5,3,2]
[]
["Colonia ",{"$f":"C46+D46","v":34},{"$f":"C47+C48","v":25},{"$f":"D47+D48","v":9},{"$f":"F46+G46","v":77},{"$f":"F47+F48","v":56},{"$f":"G47+G48","v":21},{"$f":"I46+J46","v":7},{"$f":"I47+I48","v":4},{"$f":"J47+J48","v":3}]
["    14 a 17 años",{"$f":"C47+D47","v":33},25,8,{"$f":"F47+G47","v":72},53,19,{"$f":"I47+J47","v":6},3,3]
["    18 años y más",1,0,1,5,3,2,1,1,0]
[]
["Durazno",{"$f":"C50+D50","v":74},{"$f":"C51+C52","v":46},{"$f":"D51+D52","v":28},{"$f":"F50+G50","v":99},{"$f":"F51+F52","v":64},{"$f":"G51+G52","v":35},{"$f":"I50+J50","v":14},{"$f":"SUM(I51:I52)","v":12},{"$f":"SUM(J51:J52)","v":2}]
["    14 a 17 años",69,42,27,83,52,31,{"$f":"I51+J51","v":10},8,2]
["    18 años y más",5,4,1,16,12,4,4,4,0]
[]
["Florida",{"$f":"C54+D54","v":45},{"$f":"C55+C56","v":30},{"$f":"D55+D56","v":15},{"$f":"F54+G54","v":120},{"$f":"F55+F56","v":56},{"$f":"G55+G56","v":64},{"$f":"I54+J54","v":10},{"$f":"I55+I56","v":2},{"$f":"J55+J56","v":8}]
["    14 a 17 años",{"$f":"C55+D55","v":37},25,12,{"$f":"F55+G55","v":107},50,57,{"$f":"I55+J55","v":6},2,4]
["    18 años y más",{"$f":"C56+D56","v":8},5,3,{"$f":"F56+G56","v":13},6,7,{"$f":"I56+J56","v":4},0,4]
[]
["Maldonado  ",{"$f":"SUM(C58:D58)","v":66},{"$f":"C59+C60","v":41},{"$f":"D59+D60","v":25},{"$f":"SUM(F58:G58)","v":95},{"$f":"F59+F60","v":63},{"$f":"G59+G60","v":32},{"$f":"SUM(I58:J58)","v":10},{"$f":"I59+I60","v":8},{"$f":"J59+J60","v":2}]
["    14 a 17 años",{"$f":"C59+D59","v":47},28,19,{"$f":"F59+G59","v":60},39,21,{"$f":"SUM(I59:J59)","v":5},4,1]
["    18 años y más",{"$f":"C60+D60","v":19},13,6,{"$f":"F60+G60","v":35},24,11,5,4,1]
[]
["Paysandú",{"$f":"C62+D62","v":65},{"$f":"C63+C64","v":38},{"$f":"D63+D64","v":27},{"$f":"F62+G62","v":91},{"$f":"F63+F64","v":53},{"$f":"G63+G64","v":38},{"$f":"I62+J62","v":8},{"$f":"I63+I64","v":5},{"$f":"J63+J64","v":3}]
["    14 a 17 años",{"$f":"C63+D63","v":61},38,23,{"$f":"F63+G63","v":81},50,31,{"$f":"I63+J63","v":6},3,3]
["    18 años y más",{"$f":"C64+D64","v":4},0,4,{"$f":"F64+G64","v":10},3,7,{"$f":"I64+J64","v":2},2,0]
[]
["Río Negro ",{"$f":"C66+D66","v":135},{"$f":"C67+C70","v":81},{"$f":"D67+D70","v":54},{"$f":"F66+G66","v":159},{"$f":"F67+F70","v":98},{"$f":"G67+G70","v":61},{"$f":"I66+J66","v":32},{"$f":"I67+I70","v":20},{"$f":"J67+J70","v":12}]
["Fray Bentos",{"$f":"C67+D67","v":65},{"$f":"C68+C69","v":37},{"$f":"D68+D69","v":28},{"$f":"F67+G67","v":65},{"$f":"F68+F69","v":37},{"$f":"G68+G69","v":28},{"$f":"I67+J67","v":0},{"$f":"I68+I69","v":0},{"$f":"J68+J69","v":0}]
["    14 a 17 años",31,18,13,31,18,13,0,0,0]
["    18 años y más",34,19,15,34,19,15,0,0,0]
["Young",70,{"$f":"C71+C72","v":44},{"$f":"D71+D72","v":26},94,{"$f":"F71+F72","v":61},{"$f":"G71+G72","v":33},32,{"$f":"I71+I72","v":20},{"$f":"J71+J72","v":12}]
["    14 a 17 años",67,44,23,89,60,29,24,16,8]
["    18 años y más",3,0,3,5,1,4,8,4,4]
[]
["Rivera",{"$f":"C74+D74","v":136},{"$f":"C75+C76","v":67},{"$f":"D75+D76","v":69},{"$f":"F74+G74","v":231},{"$f":"F75+F76","v":160},{"$f":"G75+G76","v":71},{"$f":"I74+J74","v":95},{"$f":"I75+I76","v":74},{"$f":"J75+J76","v":21}]
["    14 a 17 años",{"$f":"C75+D75","v":124},65,59,{"$f":"F75+G75","v":206},145,61,{"$f":"I75+J75","v":86},71,15]
["    18 años y más",{"$f":"C76+D76","v":12},2,10,{"$f":"F76+G76","v":25},15,10,{"$f":"I76+J76","v":9},3,6]
[]
["Salto",{"$f":"C78+D78","v":138},{"$f":"C79+C80","v":67},{"$f":"D79+D80","v":71},{"$f":"F78+G78","v":150},{"$f":"F79+F80","v":76},{"$f":"G79+G80","v":74},{"$f":"I78+J78","v":19},{"$f":"I79+I80","v":8},{"$f":"J79+J80","v":11}]
["    14 a 17 años",{"$f":"C79+D79","v":126},59,67,{"$f":"F79+G79","v":150},76,74,{"$f":"I79+J79","v":0},0,0]
["    18 años y más",{"$f":"C80+D80","v":12},8,4,{"$f":"F80+G80","v":0},0,0,{"$f":"I80+J80","v":19},8,11]
[]
["Treinta y Tres",{"$f":"C82+D82","v":111},{"$f":"C83+C84","v":56},{"$f":"D83+D84","v":55},{"$f":"F82+G82","v":193},{"$f":"F83+F84","v":100},{"$f":"G83+G84","v":93},{"$f":"I82+J82","v":17},{"$f":"I83+I84","v":9},{"$f":"J83+J84","v":8}]
["    14 a 17 años",{"$f":"C83+D83","v":89},43,46,{"$f":"F83+G83","v":149},76,73,{"$f":"I83+J83","v":11},6,5]
["    18 años y más",{"$f":"C84+D84","v":22},13,9,{"$f":"F84+G84","v":44},24,20,{"$f":"I84+J84","v":6},3,3]
["Fuente:  Área de Educación No Formal, Dirección de Educación, MEC."]
[]
["Nota:"]
[" Ingresos: Todos los individuos que comenzaron a cursar la propuesta educativa en el primer o segundo semestre del año 2016.(1er. SEMESTRE MARZO 2016 /1 er. SEMESTRE JULIO 2016)"]
["Matriculados: Todos los individuos que durante el año 2016 cursaron la propuesta educativa. (1er. 2do. 3er. 4to. Y Redescubrir si corresponde) +  los estudiantes de 1er. Semestre de Julio 2016 "]
[" Egresos: Todos los individuos que culminaron durante el 2016 los cuatro semestres que prevee la propuesta educativa. (los que terminaron 4to semestre en Julio y Diciembre 2016)"]

{"sheet":"II-8.1.9  ","index":104,"n_rows":86,"n_cols":7,"rows_kept":86,"cut":false,"hidden":false,"merged":[[83,0,83,6],[84,0,84,6],[85,0,85,6],[0,5,1,7],[6,0,6,6],[7,0,9,0],[7,1,9,1],[7,2,7,3],[7,4,9,4],[7,5,7,6],[8,2,8,3],[8,5,8,6]]}
["MEC - DIRECCIÓN DE EDUCACIÓN",null,null,null,null,"ALUMNOS MATRICULADOS"]
["ÁREA DE EDUCACIÓN NO FORMAL"]
[]
[]
["Cuadro Nº II-8.1.9"]
[]
["ALUMNOS CON EGRESO ANTICIPADO Y DESVINCULADOS DE CECAP POR SEXO, SEGÚN DEPARTAMENTO Y EDAD. AÑO 2016."]
["DEPARTAMENTO Y EDAD","TOTAL ","EGRESO ANTICIPADO",null,"TOTAL ","DESVINCULADOS"]
[null,null,"SEXO",null,null,"SEXO"]
[null,null,"M","F",null,"M","F"]
["TOTAL",{"$f":"SUM(C11:D11)","v":238},{"$f":"+C13+C20","v":140},{"$f":"+D13+D20","v":98},{"$f":"SUM(F11:G11)","v":521},{"$f":"+F13+F20","v":301},{"$f":"+G13+G20","v":220}]
[]
["MONTEVIDEO",{"$f":"SUM(C13:D13)","v":35},{"$f":"C14+C17","v":20},{"$f":"D14+D17","v":15},146,{"$f":"F14+F17","v":80},{"$f":"G14+G17","v":66}]
["Montevideo",20,{"$f":"C15+C16","v":9},{"$f":"D15+D16","v":11},79,{"$f":"F15+F16","v":45},{"$f":"G15+G16","v":34}]
["    14 a 17 años",19,9,10,74,40,34]
["    18 años y más",1,0,1,5,5,0]
["Montevideo Oeste",15,{"$f":"C18+C19","v":11},{"$f":"D18+D19","v":4},67,{"$f":"F18+F19","v":35},{"$f":"G18+G19","v":32}]
["    14 a 17 años",12,9,3,62,31,31]
["    18 años y más",3,2,1,5,4,1]
["RESTO DEL PAÍS",{"$f":"+C20+D20","v":203},{"$f":"C21+C22","v":120},{"$f":"D21+D22","v":83},{"$f":"+F20+G20","v":375},{"$f":"F21+F22","v":221},{"$f":"G21+G22","v":154}]
["    14 a 17 años",{"$f":"+C21+D21","v":143},{"$f":"C25+C30+C33+C36+C39+C42+C46+C50+C54+C58+C62+C66+C69+C73+C78+C82","v":85},{"$f":"D25+D30+D33+D36+D39+D42+D46+D50+D54+D58+D62+D66+D69+D73+D78+D82","v":58},309,{"$f":"F25+F30+F33+F36+F39+F42+F46+F50+F54+F58+F62+F66+F69+F73+F78+F82","v":180},{"$f":"G25+G30+G33+G36+G39+G42+G46+G50+G54+G58+G62+G66+G69+G73+G78+G82","v":129}]
["    18 años y más",60,{"$f":"C26+C31+C34+C37+C40+C43+C47+C51+C55+C59+C63+C66+C70+C74+C79+C83","v":35},{"$f":"D26+D31+D34+D37+D40+D43+D47+D51+D55+D59+D63+D66+D70+D74+D79+D83","v":25},66,{"$f":"F26+F31+F34+F37+F40+F43+F47+F51+F55+F59+F63+F66+F70+F74+F79+F83","v":41},{"$f":"G26+G31+G34+G37+G40+G43+G47+G51+G55+G59+G63+G66+G70+G74+G79+G83","v":25}]
[]
["Artigas",{"$f":"SUM(C24:D24)","v":14},{"$f":"SUM(C25:C26)","v":10},{"$f":"SUM(D25:D26)","v":4},{"$f":"SUM(F24:G24)","v":37},{"$f":"SUM(F25:F26)","v":26},{"$f":"SUM(G25:G26)","v":11}]
["    14 a 17 años",{"$f":"SUM(C25:D25)","v":11},8,3,{"$f":"SUM(F25:G25)","v":30},21,9]
["    18 años y más",{"$f":"SUM(C26:D26)","v":3},2,1,{"$f":"SUM(F26:G26)","v":7},5,2]
[]
["Canelones",{"$f":"SUM(C28:D28)","v":65},{"$f":"C29+C32+C35+C38+C41","v":36},{"$f":"D29+D32+D35+D38+D41","v":29},{"$f":"SUM(F28:G28)","v":94},{"$f":"F29+F32+F35+F38+F41","v":55},{"$f":"G29+G32+G35+G38+G41","v":39}]
["  Barros Blancos",{"$f":"SUM(C29:D29)","v":26},{"$f":"SUM(C30:C31)","v":15},{"$f":"SUM(D30:D31)","v":11},5,{"$f":"SUM(F30:F31)","v":5},{"$f":"SUM(G30:G31)","v":0}]
["    14 a 17 años",24,15,9,5,5,0]
["    18 años y más",2,0,2,0,0,0]
["  La Paz",18,{"$f":"SUM(C33:C34)","v":8},{"$f":"SUM(D33:D34)","v":10},19,{"$f":"SUM(F33:F34)","v":10},{"$f":"SUM(G33:G34)","v":9}]
["    14 a 17 años",16,7,9,16,8,8]
["    18 años y más",2,1,1,3,2,1]
["Las Piedras",15,{"$f":"SUM(C36:C37)","v":8},{"$f":"SUM(D36:D37)","v":7},24,{"$f":"SUM(F36:F37)","v":15},{"$f":"SUM(G36:G37)","v":9}]
["    14 a 17 años",7,4,3,16,10,6]
["    18 años y más",8,4,4,8,5,3]
["Paso Carrasco",{"$f":"SUM(C38:D38)","v":2},{"$f":"C39+C40","v":1},{"$f":"D39+D40","v":1},{"$f":"SUM(F38:G38)","v":15},{"$f":"F39+F40","v":6},{"$f":"G39+G40","v":9}]
["    14 a 17 años",2,1,1,15,6,9]
["    18 años y más",0,0,0,0,0,0]
["Toledo",{"$f":"SUM(C41:D41)","v":4},{"$f":"C42+C43","v":4},{"$f":"D42+D43","v":0},{"$f":"SUM(F41:G41)","v":31},{"$f":"F42+F43","v":19},{"$f":"G42+G43","v":12}]
["    14 a 17 años",{"$f":"SUM(C42:D42)","v":1},1,0,{"$f":"SUM(F42:G42)","v":26},15,11]
["    18 años y más",{"$f":"SUM(C43:D43)","v":3},3,0,{"$f":"SUM(F43:G43)","v":5},4,1]
[]
["Colonia ",{"$f":"SUM(C45:D45)","v":1},{"$f":"C46+C47","v":1},{"$f":"D46+D47","v":0},{"$f":"SUM(F45:G45)","v":3},{"$f":"F46+F47","v":3},{"$f":"G46+G47","v":0}]
["    14 a 17 años",{"$f":"SUM(C46:D46)","v":1},1,0,{"$f":"SUM(F46:G46)","v":3},3,0]
["    18 años y más",{"$f":"SUM(C47:D47)","v":0},0,0,{"$f":"SUM(F47:G47)","v":0},0,0]
[]
["Durazno",{"$f":"SUM(C49:D49)","v":0},{"$f":"SUM(C50:C51)","v":0},{"$f":"SUM(D50:D51)","v":0},{"$f":"SUM(F49:G49)","v":57},{"$f":"SUM(F50:F51)","v":37},{"$f":"SUM(G50:G51)","v":20}]
["    14 a 17 años",{"$f":"SUM(C50:D50)","v":0},0,0,{"$f":"SUM(F50:G50)","v":49},32,17]
["    18 años y más",{"$f":"SUM(C51:D51)","v":0},0,0,{"$f":"SUM(F51:G51)","v":8},5,3]
[]
["Florida",{"$f":"SUM(C53:D53)","v":13},{"$f":"SUM(C54:C55)","v":9},{"$f":"SUM(D54:D55)","v":4},{"$f":"SUM(F53:G53)","v":16},{"$f":"SUM(F54:F55)","v":10},{"$f":"SUM(G54:G55)","v":6}]
["    14 a 17 años",{"$f":"SUM(C54:D54)","v":9},6,3,{"$f":"SUM(F54:G54)","v":12},7,5]
["    18 años y más",{"$f":"SUM(C55:D55)","v":4},3,1,{"$f":"SUM(F55:G55)","v":4},3,1]
[]
["Maldonado ",{"$f":"SUM(C57:D57)","v":21},{"$f":"SUM(C58:C59)","v":15},{"$f":"SUM(D58:D59)","v":6},{"$f":"SUM(F57:G57)","v":30},{"$f":"SUM(F58:F59)","v":17},{"$f":"SUM(G58:G59)","v":13}]
["    14 a 17 años",11,8,3,21,11,10]
["    18 años y más",10,7,3,9,6,3]
[]
["Paysandú",{"$f":"SUM(C61:D61)","v":17},{"$f":"C62+C63","v":12},{"$f":"D62+D63","v":5},{"$f":"SUM(F61:G61)","v":11},{"$f":"F62+F63","v":6},{"$f":"G62+G63","v":5}]
["    14 a 17 años",12,10,2,9,6,3]
["    18 años y más",5,2,3,2,0,2]
["Río Negro ",22,{"$f":"C65+C68","v":10},{"$f":"D65+D68","v":12},30,{"$f":"F65+F68","v":11},{"$f":"G65+G68","v":19}]
["Fray Bentos",15,{"$f":"C66+C67","v":9},{"$f":"D66+D67","v":6},10,{"$f":"F66+F67","v":6},{"$f":"G66+G67","v":4}]
["    14 a 17 años",4,2,2,2,1,1]
["    18 años y más",11,7,4,8,5,3]
["Young",7,1,6,20,5,15]
["    14 a 17 años",7,1,6,20,5,15]
["    18 años y más",0,0,0,0,0,0]
[]
["Rivera",{"$f":"SUM(C72:D72)","v":28},{"$f":"C73+C74","v":19},{"$f":"D73+D74","v":9},{"$f":"SUM(F72:G72)","v":51},{"$f":"F73+F74","v":34},{"$f":"G73+G74","v":17}]
["    14 a 17 años",{"$f":"SUM(C73:D73)","v":17},11,6,{"$f":"SUM(F73:G73)","v":44},29,15]
["    18 años y más",{"$f":"SUM(C74:D74)","v":11},8,3,{"$f":"SUM(F74:G74)","v":7},5,2]
[]
[]
["Salto",{"$f":"SUM(C77:D77)","v":8},{"$f":"C78+C79","v":4},{"$f":"D78+D79","v":4},{"$f":"SUM(F77:G77)","v":16},{"$f":"F78+F79","v":7},{"$f":"G78+G79","v":9}]
["    14 a 17 años",{"$f":"SUM(C78:D78)","v":7},3,4,{"$f":"SUM(F78:G78)","v":14},6,8]
["    18 años y más",{"$f":"SUM(C79:D79)","v":1},1,0,{"$f":"SUM(F79:G79)","v":2},1,1]
[]
["Treinta y Tres",{"$f":"SUM(C81:D81)","v":21},{"$f":"C82+C83","v":9},{"$f":"D82+D83","v":12},{"$f":"SUM(F81:G81)","v":36},{"$f":"F82+F83","v":19},{"$f":"G82+G83","v":17}]
["    14 a 17 años",{"$f":"SUM(C82:D82)","v":14},7,7,{"$f":"SUM(F82:G82)","v":27},15,12]
["    18 años y más",{"$f":"SUM(C83:D83)","v":7},2,5,{"$f":"SUM(F83:G83)","v":9},4,5]
["Fuente:  Área de Educación No Formal, Dirección de Educación, MEC."]
["Nota:                                                                                                                                            Egreso Anticipado: Todos los individuos que durante el 2016 egresaron de CECAP para incorporarse a otra propuesta educativa o al mundo del trabajo, habiendo cursado un período menor a cuatro semestres."]
["Desvinculados: Todos los individuos que durante el 2016 dejaron de asistir a la propuesta."]

{"sheet":"II-8.1.10 ","index":105,"n_rows":268,"n_cols":10,"rows_kept":268,"cut":false,"hidden":false,"merged":[[6,5,6,6],[6,8,6,9],[0,5,1,8],[4,0,4,9],[5,0,7,0],[5,1,7,1],[5,2,5,3],[5,4,7,4],[5,5,5,6],[5,7,7,7],[5,8,5,9],[6,2,6,3]]}
["INSTITUCIONES UNIVERSITARIAS: OFERTAS EDUCATIVAS NO TERCIARIAS",null,null,null,null,"ALUMNOS MATRICULADOS"]
[]
["Cuadro Nº II- 8.1.10"]
[]
["ALUMNOS INGRESADOS, MATRICULADOS Y EGRESADOS EN OFERTAS EDUCATIVAS NO TERCIARIAS DE UNIVERSIDADES PRIVADAS POR SEXO. AÑO 2016."]
["UNIVERSIDAD / ACREDITACIÓN","TOTAL","INGRESADOS",null,"TOTAL","MATRICULADOS",null,"TOTAL","EGRESADOS"]
[null,null,"SEXO",null,null,"SEXO",null,null,"SEXO"]
[null,null,"M","F",null,"M","F",null,"M","F"]
["TOTAL",{"$f":"SUM(C9:D9)","v":4970},{"$f":"+C11+C39+C61+C169+C188+C229+C233+C253","v":2395},{"$f":"+D11+D39+D61+D169+D188+D229+D233+D253","v":2575},{"$f":"SUM(F9:G9)","v":7013},{"$f":"+F11+F39+F61+F169+F188+F229+F233+F253","v":3721},{"$f":"+G11+G39+G61+G169+G188+G229+G233+G253","v":3292},{"$f":"SUM(I9:J9)","v":2795},{"$f":"+I11+I39+I61+I169+I188+I229+I233+I253","v":1353},{"$f":"+J11+J39+J61+J169+J188+J229+J233+J253","v":1442}]
[]
["UNIVERSIDAD ORT URUGUAY ",{"$f":"SUM(C11:D11)","v":868},{"$f":"SUM(C12:C37)","v":616},{"$f":"SUM(D12:D37)","v":252},{"$f":"SUM(F11:G11)","v":2551},{"$f":"SUM(F12:F37)","v":1761},{"$f":"SUM(G12:G37)","v":790},{"$f":"SUM(I11:J11)","v":418},{"$f":"SUM(I12:I37)","v":284},{"$f":"SUM(J12:J37)","v":134}]
["Analista en Comercio Exterior",{"$f":"+C12+D12","v":34},22,12,{"$f":"+F12+G12","v":92},53,39,{"$f":"+I12+J12","v":25},12,13]
["Analista en Comunicación Corporativa y Relaciones Públicas",19,10,9,82,25,57,20,3,17]
["Analista en Marketing",110,63,47,298,168,130,70,33,37]
["Analista en Publicidad",8,4,4,31,14,17,11,9,2]
["Analista en Redes Sociales y Community Management",7,2,5,23,5,18,2,2,0]
["Analista en Tecnologías de la Información",121,102,19,377,317,60,19,16,3]
["Analista Programador",164,148,16,450,389,61,62,53,9]
["Analista Programador de Aplicaciones Web",0,0,0,5,5,0,2,2,0]
["Diseñador de Interiores",0,0,0,10,3,7,8,0,8]
["Diseñador Gráfico",69,32,37,176,77,99,12,4,8]
["Interiorista",0,0,0,0,0,0,1,0,1]
["Productor de Modas",0,0,0,18,0,18,6,0,6]
["Programador  Web",13,10,3,25,17,8,45,40,5]
["Técnico en Diseño de Sonido",34,27,7,91,82,9,8,8,0]
["Técnico en Diseño Web",24,13,11,59,33,26,6,3,3]
["Técnico en Electro Electrónica",10,10,0,36,35,1,5,5,0]
["Técnico en Electrónica Informática",0,0,0,8,6,2,16,14,2]
["Técnico en Gerencia",55,28,27,168,81,87,8,5,3]
["Técnico en Gerencia Comercial",38,24,14,96,64,32,6,3,3]
["Técnico en Gerencia Turística",17,9,8,54,22,32,3,1,2]
["Técnico en Producción Musical",7,5,2,18,16,2,12,12,0]
["Técnico en Realización Audiovisual",22,12,10,58,34,24,6,3,3]
["Técnico en Relaciones Públicas y Organización de Eventos",10,1,9,40,8,32,7,1,6]
["Técnico en Sistemas Eléctricos y Electrónicos",26,25,1,41,40,1,10,10,0]
["Técnico en Sistemas Operativos y Redes",55,44,11,224,203,21,19,18,1]
["Técnico en Soporte Informático",25,25,0,71,64,7,29,27,2]
[]
["UNIVERSIDAD DE LA EMPRESA",{"$f":"SUM(C39:D39)","v":481},{"$f":"C40+C56","v":225},{"$f":"D40+D56","v":256},{"$f":"SUM(F39:G39)","v":703},{"$f":"F40+F56","v":367},{"$f":"G40+G56","v":336},{"$f":"SUM(I39:J39)","v":153},{"$f":"I40+I56","v":70},{"$f":"J40+J56","v":83}]
["Montevideo",{"$f":"SUM(C40:D40)","v":421},{"$f":"SUM(C41:C54)","v":190},{"$f":"SUM(D41:D54)","v":231},{"$f":"SUM(F40:G40)","v":593},{"$f":"SUM(F41:F54)","v":288},{"$f":"SUM(G41:G54)","v":305},{"$f":"SUM(I40:J40)","v":127},{"$f":"SUM(I41:I54)","v":55},{"$f":"SUM(J41:J54)","v":72}]
["Analista en Tecnología Informática",{"$f":"SUM(C41:D41)","v":14},14,0,25,23,2,6,5,1]
["Técnico en Diseño Gráfico",4,1,3,12,2,10,3,1,2]
["Técnico en Diseño de Interiores",19,0,19,29,0,29,2,0,2]
["Analista en Comercio Exterior",33,21,12,34,22,12,13,9,4]
["Analista en Marketing",84,49,35,95,58,37,33,15,18]
["Analista en Recursos Humanos",72,17,55,90,25,65,29,5,24]
["Técnico en Gerencia",75,28,47,103,56,47,6,5,1]
["Experto en Dirección de Marketing",15,11,4,17,11,6,12,5,7]
["Carrera Experto en Dirección de Personas",12,4,8,14,6,8,15,6,9]
["Postgrado Ejecutivo Experto en Habilidades Gerenciales",20,12,8,20,12,8,0,0,0]
["Técnico Agropecuario",19,10,9,46,30,16,0,0,0]
["Técnico en Ciencias Veterinarias",15,4,11,35,10,25,0,0,0]
["Técnico Forestal",14,11,3,31,23,8,8,4,4]
["Técnico Veterinario",25,8,17,42,10,32,0,0,0]
[]
["Colonia",60,{"$f":"SUM(C57:C59)","v":35},{"$f":"SUM(D57:D59)","v":25},110,{"$f":"SUM(F57:F59)","v":79},{"$f":"SUM(G57:G59)","v":31},26,{"$f":"SUM(I57:I59)","v":15},{"$f":"SUM(J57:J59)","v":11}]
["Analista en Recursos Humanos",12,4,8,16,7,9,6,2,4]
["Técnico en Diseño Gráfico",11,1,10,11,1,10,5,2,3]
["Técnico Agropecuario",{"$f":"SUM(C59:D59)","v":37},30,7,83,71,12,15,11,4]
[]
["UCUDAL",{"$f":"B62+B156+B152+B159+B164","v":2166},{"$f":"C62+C156+C152+C159+C164","v":817},1349,2235,836,1399,1637,646,910]
["Montevideo",{"$f":"C62+D62","v":1991},{"$f":"SUM(C63:C150)","v":777},1214,{"$f":"F62+G62","v":2060},796,1264,1492,614,797]
["Religiones del mundo en perspectiva interdisciplinaria",{"$f":"C63+D63","v":14},2,12,{"$f":"F63+G63","v":14},2,12,{"$f":"I63+J63","v":10},2,8]
["C.Judaísmo \"Figuras Protagónicas de la historia del Pueblo Judío\"",{"$f":"C64+D64","v":24},6,18,{"$f":"F64+G64","v":24},6,18,{"$f":"I64+J64","v":22},6,16]
["C. Universo del Islam Módulo 1",34,5,29,34,6,28,30,6,24]
["C. Universo Módulo 2",32,7,25,32,7,25,32,7,25]
["Cátedra Islam Seminario de Coyuntura",24,4,20,24,4,20,24,4,20]
["Seminario Toma de decisiones inspiradas y gestión de agenda",18,7,11,18,7,11,18,7,11]
["Matemáticas para las Ciencias Sociales",25,12,13,25,12,13,25,12,13]
["Introducción a la programación en STATA",18,7,11,18,7,11,18,7,11]
["Introducción a la programación en R",19,6,13,19,6,13,19,6,13]
["Methods for Interpretation and Analysis of Regression Discontinuity Designs",21,7,14,21,7,14,21,7,14]
["Estadística Bayesiana para las Ciencias Sociales",6,3,3,6,3,3,6,3,3]
["Experimentos en Encuestas",15,7,8,15,7,8,15,7,8]
["Estudios de Caso Mediante 'Process Tracing'",14,3,11,14,3,11,14,3,11]
["Panel Data Analysis ",9,6,3,9,6,3,9,6,3]
["Diseños de Investigación e Inferencia Causal",7,2,5,7,2,5,7,2,5]
["Introduction to Hierarchical Models",12,7,5,12,7,5,12,7,5]
["Introducción al análisis de redes sociales",13,6,7,13,6,7,13,6,7]
["Modelos Logit y Probit",10,5,5,10,5,5,10,5,5]
["Asistente Administrativo Empresarial",18,4,14,18,4,14,12,0,12]
["Habilidades de Coaching y Liderazgo",8,2,6,8,2,6,8,2,6]
["Diseño de interiores ",15,1,14,15,1,14,10,0,10]
["Asistente en Gestión Comercial",11,5,6,11,5,6,8,4,4]
["Idoneo en Farmacia ",64,10,54,64,10,54,64,10,54]
["Marketing Digital ",38,15,23,38,15,23,37,15,22]
["Asistente en Recursos Humanos ",13,2,11,13,2,11,10,8,2]
["Visitador Medico Profesional",39,22,17,39,22,17,33,17,16]
["Supervisor en Operaciones en Logistica ",9,7,2,9,7,2,9,7,2]
["Régimen Jurídico de los Agronegocios",21,10,11,21,10,11,0,0,0]
["Cláusulas y prácticas abusivas en la contratación",14,3,11,14,3,11,0,0,0]
["Cooperativas de vivienda en el Derecho Uruguayo",36,7,29,36,7,29,0,0,0]
["La responsabilidad del escribano",23,3,20,23,3,20,0,0,0]
["Partición: algunos aspectos civiles, registrales y procesales ",29,2,27,29,2,27,0,0,0]
["Métodos de resolución alternativa de conflictos",13,3,10,13,3,10,0,0,0]
["2da edición Métodos de resolución alternativa de conflictos",20,4,16,20,4,16,0,0,0]
["Curso de actualización en Derecho del Deporte",33,27,6,33,27,6,0,0,0]
["Curso de Actualización Derecho del Deporte: segunda parte",30,23,7,30,23,7,0,0,0]
["Contratos: de la redacción al Juzgado",27,4,23,27,4,23,0,0,0]
["Contratos: de la redacción al juzgado - Segunda parte",14,4,10,14,4,10,0,0,0]
["Responsabilidad civil profundizada",29,5,24,29,5,24,0,0,0]
["Violencia doméstica",23,5,18,23,5,18,0,0,0]
["Mediación en el ámbito educativo",20,7,13,20,7,13,0,0,0]
["Compraventa",22,4,18,22,4,18,0,0,0]
["Proyecto de energías renovables",23,6,17,23,6,17,0,0,0]
["Negociación en la gestión de conflictos laborales",22,3,19,22,3,19,0,0,0]
["Medios de prueba de formación notarial",17,4,13,17,4,13,0,0,0]
["Nuevo Código aduanero de la ROU",11,7,4,11,7,4,0,0,0]
["Derecho de la seguridad pública y privada",16,7,9,16,7,9,0,0,0]
["Calidad de Servicio",20,6,14,20,6,14,20,6,14]
["Certificado de Formación en Logística (CFL)",9,8,1,9,8,1,9,8,1]
["Diploma de Formacion en Logistica (DFL)",5,4,1,5,4,1,5,4,1]
["Diseño Y Operacion de Centros de Distribucion",11,8,3,11,8,3,11,8,3]
["Logística Internacional",7,5,2,7,5,2,7,5,2]
["Planificacion y Control de Operaciones",13,8,5,13,8,5,13,8,5]
["Programa de Formacion en Logistica (PFL)",5,4,1,5,4,1,5,4,1]
["Certificado de Prevencion en Lavado de Dinero (CPLD)",48,15,33,48,15,33,48,15,33]
["Certificado en Tecnicas de Manejo de Inversiones Financieras",16,11,5,16,11,5,16,11,5]
["Coaching",36,16,20,36,16,20,36,16,20]
["Como elaborar un plan de capacitacion efectivo",26,4,22,26,4,22,26,4,22]
["Conferencia \"Fusilando héroes y premiando cobardes, ¿sucede esto en mi empresa?\"",58,"S/D","S/D",58,"S/D","S/D",58,"S/D","S/D"]
["Conversaciones Cruciales",35,18,17,35,18,17,35,18,17]
["Delegar",47,25,22,47,25,22,47,25,22]
["Gestion de Abastecimientos",21,11,10,21,11,10,21,11,10]
["Influencia estratégica",33,21,12,33,21,12,33,21,12]
["La nueva funcion del lider",18,6,12,18,6,12,18,6,12]
["La Venta Relacional",14,11,3,14,11,3,14,11,3]
["Los 7 Hábitos de la Gente Altamente Efectiva",14,4,10,14,4,10,14,4,10]
["Manejo del tiempo",17,10,7,17,10,7,17,10,7]
["Martha Alles: Planes de Sucesión y Diagramas de Reemplazo",111,29,82,111,29,82,111,29,82]
["Negociar",27,13,14,27,13,14,27,13,14]
["Neuromanagement",17,8,9,17,8,9,17,8,9]
["Profesionalice sus Presentaciones Orales",53,26,27,53,26,27,53,26,27]
["Programa de Desarrollo Directivo (PDD)",45,24,21,45,24,21,45,24,21]
["Programa de Direccion General (PDG)",18,17,1,18,17,1,18,17,1]
["Programa de Formacion Comercial (PFC)",41,25,16,41,25,16,41,25,16]
["Programa de Formacion en Gestion de Proyectos (GP)",33,18,15,33,18,15,33,18,15]
["Programa de Gestión Humana Estratégica (GHE)",14,5,9,14,5,9,14,5,9]
["Programa de Gestion para el Alto Desempeno (GAD)",15,12,3,15,12,3,15,12,3]
["Programa de Habilidades Directivas",27,16,11,27,16,11,27,16,11]
["Reuniones Efectivas",16,12,4,16,12,4,16,12,4]
["Ricardo Altimira- Negociación y Design Thinking",29,19,10,29,19,10,29,19,10]
["Seminario Internacional de Fideicomiso",60,27,33,60,27,33,60,27,33]
["Diploma de Evaluación de los Aprendizajes",31,6,25,53,11,42,0,0,0]
["Diploma de diseño y desarrollo curricular en convenio con Unesco",34,5,29,81,18,63,0,0,0]
["Curso de Imagenología para Fisioterapeutas",13,3,10,13,3,10,13,"S/D","S/D"]
["Pilates Nivel 1",10,4,6,10,4,6,10,"S/D","S/D"]
["Endodoncia Moderna",{"$f":"C148+D148","v":8},1,7,{"$f":"F148+G148","v":8},1,7,{"$f":"I148+J148","v":8},1,7]
["Cirugía para el Práctico General",7,3,4,7,3,4,6,1,5]
["Diploma en Filosofía del tratamiento ortodóncico MBT",14,1,13,14,1,13,0,0,0]
[]
["Flores",28,{"$f":"C153+C154","v":4},{"$f":"D153+D154","v":24},28,{"$f":"F153+F154","v":4},{"$f":"G153+G154","v":24},27,{"$f":"I153+I154","v":4},{"$f":"J153+J154","v":23}]
["Idoneo en Farmacia ",17,2,15,17,2,15,16,2,14]
["Asistente en Recursos Humanos ",11,2,9,11,2,9,11,2,9]
[]
["Maldonado",{"$f":"C156+D156","v":51},{"$f":"C157","v":10},{"$f":"D157","v":41},{"$f":"F156+G156","v":51},{"$f":"F157","v":10},{"$f":"G157","v":41},{"$f":"I156+J156","v":32},{"$f":"I157","v":4},{"$f":"J157","v":28}]
["Idoneo en Farmacia ",51,10,41,51,10,41,{"$f":"I157+J157","v":32},4,28]
[]
["Paysandú",49,{"$f":"C160+C161+C162","v":11},{"$f":"D160+D161+D162","v":38},49,{"$f":"F160+F161+F162","v":11},{"$f":"G160+G161+G162","v":38},{"$f":"I159+J159","v":44},{"$f":"I160+I161+I162","v":10},{"$f":"J160+J161+J162","v":34}]
["Habilidades de Coaching y Liderazgo",12,3,9,12,3,9,12,3,9]
["Seguridad e Higiene en el Trabajo",8,5,3,8,5,3,7,5,2]
["Idoneo en Farmacia ",29,3,26,29,3,26,25,2,23]
[]
["Salto",47,{"$f":"C165+C166+C167","v":15},{"$f":"D165+D166+D167","v":32},47,{"$f":"F165+F166+F167","v":15},{"$f":"G165+G166+G167","v":32},42,{"$f":"I165+I166+I167","v":14},{"$f":"J165+J166+J167","v":28}]
["Habilidades de Coaching y Liderazgo",17,7,10,17,7,10,17,7,10]
["Idoneo en Farmacia ",17,3,14,17,3,14,14,3,11]
["Seguridad e Higiene en el Trabajo",13,5,8,13,5,8,11,4,7]
[]
["UNIVERSIDAD DE LA REPÚBLICA",638,{"$f":"SUM(C170:C186)","v":157},{"$f":"SUM(D170:D186)","v":481},638,{"$f":"SUM(F170:F186)","v":157},{"$f":"SUM(G170:G186)","v":481},256,{"$f":"SUM(I170:I186)","v":66},{"$f":"SUM(J170:J186)","v":190}]
["Preuniversitario Canto",21,6,15,21,6,15,0,0,0]
["Preuniversitario Clarinete",4,1,3,4,1,3,1,0,1]
["Preuniversitario Contrabajo",3,1,2,3,1,2,1,1,0]
["Preuniversitario Flauta",3,1,2,3,1,2,0,0,0]
["Preuniversitario Guitarra",13,9,4,13,9,4,2,1,1]
["Preuniversitario Oboe ",1,1,0,1,1,0,0,0,0]
["Preuniversitario Percusión ",4,4,0,4,4,0,1,1,0]
["Preuniversitario Piano",5,4,1,5,4,1,0,0,0]
["Preuniversitario Saxofón ",2,2,0,2,2,0,0,0,0]
["Preuniversitario Trompeta",2,2,0,2,2,0,0,0,0]
["Preuniversitario Violoncello",4,1,3,4,1,3,1,0,1]
["Guardavidas (Montevideo) ",28,23,5,28,23,5,14,9,5]
["Guardavidas (Maldonado)",35,28,7,35,28,7,33,26,7]
["Guardavidas (Rocha)",1,1,0,1,1,0,2,2,0]
["Auxiliar de Enfermería ",228,29,199,228,29,199,87,11,76]
["Auxiliar de Farmacia Hospitalaria",284,44,240,284,44,240,113,15,98]
["Técnico Deportivo",0,0,0,0,0,0,1,0,1]
[]
["IPES",{"$f":"SUM(B189:B227)","v":1845},"s/d","s/d",{"$f":"SUM(E189:E227)","v":1845},"s/d","s/d",{"$f":"SUM(H189:H227)","v":1557},"s/d","s/d"]
["Certificado de Perfeccionamiento de Educación Inicial”",100,"s/d","s/d",100,"s/d","s/d",75,"s/d","s/d"]
["Certificado de Perfeccionamiento de Educación Inicial”",50,"s/d","s/d",50,"s/d","s/d",30,"s/d","s/d"]
["Curso de “Formación en Dirección – Coordinación de Educación Física del CEIP”",120,"s/d","s/d",120,"s/d","s/d",111,"s/d","s/d"]
["Curso-Taller \"Cooperación y Cooperativismo en la Educación Formal\" (CFE-INACOOP)",25,"s/d","s/d",25,"s/d","s/d",8,"s/d","s/d"]
["Curso-Taller  de \"Cooperación y Cooperativismo en la Educación Formal\" en el marco de “Formación de Formadores”(CFE-INACOOP-CETP)",25,"s/d","s/d",25,"s/d","s/d",25,"s/d","s/d"]
["Curso “Formación de tutores en acompañamiento de las Trayectorias Educativas”",160,"s/d","s/d",160,"s/d","s/d",78,"s/d","s/d"]
["“Curso teórico práctico de tutoría para la Gestión educativa”",22,"s/d","s/d",22,"s/d","s/d",22,"s/d","s/d"]
["Curso de “ Desarrollo profesional  para Directores en ejercicio”",200,"s/d","s/d",200,"s/d","s/d",164,"s/d","s/d"]
["Red Global de aprendizajes. ”Nuevos liderazgos: Acompañamiento en gestión del  cambio educativo” CFE-CEIBAL",90,"s/d","s/d",90,"s/d","s/d",90,"s/d","s/d"]
["Red Global de aprendizajes   “Nuevas pedagogías. Sistema vivo de aprendizaje (Aprendizajes en profundidad)CFE-CEIBAL",535,"s/d","s/d",535,"s/d","s/d",535,"s/d","s/d"]
["Proyecto “Tu Clase, Uruguay”. Curso “Atención a la diversidad”.",33,"s/d","s/d",33,"s/d","s/d",33,"s/d","s/d"]
["Proyecto “Tu Clase, Uruguay” Curso “Aprendizaje Basado en Proyectos”",37,"s/d","s/d",37,"s/d","s/d",37,"s/d","s/d"]
["Proyecto “Tu Clase, Uruguay” Curso “Evaluación de aprendizajes”",33,"s/d","s/d",33,"s/d","s/d",33,"s/d","s/d"]
["Proyecto “Tu Clase, Uruguay” Curso “Hacia la integración entre familia e institución educativa”",29,"s/d","s/d",29,"s/d","s/d",29,"s/d","s/d"]
["Curso de “Actualización de los estudios culturales y subalternos a una ciencia Poscolonial”",10,"s/d","s/d",10,"s/d","s/d",10,"s/d","s/d"]
["Curso “Comprensión en Lenguas Extranjeras-Comprensión lectora Italiano”",9,"s/d","s/d",9,"s/d","s/d",9,"s/d","s/d"]
["Curso “Comprensión en Lenguas Extranjeras-Comprensión lectora Inglés Humanidades”",20,"s/d","s/d",20,"s/d","s/d",20,"s/d","s/d"]
["Curso “Comprensión en Lenguas Extranjeras -Comprensión Auditiva Inglés Ciencias”",1,"s/d","s/d",1,"s/d","s/d",1,"s/d","s/d"]
["Curso “Comprensión en Lenguas Extranjeras -Comprensión lectora Alemán”",1,"s/d","s/d",1,"s/d","s/d",1,"s/d","s/d"]
["Curso “Comprensión en Lenguas Extranjeras - Comprensión lectora Inglés Ciencias” ",4,"s/d","s/d",4,"s/d","s/d",4,"s/d","s/d"]
["“Actividades  de  aprendizaje  para  las  clases  de Bioestadística”",3,"s/d","s/d",3,"s/d","s/d",3,"s/d","s/d"]
["“Uso de simuladores  para el estudio de experimentos eléctricos  o  electro-electrotécnicos”",9,"s/d","s/d",9,"s/d","s/d",9,"s/d","s/d"]
["“Profundización en la Didáctica de la Matemática en el Nivel Primario: dificultades en el aprendizaje de las fracciones”",20,"s/d","s/d",20,"s/d","s/d",20,"s/d","s/d"]
["“Propuesta didáctica para la formación de profesores: vivir y dejar vivir la modelización matemática en el aula”",20,"s/d","s/d",20,"s/d","s/d",1,"s/d","s/d"]
["“Los Simpson y la Matemática”",14,"s/d","s/d",14,"s/d","s/d",14,"s/d","s/d"]
["Curso de Especialización “Adolescencias y construcciones subjetivas desde la perspectiva  audiovisual. Un abordaje  interdisciplinario”",20,"s/d","s/d",20,"s/d","s/d",20,"s/d","s/d"]
["Curso- taller: “Actualización en Evaluación en ciencias”",21,"s/d","s/d",21,"s/d","s/d",21,"s/d","s/d"]
["Curso de “Actualización ¿Qué es cocinar para un químico?”",20,"s/d","s/d",20,"s/d","s/d",20,"s/d","s/d"]
["Curso –taller:“Actualización en radiactividad y sus aplicaciones”",12,"s/d","s/d",12,"s/d","s/d",12,"s/d","s/d"]
["Curso –taller:” Recursos educativos: De recursos didácticos a fuentes de información”",21,"s/d","s/d",21,"s/d","s/d",21,"s/d","s/d"]
["Curso de Actualización “Sociología del Uruguay y la región”",20,"s/d","s/d",20,"s/d","s/d",20,"s/d","s/d"]
["Curso “Comprender el Islam y los  Musulmanes  hoy.  Transformaciones  políticas,  sociales  y  proyecciones  geopolíticas  en Medio Oriente y el Magreb”",42,"s/d","s/d",42,"s/d","s/d",42,"s/d","s/d"]
["Curso “Actualización en Nanotecnología”",12,"s/d","s/d",12,"s/d","s/d",12,"s/d","s/d"]
["Curso de Actualización “Un enfoque interdisciplinario y transdisciplinario en lenguajes artístico” ",12,"s/d","s/d",12,"s/d","s/d",12,"s/d","s/d"]
["Curso “Óptica – teoría y construcción de un telescopio” (Coordinador Nacional de Física)",15,"s/d","s/d",15,"s/d","s/d",15,"s/d","s/d"]
["Curso “Construcción de Instrumentos Musicales”(Coordinador Nacional de Física)",20,"s/d","s/d",20,"s/d","s/d",0,"s/d","s/d"]
["Curso “Física. Música y Matemática”(Coordinador Nacional de Física)",20,"s/d","s/d",20,"s/d","s/d",0,"s/d","s/d"]
["Curso “Física de los teléfonos inteligentes”(Coordinador Nacional de Física)",20,"s/d","s/d",20,"s/d","s/d",0,"s/d","s/d"]
["Curso de “Física de las Descargas Atmosféricas”(Coordinador Nacional de Física)",20,"s/d","s/d",20,"s/d","s/d",0,"s/d","s/d"]
[]
["Instituto Metodista Universitario Crandon",{"$f":"C229+D229","v":23},{"$f":"C230+C231","v":1},{"$f":"D230+D231","v":22},{"$f":"F229+G229","v":51},{"$f":"F230+F231","v":1},{"$f":"G230+G231","v":50},{"$f":"I229+J229","v":0},{"$f":"I230+I231","v":0},{"$f":"J230+J231","v":0}]
["Secretariado Ejecutivo",19,0,19,42,0,42,0,0,0]
["Asistente Ejecutivo",4,1,3,9,1,8,0,0,0]
[]
["Instituto Universitario Asociación Cristiana de Jóvenes",358,{"$f":"SUM(C234:C251)","v":324},{"$f":"SUM(D234:D251)","v":34},399,{"$f":"SUM(F234:F251)","v":344},{"$f":"SUM(G234:G251)","v":55},121,{"$f":"SUM(I234:I251)","v":110},{"$f":"SUM(J234:J251)","v":11}]
["Instructorado en Fitness con orientación en Modalidades de Gimansia y/o Entrenamiento Personalizado",8,6,2,16,12,4,1,0,1]
["Curso Técnico de Atletismo",3,2,1,3,2,1,0]
["Curso Técnico Deportivo de Basketball",4,4,0,9,8,1,1,1]
["Curso Técnico Deportivo de Gimnasia Artistica",9,1,8,18,1,17,3,0,3]
["Curso Técnico Deportivo de Handball",0,null,null,6,4,2,1,0,1]
["Curso Técnico Deportivo de Hockey s/césped",2,0,2,2,0,2,0]
["Curso Técnico Deportivo de Natación",22,12,10,35,18,17,7,2,5]
["Licencia C Monitor de Fútbol Base",108,101,7,108,101,7,58,58,0]
["Licencia B Entrenador de Fútbol Amateur",99,98,1,99,98,1,28,27,1]
["Licencia A Entrenador de Fútbol de Divisiones Juveniles",65,65,0,65,65,0,18,18,0]
["Licencia PRO Entrenador de Fútbol Profesional",12,12,0,12,12,0,4,4,0]
["Instructorado en Fitness con orientación en Modalidades de Gimansia y/o Entrenamiento Personalizado",2,2,0,2,2,0,0,0,0]
["Curso Técnico Deportivo de Gimnasia Artistica",2,0,2,2,0,2,0,0,0]
["Curso Técnico Deportivo de Hockey s/césped",1,0,1,1,0,1,0,0,0]
["Curso Técnico de Karate",4,4,0,4,4,0,0,0,0]
["Curso Técnico en Levantamiento de Pesas",4,4,0,4,4,0,0,0,0]
["Curso Técnico Deportivo de Natación",2,2,0,2,2,0,0,0,0]
["Licencia C Monitor de Fútbol Base",11,11,0,11,11,0,0,0,0]
[]
["CENTRO DE ALTOS ESTUDIOS NACIONALES (CALEN)",436,{"$f":"SUM(C254:C265)","v":255},{"$f":"SUM(D254:D265)","v":181},436,{"$f":"SUM(F254:F265)","v":255},{"$f":"SUM(G254:G265)","v":181},291,{"$f":"SUM(I254:I265)","v":177},{"$f":"SUM(J254:J265)","v":114}]
["Política y Estrategia",42,20,22,42,20,22,20,10,10]
["Análisis de la Información Estratégica",37,20,17,37,20,17,20,10,10]
["Ciberseguridad",47,32,15,47,32,15,30,22,8]
["Seguridad y Defensa",47,32,15,47,32,15,35,28,7]
["Género en Temas de Defensa Nacional",41,11,30,41,11,30,28,6,22]
["Prospectiva aplicada a la Defensa Nacional",34,20,14,34,20,14,15,9,6]
["Geopolítica y Geoestrategia del Uruguay",33,23,10,33,23,10,21,11,10]
["Metodología de la Investigación",26,11,15,26,11,15,17,8,9]
["Met. De la Invest. Diseño de Encuestas",16,7,9,16,7,9,9,4,5]
["Aproximación al Terrorismo fenómeno afecta Seg. Inter.",45,25,20,45,25,20,30,17,13]
["Actualización Derecho Administrativo",16,5,11,16,5,11,14,3,11]
["Políticas de Defensa (virtual)",52,49,3,52,49,3,52,49,3]
[]
[]
["Fuente: Oficinas Productoras de cada una de las Instituciones. "]

{"sheet":"II-8.2.1 ","index":106,"n_rows":92,"n_cols":8,"rows_kept":92,"cut":false,"hidden":false,"merged":[[91,0,91,6],[0,4,1,5],[4,0,4,8],[5,0,8,0],[5,1,8,1],[5,2,5,5],[5,6,7,7],[6,2,6,3],[6,4,6,5],[7,2,7,5]]}
["MEC - DIRECCIÓN DE EDUCACIÓN",null,null,null,"PERSONAL DOCENTE"]
["ÁREA DE EDUCACIÓN NO FORMAL"]
[]
["Cuadro Nº II-8.2.1"]
["PERSONAL DOCENTE DE CECAP,TITULADO Y NO TITULADO, POR SEXO, REGIÓN Y DEPARTAMENTO SEGÚN CARGA HORARIA SEMANAL. AÑO 2016."]
["Dedicación","TOTAL DOCENTES","DOCENTES",null,null,null,"PERSONAL NO DOCENTE"]
[null,null,"TITULADOS",null,"NO TITULADOS"]
[null,null,"SEXO"]
[null,null,"M","F","M","F","M","F"]
["TOTAL",{"$f":"SUM(C10:F10)","v":295},{"$f":"+C12+C22","v":36},{"$f":"+D12+D22","v":126},61,72,5,13]
[]
["MONTEVIDEO",{"$f":"SUM(C12:F12)","v":76},{"$f":"C13+C17","v":15},{"$f":"D13+D17","v":35},10,16,3,4]
["Montevideo",{"$f":"SUM(C13:F13)","v":61},{"$f":"C14+C15+C16","v":12},{"$f":"D14+D15+D16","v":33},5,11,3,4]
["Hasta 19 hs semanales",{"$f":"SUM(C14:F14)","v":4},1,2,1,0,0,0]
["De 20 hs a 39 hs semanales",55,10,31,3,11,3,4]
["De 40 hs y más semanales",2,1,0,1,0,0,0]
["Montevideo Oeste",15,{"$f":"C18+C19+C20","v":3},{"$f":"D18+D19+D20","v":2},5,5,0,0]
["Hasta 19 hs semanales",10,2,2,4,2,0,0]
["De 20 hs a 39 hs semanales",5,1,0,1,3,0,0]
["De 40 hs y más semanales",0,0,0,0,0,0,0]
[]
["RESTO DEL PAÍS",{"$f":"SUM(C22:F22)","v":219},{"$f":"SUM(C23:C25)","v":21},{"$f":"SUM(D23:D25)","v":91},{"$f":"SUM(E23:E25)","v":51},{"$f":"SUM(F23:F25)","v":56},{"$f":"SUM(G23:G25)","v":2},9]
["Hasta 19 hs semanales",{"$f":"SUM(C23:F23)","v":124},{"$f":"C27+C32+C36+C40+C44+C48+C52+C56+C60+C64+C68+C72+C76+C80+C84+C88","v":11},{"$f":"D27+D32+D36+D40+D44+D48+D52+D56+D60+D64+D68+D72+D76+D80+D84+D88","v":35},36,42,0,1]
["De 20 hs a 39 hs semanales",{"$f":"SUM(C24:F24)","v":94},{"$f":"C28+C33+C37+C41+C45+C49+C53+C57+C61+C65+C69+C73+C77+C81+C85+C89","v":10},55,15,14,2,8]
["De 40 hs y más semanales",1,{"$f":"C29+C34+C38+C42+C46+C50+C54+C58+C62+C66+C70+C74+C78+C82+C86+C90","v":0},1,0,0,0,0]
["Artigas",16,{"$f":"SUM(C27:C29)","v":1},8,3,4,0,0]
["Hasta 19 hs semanales",10,0,3,3,4,0,0]
["De 20 hs a 39 hs semanales",6,1,5,0,0,0,0]
["De 40 hs y más semanales",0,0,0,0,0,0,0]
["Canelones",{"$f":"SUM(C30:F30)","v":61},{"$f":"+C31+C35+C39+C43+C47","v":5},{"$f":"+D31+D35+D39+D43+D47","v":22},{"$f":"+E31+E35+E39+E43+E47","v":16},18,0,0]
["  Barros Blancos",12,{"$f":"SUM(C32:C34)","v":4},3,2,3,0,0]
["Hasta 19 hs semanales",8,2,1,2,3,0,0]
["De 20 hs a 39 hs semanales",4,2,2,0,0,0,0]
["De 40 hs y más semanales",0,0,0,0,0,0,0]
["  La Paz",11,{"$f":"SUM(C36:C38)","v":1},{"$f":"SUM(D36:D38)","v":7},{"$f":"SUM(E36:E38)","v":1},{"$f":"SUM(F36:F38)","v":2},{"$f":"SUM(G36:G38)","v":0},0]
["Hasta 19 hs semanales",4,0,3,1,0,0,0]
["De 20 hs a 39 hs semanales",7,1,4,0,2,0,0]
["De 40 hs y más semanales",0,0,0,0,0,0,0]
["  Las Piedras",14,0,5,5,4,0,0]
["Hasta 19 hs semanales",8,0,2,2,4,0,0]
["De 20 hs a 39 hs semanales",4,0,4,0,0,0,0]
["De 40 hs y más semanales",0,0,0,0,0,0,0]
["Paso Carrasco",{"$f":"SUM(C43:F43)","v":11},{"$f":"SUM(C44:C46)","v":0},{"$f":"SUM(D44:D46)","v":3},{"$f":"SUM(E44:E46)","v":4},{"$f":"SUM(F44:F46)","v":4},{"$f":"SUM(G44:G46)","v":0},0]
["Hasta 19 hs semanales",7,0,1,2,4,0,0]
["De 20 hs a 39 hs semanales",4,0,2,2,0,0,0]
["De 40 hs y más semanales",{"$f":"SUM(C46:F46)","v":0},0,0,0,0,0,0]
["  Toledo",13,{"$f":"SUM(C48:C50)","v":0},{"$f":"SUM(D48:D50)","v":4},{"$f":"SUM(E48:E50)","v":4},{"$f":"SUM(F48:F50)","v":5},{"$f":"SUM(G48:G50)","v":0},0]
["Hasta 19 hs semanales",9,0,2,3,4,0,0]
["De 20 hs a 39 hs semanales",4,0,2,1,1,0,0]
["De 40 hs y más semanales",0,0,0,0,0,0,0]
["Colonia ",{"$f":"SUM(C51:F51)","v":11},{"$f":"SUM(C52:C54)","v":3},{"$f":"SUM(D52:D54)","v":6},{"$f":"SUM(E52:E54)","v":1},{"$f":"SUM(F52:F54)","v":1},{"$f":"SUM(G52:G54)","v":0},0]
["Hasta 19 hs semanales",{"$f":"SUM(C52:F52)","v":5},1,2,1,1,0,0]
["De 20 hs a 39 hs semanales",6,2,4,0,0,0,0]
["De 40 hs y más semanales",0,0,0,0,0,0,0]
["Durazno",9,{"$f":"SUM(C56:C58)","v":2},3,3,1,0,0]
["Hasta 19 hs semanales",6,2,0,3,1,0,0]
["De 20 hs a 39 hs semanales",3,0,3,0,0,0,0]
["De 40 hs y más semanales",0,0,0,0,0,0,0]
["Florida",15,{"$f":"SUM(C60:C62)","v":0},{"$f":"SUM(D60:D62)","v":11},{"$f":"SUM(E60:E62)","v":3},{"$f":"SUM(F60:F62)","v":1},{"$f":"SUM(G60:G62)","v":0},0]
["Hasta 19 hs semanales",{"$f":"SUM(C60:F60)","v":10},0,6,3,1,0,0]
["De 20 hs a 39 hs semanales",5,0,5,0,0,0,0]
["De 40 hs y más semanales",0,0,0,0,0,0,0]
["Maldonado",10,{"$f":"C64+C65+C66","v":1},{"$f":"D64+D65+D66","v":2},{"$f":"E64+E65+E66","v":4},3,0,0]
["Hasta 19 hs semanales",10,1,2,4,3,0,0]
["De 20 hs a 39 hs semanales",0,0,0,0,0,0,0]
["De 40 hs y más semanales",0,0,0,0,0,0,0]
["Paysandú",13,{"$f":"SUM(C68:C70)","v":0},{"$f":"SUM(D68:D70)","v":3},{"$f":"SUM(E68:E70)","v":6},{"$f":"SUM(F68:F70)","v":4},0,1]
["Hasta 19 hs semanales",9,0,2,4,3,0,1]
["De 20 hs a 39 hs semanales",4,0,1,2,1,0,0]
["De 40 hs y más semanales",0,0,0,0,0,0,0]
["Río Negro (Fray Bentos)",{"$f":"SUM(C71:F71)","v":9},{"$f":"SUM(C72:C74)","v":2},{"$f":"SUM(D72:D74)","v":3},{"$f":"SUM(E72:E74)","v":1},{"$f":"SUM(F72:F74)","v":3},0,1]
["Hasta 19 hs semanales",6,1,2,0,3,0,0]
["De 20 hs a 39 hs semanales",3,1,1,1,0,0,0]
["De 40 hs y más semanales",0,0,0,0,0,0,0]
["Río Negro (Young)",12,{"$f":"SUM(C76:C78)","v":0},{"$f":"SUM(D76:D78)","v":5},{"$f":"SUM(E76:E78)","v":1},{"$f":"SUM(F76:F78)","v":6},{"$f":"SUM(G76:G78)","v":0},1]
["Hasta 19 hs semanales",5,0,1,1,3,0,0]
["De 20 hs a 39 hs semanales",7,0,4,0,3,0,1]
["De 40 hs y más semanales",0,0,0,0,0,0,0]
["Rivera",27,{"$f":"SUM(C80:C82)","v":2},{"$f":"SUM(D80:D82)","v":9},{"$f":"SUM(E80:E82)","v":9},{"$f":"SUM(F80:F82)","v":7},{"$f":"SUM(G80:G82)","v":2},6]
["Hasta 19 hs semanales",2,0,0,1,1,0,0]
["De 20 hs a 39 hs semanales",25,2,9,8,6,2,6]
["De 40 hs y más semanales",0,0,0,0,0,0,0]
["Salto",19,{"$f":"SUM(C84:C86)","v":5},{"$f":"SUM(D84:D86)","v":10},{"$f":"SUM(E84:E86)","v":1},{"$f":"SUM(F84:F86)","v":3},{"$f":"SUM(G84:G86)","v":0},1]
["Hasta 19 hs semanales",12,4,5,0,3,0,0]
["De 20 hs a 39 hs semanales",7,1,5,1,0,0,1]
["De 40 hs y más semanales",0,0,0,0,0,0,0]
["Treinta y Tres",19,{"$f":"SUM(C88:C90)","v":0},{"$f":"SUM(D88:D90)","v":8},{"$f":"SUM(E88:E90)","v":6},{"$f":"SUM(F88:F90)","v":5},{"$f":"SUM(G88:G90)","v":0},0]
["Hasta 19 hs semanales",13,0,3,6,4,0,0]
["De 20 hs a 39 hs semanales",5,0,4,0,1,0,0]
["De 40 hs y más semanales",1,0,1,0,0,0,0]
[]
["Fuente: Procesamiento propio en base a datos proporcionados por el  Área de Educación No Formal, Dirección de Educación, MEC."]

{"sheet":"ll-8.2.2","index":107,"n_rows":30,"n_cols":4,"rows_kept":30,"cut":false,"hidden":false,"merged":[[5,0,6,0],[5,1,6,1],[3,0,3,3],[5,2,5,3],[0,1,0,3],[1,0,1,2]]}
["ANEP","PERSONAL DOCENTE",null,"PRUEBAS DE ACREDITACIÓN"]
["CODICEN – DIRECCIÓN SECTORIAL DE EDUCACIÓN DE ADULTOS"]
["Cuadro Nº II-8.2.2"]
["DOCENTES POR SEXO SEGÚN GRANDES ÁREAS Y DEPARTAMENTO. AÑO 2016*."]
[]
["GRANDES ÁREAS Y DEPARTAMENTOS",null,"DOCENTES"]
[null,null,"M","F"]
["TOTAL",{"$f":"+B9+B10","v":433},{"$f":"+C9+C10","v":91},342]
["MONTEVIDEO",{"$f":"C9+D9","v":261},59,202]
["RESTO DEL PAÍS",{"$f":"C10+D10","v":172},32,140]
["Artigas",{"$f":"C11+D11","v":5},0,5]
["Canelones",46,7,39]
["Cerro Largo",7,1,6]
["Colonia",8,0,8]
["Durazno",4,0,4]
["Flores",1,0,1]
["Florida",3,0,3]
["Lavalleja",7,2,5]
["Maldonado",9,4,5]
["Paysandú",12,2,10]
["Río Negro",5,1,4]
["Rivera",14,4,10]
["Rocha",3,1,2]
["Salto",13,4,9]
["San José",9,2,7]
["Soriano",12,2,10]
["Tacuarembó",13,2,11]
["Treinta y Tres",1,0,1]
["Fuente: ANEP - CODICEN - Dirección Sectorial de Educación de Adultos"]
["Nota : * los datos corresponden al año 2013. Últimos datos disponibles."]

{"sheet":"II-8.3.1  ","index":108,"n_rows":24,"n_cols":12,"rows_kept":24,"cut":false,"hidden":false,"merged":[[0,4,1,11],[6,0,6,11],[7,0,10,0],[7,1,8,2],[7,3,10,3],[7,4,8,5],[7,6,8,11],[9,1,10,1],[9,2,10,2],[9,4,9,5],[9,6,10,6],[9,7,9,8],[9,9,10,9],[9,10,9,11],[0,0,0,2]]}
["CONSEJO DE CAPACITACIÓN PROFESIONAL (COCAP)",null,null,null,"CURSOS, ALUMNOS MATRICULADOS Y RECURSOS HUMANOS"]
[]
[]
[]
["Cuadro Nº II-8.3.1"]
[]
["CANTIDAD DE CURSOS, DE HORAS Y DE ALUMNOS MATRICULADOS SEGÚN TIPO DE CURSO Y ÁREA DE FORMACIÓN COCAP. AÑO 2016."]
["TIPO DE CURSO Y ÁREA DE FORMACIÓN","CURSOS",null,"TOTAL","ALUMNOS MATRICULADOS",null,"RECURSOS HUMANOS"]
[]
[null,"CANTIDAD","HORAS",null,"SEXO",null,"TOTAL","DOCENTES",null,"TOTAL","FUNCIONARIOS"]
[null,null,null,null,"M","F",null,"M","F",null,"M","F"]
["TOTAL",{"$f":"B13+B18","v":152},{"$f":"SUM(C13+C18)","v":16933},{"$f":"E12+F12","v":1617},{"$f":"E13+E18","v":1391},{"$f":"F13+F18","v":226},{"$f":"H12+I12","v":41},{"$f":"H13+H18","v":36},{"$f":"I13+I18","v":5},{"$f":"K12+L12","v":22},{"$f":"K13+K18","v":8},{"$f":"L13+L18","v":14}]
["   Cursos Abiertos",{"$f":"SUM(B14:B17)","v":143},{"$f":"SUM(C14:C17)","v":16315},{"$f":"E13+F13","v":1510},{"$f":"SUM(E14:E17)","v":1294},{"$f":"SUM(F14:F17)","v":216},{"$f":"H13+I13","v":37},{"$f":"SUM(H14:H17)","v":32},{"$f":"SUM(I14:I17)","v":5},{"$f":"K13+L13","v":22},{"$f":"SUM(K14:K17)","v":8},{"$f":"SUM(L14:L17)","v":14}]
["    Industrial",119,14452,1193,1157,36,{"$f":"H14+I14","v":33},32,1,22,8,14]
["    Hotelería / Gastronomía",0,0,0,0,0,4,0,4,0,0,0]
["    Administración y Servicios",24,1863,317,137,180,0,0,0,0,0,0]
["    Agropecuario",0,0,0,0,0,0,0,0,0,0,0]
["   Cursos Cerrados",{"$f":"SUM(B19:B22)","v":9},{"$f":"SUM(C19:C22)","v":618},107,{"$f":"SUM(E19:E22)","v":97},{"$f":"SUM(F19:F22)","v":10},4,{"$f":"SUM(H19:H22)","v":4},{"$f":"SUM(I19:I22)","v":0},0,{"$f":"SUM(K19:K22)","v":0},{"$f":"SUM(L19:L22)","v":0}]
["    Industrial",6,462,107,97,10,2,2,0,0,0,0]
["    Hotelería / Gastronomía",0,0,0,0,0,2,2,0,0,0,0]
["    Administración y Servicios",3,156,0,0,0,0,0,0,0,0,0]
["    Agropecuario",0,0,0,0,0,0,0,0,0,null,0]
[]
["Fuente: COCAP"]

{"sheet":"II-8.4.1 ","index":109,"n_rows":245,"n_cols":9,"rows_kept":245,"cut":false,"hidden":false,"merged":[[1,1,2,8],[4,0,4,6],[5,0,7,0],[5,1,7,1],[5,2,5,3],[5,4,7,4],[5,5,5,6],[6,2,6,3],[6,5,6,6]]}
["MEC"]
["Área de Investigación y Estadística","CENSO EDUCACIÓN TÉCNICA Y TECNOLÓGICA"]
[]
["Cuadro  II- 8.4.1"]
["MATRÍCULA Y PERSONAL DOCENTE DEL RELEVAMIENTO DE INSTITUCIONES DE FORMACIÓN TÉCNICO-PROFESIONAL POR SEXO SEGÚN TIPO DE INSTITUCIÓN, ÁREAS DE CONOCIMIENTO E INSTITUCIONES. AÑO 2016."]
["TIPO DE INSTITUCIÓN /  INSTITUCIONES","TOTAL","MATRÍCULA",null,"TOTAL","DOCENTES"]
[null,null,"SEXO",null,null,"SEXO"]
[null,null,"M","F",null,"M","F"]
["TOTAL PÚBLICO Y PRIVADA",93423,{"$f":"C10+C21","v":40852},{"$f":"D10+D21","v":52571},{"$f":"E10+E21","v":4575},2131,2444]
["PÚBLICO TOTAL",{"$f":"SUM( B11:B20)","v":4324},3172,1152,{"$f":"SUM(E11:E20)","v":890},{"$f":"SUM(F11:F20)","v":685},205]
["ARMADA NACIONAL",{"$f":"C11+D11","v":369},294,75,{"$f":"F11+G11","v":85},78,7]
["CENTRO DE INSTRUCCIÓN DE LA ARMADA",{"$f":"C12+D12","v":1382.9999999999995},1142.9999999999995,240,{"$f":"F12+G12","v":67},62,5]
["ECEMA",107,97,10,126,112,14]
["ESBUC",54,53,1,46,42,4]
["ESCUELA DE AVIACIÓN DE NAVAL",28,21,7,45,42,3,null," "]
["ESCUELA DE FUSILEROS NAVALES",947.00000000000034,938.00000000000034,8.9999999999999964,133,131,2]
["ESCUELA DE SANIDAD DE LAS FUERZAS ARMADAS",901.00000000000011,241,660.00000000000011,205,80,125]
["ESCUELA NAVAL",112,79,33,36,21,15]
["ESCUELA TÉCNICA DE AERONÁUTICA",215,168,47,88,72,16]
["INSTITUTO DE ADIESTRAMIENTO AERONÁUTICO",208,138,70,59,45,14]
["PRIVADO TOTAL",{"$f":"SUM(B22:B242)","v":89099},{"$f":"SUM(C22:C242)","v":37680},51419,{"$f":"SUM(E22:E242)","v":3685},{"$f":"SUM(F22:F242)","v":1446},2239]
["4 D Content English",{"$f":"C22+D22","v":9621},5504,4116.9999999999991,{"$f":"F22+G22","v":34},11,23]
["A + Escuela de Artes",{"$f":"C23+D23","v":256.00000000000006},185.00000000000003,71.000000000000014,{"$f":"F23+G23","v":16},13,3]
["Academia Alfa",201,77.000000000000014,124,18,8,10]
["Academia Mario Rodríguez Contabilidades SCI",43,13.999999999999998,29.000000000000004,3,0,3]
["Acción Promocional \"18 de Julio\"",1034,517,517,28,15,13]
["ACRIDU - Acción Coordinadora y Reivindicadora del Impedido del Uruguay",29,12,17,10,3,7]
["AGOSTINO ASCIONE SILVIA CATALINA - Instituto de Idiomas IETI Pinar",278.99999999999994,138.99999999999994,140,5,0,5]
["AILOMA",153,104,49.000000000000014,22,10,12]
["Aliança Brasileira",131,43,88,7,1,6]
["Alianza Colonia del Sacramento",732.00000000000011,332.00000000000011,400,28,2,26]
["ALIANZA CULTURAL SAN RAMON",170,72,98.000000000000014,5,0,5]
["ALIANZA CULTURAL URUGUAY ESTADOS UNIDOS",1074,224.99999999999997,849,38,7,31]
["ALIANZA DURAZNO",103,43,60,3,0,3]
["Alianza Fray Bentos",183,70,113,6,1,5]
["Alianza Melo",275.99999999999994,106.99999999999999,168.99999999999994,6,0,6]
["Alianza Minas",181,58,123,3,0,3]
["Alianza Pando",177,87,90,6,0,6]
["Alianza Rivera",104,33,71,3,1,2]
["Alliance Française de Montevideo",536,243,293,17,5,12]
["Alpha Piscina",250,100,150,17,9,8]
["American Language Institute",117,44,73,5,0,5]
["Ametrano & Asociados",140,89,51,14,7,7]
["ANGLO ALBO",186,69,117.00000000000001,14,0,14]
["ANGLO CERRO",167,76,91,8,1,7]
["ANGLO COLÓN",60,23.999999999999996,36,4,1,3]
["Anglo Durazno",386,185,201,11,1,10]
["ANGLO LA BLANQUEADA SRL",220,107,113,13,2,11]
["Anglo La Teja",169,71.000000000000014,98,12,2,10]
["Anglo Maldonado",340.00000000000006,142,198.00000000000006,30,0,30]
["Aquelarre Escuela de Fotografía Limitada",173,64,109,8,4,4]
["ARCUBA SRL",96,15,81,12,0,12]
["Arte y Ciencia",182,26,156,11,1,10]
["AS.CI.PRO.UNI 3 Melo Cerro Largo",716,14.000000000000004,702,0,0,0]
["Asociación Civil Casa Lunas",49,15,34,18,2,16]
["Asociación Civil Gurises Unidos",20,5,15,3,1,2]
["Asociación Cristiana de Jóvenes de San José",51,27,24,10,4,6]
["ASOCIACION CULTURAL Y TECNICA CADI",63,0,63,20,9,11]
["ASOCIACIÓN DE QUÍMICA Y FARMACIA DEL URUGUAY (AQFU)",151,81,70,7,2,5]
["Asociación Uruguaya de Artesanos",65,12,53,12,4,8]
["Asociación Uruguaya de Barmen",91,60,31,10,9,1]
["Asociación Uruguaya de Ceremonial y Protocolo AUCYP",88,15,73,17,8,9]
["aucyp",62,11,51,17,8,9]
["AVANZA ESCUELA DE ENFEMERÍA",132.00000000000003,18.999999999999996,113.00000000000003,12,0,12]
["BAKER STREET INSTITUTE - Fabián Roberto Parada Ibáñez y Laura Susana Cajiga Rapalini",86,36,50.000000000000007,4,1,3]
["Bécassine S.R.L.",30,5,25,2,0,2]
["Bentancor Perez Noemi y Sotés Castro Marcelo Gabriel    (INSTITUTO P.I.E.M.C.E.)",1544.0000000000005,662,882.00000000000034,29,7,22]
["Bios",7871.0000000000009,3728.9999999999991,4142.0000000000018,337,189,148]
["BIZZOZERO GISELDA - MONTALDO PABLO SDH - COLEGIO DE COCINERO MONTEVIDEO (COLEGIO GATO DUMAS)",576,276,299.99999999999994,33,19,14]
["Blive",125.99999999999999,63.999999999999986,62,33,19,14]
["BRASIL CLUB S.R.L. - Club de Portugués",335,160,175,5,2,3]
["Britannia Centre",280,129,151,11,0,11]
["BUSINESS ENGLISH INC",159,63,95.999999999999986,20,6,14]
["Casa Ambiental de Castillos",232,103,129,13,3,10]
["Casa de la Mujer de la Union",416,116,300,33,14,19]
["Castro Castro Luis Eduardo",47,15,32,5,1,4]
["CCU",81,61,20,16,11,5]
["CEAS Centro Educativo en el Área de la Salud",99,6,93,10,1,9]
["CECATCS",120,23,97,8,0,8]
["CENAFO Salud",104,28,76,14,2,12]
["Centro Cultural Anglo-Uruguayo Pando",103,39,64,3,0,3]
["CENTRO CULTUTAL ANGLO URUGUAYO - ARTIGAS",145,55.999999999999993,89,8,2,6]
["CENTRO DE CAPACITACIÓN PARA LA SALUD",299,30,269,29,6,23]
["Centro de Capacitación Serrano",409.99999999999994,105.99999999999999,303.99999999999994,10,5,5]
["Centro de Enseñanza de Español La Herradura",200,200,0,6,4,2]
["Centro de Entrenamiento Kalya",58,37,21,2,1,1]
["CENTRO DE ESTUDIOS AMADEUS",{"$f":"C87+D87","v":56},28,28,{"$f":"F87+G87","v":3},2,1]
["Centro Educativo Los Pinos",147,147,0,24,19,5]
["CENTRO INTEGRAL DE ENFERMERIA RIVERA            CIER",46,9,37,8,3,5]
["CENTRO INTEGRAL DE FORMACION DE ENFERMERIA",71,11,60,6,2,4]
["Centro Integral Iguazu",35,18,17,7,0,7]
["CFORMA",209,58,151,2,2,0]
["Chiquilladas Durazno Srl",211,113,98,39,1,38]
["CIEDUR",4498,697,3801.0000000000005,0,0,0]
["CINEMATECA URUGUAYA",159,78,81,39,26,13]
["Círculo informático Parque Batlle",548,217.99999999999997,330,15,12,3]
["Damas Salesianas",0,0,0,0,0,0]
["DEL PLATA CENTRO DE FORMACIÓN PROFESIONAL",56,0,56,27,3,24]
["Dickens",863,398,465,90,17,73]
["DR. EDUARDO BLANCO ACEVEDO",246,51,195,18,2,16]
["E.A.D.E.S s.r.l",105,15,90,21,1,20]
["EMI educa",180,88,92.000000000000014,5,1,4]
["Emily Dickinson",278,110.99999999999997,167,8,1,7]
["EMM ESCUELA DE MUSICA MONTEVIDEO",603,367,236,17,10,7]
["Empire English Center",77,36,41,5,1,4]
["ENEDUR",100,12,88,10,0,10]
["ESCUALAS IADE",269,269,0,6,6,0]
["ESCUELA  MONTEVIDEO",281,41,240,15,1,14]
["ESCUELA ACTUACION INTEGRAL",241,101,140,24,12,12]
["Escuela Centro - Sur",75,42,33,17,1,16]
["Escuela Colon",510,72,438,10,0,10]
["Escuela de Comedia Musical",678.00000000000011,58.000000000000007,620.00000000000011,31,10,21]
["Escuela de Enfermeria  Rivera",179,39,140,5,2,3]
["ESCUELA DE ENFERMERIA ANTARES",1028,183,845,26,3,23]
["Escuela de Enfermería Asistencial Médica Departamental de Maldonado",30,5,25,7,1,6]
["Escuela de Enfermeria Humanizar",75,14,61,12,0,12]
["ESCUELA DE ENFERMERIA IDECAS",568,115,453,19,5,14]
["ESCUELA DE ENFERMERIA INTEGRACION",34,4,30,10,2,8]
["Escuela de Enfermería Lavalleja",104,6,98,4,0,4]
["Escuela de Enfermería PROSALUD Florida",228,35,193,19,2,17]
["ESCUELA DE FORMACION PROFESIONAL EN COMERCIO EXTERIOR Y ADUANA",257,141,116,58,34,24]
["Escuela Francesa de Negocios",100.99999999999999,51.999999999999993,48.999999999999993,16,8,8]
["Escuela Matriz De Enfermería SRL",161,42,119,10,4,6]
["Escuela Miff",169,92,77,7,3,4]
["Escuela Nacional de Enfermeria de Treinta y Tres - Desentralización Educativa Uruguay S.R.L",234,28,206,13,0,13]
["Escuela Nacional de Enfermería Río Negro",118,15,103,10,2,8]
["ESCUELA NACIONAL DE ENFERMERIA SRL",322,42,280,17,0,17]
["Escuela Nacional de Operaciones de Paz del Uruguay",410,337,73,100,72,28]
["Escuela Paysandú de Auxiliares de Enfermería",98,34,64,9,1,8]
["Escuelas de Capacitación S.R.L",721,46,675,24,0,24]
["Essential English Institute SRL",262,108,154,4,0,4]
["EUFÓRIA ACADEMIA DE DANZA",57,4,53,1,0,1]
["Eureka- The Learning Center - Jonathan Miles Prentice Coe",179,71,108,25,15,10]
["EXECUTIVE URUGUAY",370,172,198,7,0,7]
["FCI",31,20,11,4,4,0]
["FEC",154,75,79,4,4,0]
["FEDU",1446,821,625,4,1,3]
["FINITUR S.A. - ESCUELA DE NEGOCIOS INTERNACIONALES",385,192,193,51,24,27]
["Fondation Forge",690.99999999999989,253.00000000000003,437.99999999999989,20,8,12]
["Foto Club Uruguayo",421.99999999999994,151,270.99999999999994,17,13,4]
["FUNDACIÒN CENTRO DE EDUCACIÒN POPULAR",50,0,50,8,2,6]
["Fundación de Integración Socio Educativa",476.00000000000011,138.00000000000003,338.00000000000006,16,7,9]
["Fundación Pablo de Tarso - Obra Ecuménica Barrio Borro",166,84,82,22,8,14]
["Fundación ProMúsica",105,43,62,11,6,5]
["FUNDACIÓN ZONAMERICA",415.99999999999989,195.99999999999994,219.99999999999994,1,1,0]
["FUNDASOL",4965,2640,2325.0000000000005,30,16,14]
["Gabriela Rodriguez Vero",57,24.999999999999996,32,2,0,2]
["Garbo Imagen",202,11,191,7,0,7]
["Goethe-Institut Uruguay",1076,545,531,11,3,8]
["GRAMEEN URUGUAY",89,52.000000000000007,37,8,5,3]
["Green Park Center",{"$f":"C151+D151","v":100},43,57,{"$f":"F151+G151","v":2},0,2]
["GREENWICH INSTITUTE",198,83.999999999999986,114,13,4,9]
["Gustavo Antonio Perdomo Perez",48,22,26,2,1,1]
["Gustavo Volpe",0,0,0,13,5,8]
["HEROL SRL",186.00000000000003,54,132.00000000000003,15,6,9]
["High Flyers Institute / María Eugenia Acosta",81.999999999999986,32.999999999999986,49,4,0,4]
["HIGHLANDS SCHOOL ARTIGAS",80,36,44,4,0,4]
["Highlands School Mercedes",54,17,37,1,0,1]
["Horacio Spingardi - Gastronomia Integral (Cocinarte)",80,20,60,2,2,0]
["ICD",330,160,170,3,0,3]
["IDE INSTITUTE",60.000000000000014,28.000000000000007,32.000000000000007,3,1,2]
["INADI - Instituto Nacional de Informática",292,152.99999999999997,139,4,2,2]
["INC English Services",97,46,51,30,9,21]
["INSTITUCION KOLPING",183,61.999999999999993,121,25,12,13]
["Institución Teatral El Tinglado",161,56,105,6,4,2]
["Instituo de Alta Gastronomia Beatriz Marino",722.00000000000011,79,643.00000000000011,3,0,3]
["INSTITUTO ALDEY (VULTICOR S.A.)",412.99999999999994,60,352.99999999999994,29,15,14]
["Instituto Alta Capacitación",847,27.000000000000004,820,16,0,16]
["Instituto Caprice SRL",216,6,210,5,0,5]
["Instituto Cultural Anglo Uruguayo de Las Piedras",178,66,111.99999999999999,7,0,7]
["Instituto Cultural Anglo Uruguayo de Rivera",390,160,230,11,0,11]
["Instituto de Actuación de Montevideo",181,51,130,37,15,22]
["Instituto de Capacitación del Centro de Navegación",211,149,62,11,8,3]
["Instituto de Capacitacion Empresarial del Uruguay   (ICEDU)",70,15,55,6,1,5]
["Instituto de Danzas Verónica Samurio",423,8,415,4,0,4]
["Instituto de Educación Centro DEI",87,18,69,2,1,1]
["INSTITUTO DE ENSEÑANZA LC",151,19,132,13,7,6]
["INSTITUTO DE INFORMATICA VIÑALES",221.00000000000003,75.000000000000028,146,5,2,3]
["INSTITUTO DE INGLES CEDI",116,51.999999999999993,64,3,0,3]
["Instituto Diseg",63,3,60,2,1,1]
["INSTITUTO EDULAND",138,62,76,11,6,5]
["INSTITUTO GANEM",159,55.999999999999993,103,78,52,26]
["Instituto I.E.CO.",136,52,84.000000000000014,5,1,4]
["INSTITUTO ICEDU (NETWIDE S.R.L.)",60,50,10,9,3,6]
["INSTITUTO MUNDO NUEVO",330,47,283,19,7,12]
["Instituto Musical Schuber",93,43,50,4,1,3]
["INSTITUTO SUPERIOR DE INFORMATICA",608.00000000000011,113.00000000000001,495.00000000000011,11,3,8]
["INSTITUTO TECNOLÓGICO CTC LTDA",16,11,5,2,2,0]
["Instituto Tecnologico del Uruguay Ltda.",212,90,122.00000000000001,14,4,10]
["INSTITUTO TECNOLOGICO ECILDA PAULLIER",113,38,75,2,0,2]
["Instituto universitario CEDIIAP",107,9,98,68,13,55]
["Instituto Universitario Mons. Mariano Soler Facultad de Teología del Uruguay",71,62,9,41,36,5]
["INSTITUTO URUBRIT",74,34,40,4,2,2]
["INSTITUTO URUGUAYO GASTRONÓMICO",64,26,38,17,7,10]
["Instituto Vinicius de Moraes- Língua & Cultura do Brasil",112,47,65,3,1,2]
["Integra Escuela Pablo Giménez",36,3,33,4,1,3]
["Intituto ADI",47,26,21.000000000000004,2,1,1]
["IPEP",273,185,88,21,14,7]
["ISEC",235,108,127,4,0,4]
["ITHU",170,67,103,30,19,11]
["JAVIER GUTIÉRREZ",46,5,41,2,1,1]
["Juventud para Cristo",87,26,61,8,3,5]
["KENT  INSTITUTE",128.00000000000006,57,71.000000000000043,16,2,14]
["Kingston Language Centre",50,9,41,1,0,1]
["La zapada",65,60,5,2,2,0]
["Langland institute",219,108,110.99999999999999,32,9,23]
["lennon institute",72,28,43.999999999999993,4,0,4]
["Limelight Language School",71,21,50.000000000000007,3,0,3]
["LONDON MILENIUM SA",627,189,438,88,6,82]
["Lurama SRL",166,17,149,5,0,5]
["Ma - Pa",3199.0000000000009,1906.0000000000011,1292.9999999999998,92,60,32]
["Michigan",189,84,105,92,60,32]
["Mirta Daniela Vidal Acosta Instituto de Inglés EPT",93,44,49,2,1,1]
["Mundo Informático",315,102.99999999999999,212,10,1,9]
["Patronato de Cultura Galega",{"$f":"C215+D215","v":245.99999999999997},49,196.99999999999997,{"$f":"F215+G215","v":14},3,11]
["Plemmu",789,179,610,77,12,65]
["PMI",506,306,199.99999999999997,12,6,6]
["Politécnico de Punta del Este",32,12,20,34,23,11]
["PRIMERA ESCUELA URUGUAYA DE TIRO",568,469,99.000000000000014,4,4,0]
["PROGRAMA CARDIJN",243,46,197,39,14,25]
["Punta del Este Flight School",56.000000000000007,46.000000000000007,10,4,4,0]
["RED QUALITAS",109.99999999999999,44.999999999999986,65,14,10,4]
["RED QUALITAS FRAY BENTOS",1883,1727,156,2,1,1]
["REDQUALITAS TARARIRAS",89,35,54,4,2,2]
["Renglón Uno - Capacitación Empresarial",340,130,210,18,13,5]
["REPAPEL",3159,1468,1691,5,0,5]
["Ro danzas",240,5.0000000000000009,235,34,28,6]
["SAINT MARY'S English School",63.000000000000007,28.000000000000007,35,2,0,2]
["Seaside English Center",107.99999999999999,48,59.999999999999986,3,0,3]
["SERINF",113,28,85,34,8,26]
["Serpaj",437,396,41,6,2,4]
["Sisto Pascale",76,21,55,0,0,0]
["SOCIEDAD DE CULTURA INGLESA ANGLO SARANDI GRANDE",128,59,69,8,1,7]
["SOMERSET HOUSE",42,20,22.000000000000004,5,2,3]
["Strasser",308.99999999999994,153.99999999999997,154.99999999999997,9,2,7]
["TALLER AZABACHE (CELSA ARTE TALLER)",45,11,34,2,0,2]
["TALLER DE INFORMÁTICA",575,190.00000000000003,385,14,6,8]
["Taller para las artes",119,45,74,5,2,3]
["TERCER MILENIO",110,19,91,11,3,8]
["The English Institute",18,5,13,4,1,3]
["UNIT",4438,1796,2642,87,49,38]
["VILLA REGINA SRL",80,6,74,7,2,5]
["Fuente: Elaboración propia en base a la información del Relevamiento de Instituciones de Formación Técnico-Profesional. Realizado por el Área de Investigación y Estadística."]
["Nota: en las instituciones  se suman la totalidad de docentes, en el momento de su primera aparición en el presente cuadro, ya que no se tiene la desagregación de los mismos por área de conocimiento"]
["Hay que sumar datos obtenidos del Ministerio de Defensa a los totales públicos. 2457 alumnos matriculados, 2128 hombres y 329 mujeres; 660 docentes, 610 hombres y 50 mujeres. "]

{"sheet":"II-8.4.2 ","index":110,"n_rows":119,"n_cols":12,"rows_kept":119,"cut":false,"hidden":false,"merged":[[9,5,9,6],[9,8,9,9],[0,5,1,9],[4,0,4,3],[5,0,5,3],[6,0,6,6],[8,0,9,0],[8,1,9,1],[8,2,8,3],[8,5,8,6],[8,8,8,9],[9,2,9,3]]}
["MEC",null,null,null,null,"CENSO EDUCACIÓN TÉCNICA Y TECNOLÓGICA"]
["Área de Investigación y Estadística"]
[]
[]
[]
["Cuadro II 8.4.2"]
["INGRESADOS, MATRÍCULA  Y EGRESADOS DEL RELEVAMIENTO DE INSTITUCIONES DE FORMACIÓN TÉCNICO-PROFESIONAL SEGÚN REGIÓN Y ÁREAS DE CONOCIMIENTO. AÑO 2016."]
[]
["REGIÓN/ÁREAS DE CONOCIMENTO","TOTAL","INGRESO",null,null,"MATRÍCULA",null,null,"EGRESO"]
[null,null,"SEXO",null,"TOTAL","SEXO",null,"TOTAL","SEXO"]
[null,null,"M","F",null,"M","F",null,"M","F"]
["MONTEVIDEO",{"$f":"SUM(B13:B36)","v":57970.000000000007},{"$f":"SUM(C13:C36)","v":24843.999999999996},33126.000000000007,64886,27607.999999999996,37278.000000000007,41089,17870,23218.999999999996]
["ADMINISTRACIÓN -COMERCIALIZACIÓN",8012.0000000000036,3304.9999999999986,4707.0000000000055,9225,3790.9999999999982,5434.0000000000027,6796.0000000000027,2812.9999999999986,3982.9999999999973]
["AERONÁUTICA",256,194,62.000000000000014,2593.9999999999995,734,1859.9999999999998,1828.0000000000002,418.00000000000006,1410.0000000000002]
["AGRARIA",425,150,274.99999999999994,10,5,5,10,5,5]
["ARTES-ARTESANÍAS",3283.0000000000009,1143.0000000000002,2140,733.00000000000011,224.00000000000003,508.99999999999994,571.99999999999977,185.00000000000003,386.99999999999994]
["COMUNICACIONES",944.99999999999989,484.99999999999994,459.99999999999994,12494.999999999995,5509,6986.0000000000009,10508.999999999998,4591.0000000000009,5917.9999999999991]
["CONSTRUCCIÓN -ARQUITECTURA",1143.0000000000002,837.00000000000011,306,5108.9999999999991,2431.9999999999995,2677.0000000000005,4090.0000000000014,1941.9999999999991,2147.9999999999995]
["DEPORTES Y AFINES",665.99999999999977,329.00000000000017,337,88,18,70,39,12,27]
["DISEÑOS",1250.9999999999998,593,658.00000000000011,1769,1450,318.99999999999994,1348,1089.9999999999998,258.00000000000006]
["ELECTROTÉCNIA Y ELECTRÓNICA",408.99999999999994,404.00000000000011,5,840,823.00000000000011,17,591,579,12]
["GASTRONOMÍA",2593.9999999999995,727.00000000000023,1867,9914.0000000000036,2897.9999999999995,7016.0000000000018,3504.0000000000009,703.99999999999989,2799.9999999999995]
["GRÁFICOS",10,5,5,291,212.00000000000003,79,131.99999999999997,64,68]
["HOTELERIA Y TURISMO",733.00000000000011,232.99999999999994,500.00000000000006,2230.0000000000009,1835.9999999999998,393.99999999999989,2035,1709.0000000000002,326.00000000000006]
["IDIOMAS",11478.000000000004,5025.9999999999982,6452.0000000000027,1780,81.999999999999957,1698,1502.0000000000002,43.000000000000014,1459.0000000000005]
["INFORMÁTICA",4839,2330,2509.0000000000005,344,294,50,269,236,33]
["MARITIMA",1769,1450,318.99999999999994,287.99999999999994,80.999999999999972,207,158,41,117]
["METAL-MECÁNICA",840,823.00000000000011,17,1700,228.99999999999997,1471,1419,132.00000000000003,1287]
["LÚDICA",88,18,70,6203.9999999999991,2504,3700.0000000000005,2483.9999999999991,1016.0000000000002,1468]
["SALUD SEGURIDAD E HIGIENE",8514,2518,5995.9999999999991,425,150,274.99999999999994,183,42,141]
["SEGURIDAD Y DEFENSA",2222.9999999999995,1836.9999999999998,385.99999999999989,4168.9999999999991,1572.9999999999995,2595.9999999999995,776.00000000000011,331,444.99999999999994]
["SERVICIOS PERSONALES -ESTÉTICA",1780,81.999999999999957,1698,1061,529.99999999999989,531.00000000000011,423.00000000000006,250.00000000000006,173]
["EDUCACIÓN",1672,205.99999999999997,1465.9999999999998,1161,845.00000000000023,315.99999999999994,719.99999999999989,585,135]
["TECNOLÓGICA",344,299,45,692,344.99999999999994,346.99999999999994,299,213.99999999999997,85]
["VESTIMENTA",287.99999999999994,80.999999999999972,207,1355,639,715.99999999999977,1051.0000000000002,522,529]
["OTROS",4407.9999999999991,1768.9999999999998,2638.9999999999995,408.99999999999994,404.00000000000011,5,350.99999999999989,346.00000000000006,5]
["REGIÓN SUR",12220,{"$f":"SUM(C38:C53)","v":6410},5810,13078.000000000002,6747.0000000000009,6331.0000000000009,10166,5514,4652]
["ADMINISTRACIÓN -COMERCIALIZACIÓN",657,198,459,668,195.99999999999997,472,469,134.99999999999997,333.99999999999989]
["GASTRONOMÍA",168,130,38,178,140,38,78,56,22]
["IDIOMAS",6893.0000000000018,3988,2905,7293.0000000000018,4159.0000000000009,3134.0000000000014,6643.0000000000009,3897.0000000000005,2745.9999999999995]
["INFORMÁTICA",673.99999999999989,356,318.00000000000006,715.00000000000011,384.00000000000006,331,562.00000000000011,277,285]
["METAL-MECÁNICA",0,0,0,0,0,0,0,0,0]
["SALUD SEGURIDAD E HIGIENE",1224,214.00000000000003,1009.9999999999998,1413.9999999999998,240.99999999999994,1172.9999999999998,511,41,470.00000000000011]
["AERONÁUTICA",190,156.00000000000003,34,190,156.00000000000003,34,56.000000000000007,46.000000000000014,10]
["SEGURIDAD Y DEFENSA",109,77,32,109,79,30,28,21,7]
["SERVICIOS PERSONALES -ESTÉTICA",3,0,3,3,0,3,1,0,1]
["EDUCACIÓN",201,76,125,201,76,125,128,35,93]
["OTROS",1497,915.00000000000023,582,1542,943.99999999999989,598,1418,856.99999999999989,561]
["AGRARIA",63,51,12,63,51,12,51,40,11]
["ARTES-ARTESANÍAS",56.000000000000007,24.999999999999996,30.999999999999996,200,83,117.00000000000003,42,9.0000000000000018,33]
["CONSTRUCCION -ARQUITECTURA",0,0,0,0,0,0,0,0,0]
["DEPORTES Y AFINES",326,152,174,326,152,174,44,31,13]
["DISEÑOS",159,72,87,176,86,90,135,69,66]
["REGIÓN ESTE",1396,{"$f":"SUM(C55:C67)","v":532},864,1662,598,1064,1086,419,666.99999999999989]
["ADMINISTRACIÓN -COMERCIALIZACIÓN",90,18,72,103,22,81,25,3,22]
["GASTRONOMÍA",59,14,45,88,24,64,41,4,37]
["GRÁFICOS",3,3,0,3,2,1,3,3,0]
["IDIOMAS",359,161,197.99999999999997,490.00000000000006,202,288,480,198.00000000000003,281.99999999999994]
["INFORMÁTICA",30,15,15,30,15,15,29,14,15]
["SALUD SEGURIDAD E HIGIENE",265,25,240,358,37,321,167,14,152.99999999999997]
["EDUCACIÓN",127,61,66,127,61,66,0,0,0]
["OTROS",364,185,179,364,185,179,313,160,153]
["AGRARIA",27,18,9,27,18,9,16,13,3]
["ARTES-ARTESANÍAS",14,8,6,14,8,6,0,0,0]
["COMUNICACIONES",40,9,31,40,9,31,0,0,0]
["CONSTRUCCIÓN -ARQUITECTURA",5,3,2,5,3,2,5,3,2]
["ELECTROTÉCNIA Y ELECTRÓNICA",13,12,1,13,12,1,7,7,0]
["REGIÓN CENTRAL",3550,{"$f":"SUM(C69:C78)","v":1412},2138,3558,1419,2139,2419,1019,1400]
["ADMINISTRACIÓN -COMERCIALIZACIÓN",100,13,87,101,15,86,89,11,78]
["HOTELERIA Y TURISMO",216,40,176,218,38,180.00000000000003,139,24,115]
["IDIOMAS",1237,588.00000000000011,649,1237,598,639.00000000000011,711.00000000000011,352,359]
["INFORMÁTICA",221,75.000000000000028,146,221,75.000000000000028,146,206,71.000000000000014,134.99999999999997]
["SALUD SEGURIDAD E HIGIENE",456,65,391,458,64,393.99999999999994,173,25,148]
["AERONÁUTICA",24,23,1,24,23,1,0,0,0]
["EDUCACIÓN",278,121,157,281,119,162,209,113,96]
["OTROS",1000,477,523,1000,477,523,880,415,465]
["AGRARIA",18,10,8,18,10,8,12,8,4]
["ARTES-ARTESANÍAS",0,0,0,0,0,0,0,0,0]
["REGIÓN LITORAL",5200,{"$f":"SUM(C80:C96)","v":2985.9999999999995},2214,5683.9999999999991,3099,2585,4665,2858.0000000000005,1807.0000000000002]
["ADMINISTRACIÓN -COMERCIALIZACIÓN",171,43,128,171,43,128,134,37,96.999999999999986," "]
["GASTRONOMÍA",80,20,60,80,20,60,76,20,56]
["HOTELERIA Y TURISMO",15,11,4,15,11,4,12,10,2]
["IDIOMAS",1483,682,801,1534.9999999999995,704.99999999999989,830,1441.0000000000002,663.00000000000011,778.00000000000011]
["INFORMÁTICA",425.00000000000006,212.99999999999997,212,558,284.99999999999994,273.00000000000006,393,191.00000000000003,202.00000000000003]
["METAL-MECÁNICA",23,22,1,23,22,1,18,17,1]
["SALUD SEGURIDAD E HIGIENE",1948.9999999999995,1667.9999999999995,281,1948.9999999999995,1683,266,1806,1648.0000000000002,158.00000000000003]
["SERVICIOS PERSONALES -ESTÉTICA",0,0,0,0,0,0,0,0,0]
["TECNOLÓGICA",0,0,0,0,0,0,0,0,0]
["EDUCACIÓN",292,45,247.00000000000006,292,45,247.00000000000006,170.00000000000003,1,169.00000000000006]
["OTROS",470,224,246,470,224,246,470,224,246,null," "]
["AGRARIA",45,7,38,45,7,38,37,6,31]
["ARTES-ARTESANÍAS",100,4,96,366,7,359,4,0,4]
["COMUNICACIONES",67,11,56,67,11,56,56,11,45]
["DEPORTES Y AFINES",46,10,36,79,10,69,17,7,10]
["DISEÑOS",17,9,8,17,9,8,17,9,8]
["ELECTROTÉCNIA Y ELECTRÓNICA",17,17,0,17,17,0,14,14,0]
["REGIÓN NORTE",3774,{"$f":"SUM(C98:C107)","v":1342},2432,4555,1380.9999999999998,3174,2682,1036,1646]
["ADMINISTRACIÓN -COMERCIALIZACIÓN",95.000000000000014,41,54,95.000000000000014,41,54,66,25.999999999999996,40]
["GASTRONOMÍA",0,0,0,46,2,44,0,0,0]
["IDIOMAS",1100.9999999999998,447,654.00000000000011,1199.0000000000005,473.99999999999977,724.99999999999977,633,254.00000000000006,379.00000000000006]
["INFORMÁTICA",121.99999999999999,40,82,176,44,132,110.99999999999999,39,71.999999999999986]
["SALUD SEGURIDAD E HIGIENE",848.00000000000011,126,721.99999999999989,859.99999999999989,126,734.00000000000011,308.99999999999994,36,273.00000000000006]
["EDUCACIÓN",26,3,23,26,3,23,0,0,0]
["OTROS",1522,679,843,1604,679,925,1515,679,835.99999999999989]
["AGRARIA",0,0,0,42,1,41,0,0,0]
["ARTES-ARTESANÍAS",59.999999999999993,6.0000000000000009,54,448,9,439.00000000000006,48,2.0000000000000004,46.000000000000014]
["DEPORTES Y AFINES",0,0,0,59,2,57,0,0,0]
["Fuente: Elaboración propia en base a la información del Relevamiento de Instituciones de Formación Técnico-Profesional. Realizado por el Área de Investigación y Estadística."]
["Nota: Región Sur: Canelones, Colonia, Maldonado y San José"]
["Región Este: Lavalleja, Rocha y Treinta y Tres"]
["Región Central: Durazno, Florida y Tacuarembó"]
["Región Litoral: Flores, Paysandú, Río Negro, Salto y Soriano"]
["Región Norte: Artigas, Cerro Largo y Rivera"]
[]
["Hay que sumar datos obtenidos del Ministerio de Defensa sin desagregación por sexo, región y área de conocimiento: "]
[]
["Ingresados: 2371"]
["Matrículados: 2457"]
["Egresados:2308"]

{"sheet":"II-8.4.3","index":111,"n_rows":49,"n_cols":15,"rows_kept":49,"cut":false,"hidden":false,"merged":[[9,12,9,13],[9,14,10,14],[8,6,8,7],[9,5,10,5],[9,6,9,7],[9,8,10,8],[9,9,9,10],[9,11,10,11],[8,12,8,13],[8,9,8,10]]}
["MEC",null,null,null,null,null,null,null,null,null,null,"CENSO EDUCACIÓN TÉCNICA Y TECNOLÓGICA"]
["Área de Investigación y Estadística"]
[]
[]
[]
["Cuadro II 8.4.3"]
[" DOCENTES POR TIPO DE FORMACIÓN, FORMA DE ADMINISTRACIÓN Y POR ÁREA DE CONOCIMIENTO. AÑO 2016."]
[]
[null,null,null,null,null,null,"IDÓNEO",null,null,"FORMACIÓN NO TERCIARIA",null,null,"       FORMACIÓN TERCIARIA"]
[" ",null,null,null,null,"TOTAL","SEXO",null,"TOTAL","SEXO",null,"TOTAL","SEXO",null,"TOTAL"]
[null,null,null,null,null,null,"M","F",null,"M","F",null,"M","F"]
["TOTAL PÚBLICO Y PRIVADA",null,null,null,null,{"$f":"F14+F19","v":4575},{"$f":"G14+G19","v":592},{"$f":"H14+H19","v":488},{"$f":"G12+H12","v":1080},{"$f":"J14+J19","v":648},{"$f":"K14+K19","v":439},{"$f":"J12+K12","v":1087},{"$f":"M14+M19","v":891},{"$f":"N14+N19","v":1517},{"$f":"M12+N12","v":2408}]
[]
["PÚBLICO TOTAL",null,null,null,null,{"$f":"SUM(G14+H14+J14+K14+M14+N14)","v":890},224,34,{"$f":"G14+H14","v":258},327,25,{"$f":"J14+K14","v":352},134,146,{"$f":"M14+N14","v":280}]
["MARÍTIMA",null,null,null,null,null,61,1,{"$f":"G15+H15","v":62},1,0,1,0,4,{"$f":"M15+N15","v":4}]
["SALUD SEGURIDAD E HIGIENE",null,null,null,null,null,69,17,{"$f":"G16+H16","v":86},29,3,32,24,109,{"$f":"M16+N16","v":133}]
["AERONÁUTICA",null,null,null,null,null,56,7,63,82,14,96,19,7,26]
["SEGURIDAD Y DEFENSA",null,null,null,null,null,38,9,47,215,8,223,91,26,117]
["PRIVADO TOTAL",null,null,null,null,{"$f":"SUM(G19+H19+J19+K19+M19+N19)","v":3685},368,454,{"$f":"G19+H19","v":822},321,414,{"$f":"J19+K19","v":735},757,1371,{"$f":"M19+N19","v":2128}]
["ADMINISTRACIÓN -COMERCIALIZACIÓN",null,null,null,null,null,80,42.999999999999993,{"$f":"G20+H20","v":123},87.999999999999986,48,{"$f":"J20+K20","v":136},188.00000000000003,193.99999999999997,{"$f":"M20+N20","v":382}]
["GASTRONOMÍA",null,null,null,null,null,12.000000000000002,8,20,31.999999999999996,18,50,38,74,112]
["GRÁFICOS",null,null,null,null,null,0,0,0,2,null,2,0,0,0]
["HOTELERIA Y TURISMO",null,null,null,null,null,5,27,32,3,15,18,5,25,30]
["IDIOMAS",null,null,null,null,null,50.000000000000007,180.99999999999997,230.99999999999997,79,187.00000000000006,266.00000000000006,84.999999999999986,264,349]
["INFORMÁTICA",null,null,null,null,null,20,22,42,18,15.000000000000002,33,19,57.000000000000007,76]
["LÚDICA",null,null,null,null,null,4,11,15,2,1,3,2,2,4]
["MARÍTIMA",null,null,null,null,null,1,2,3,0,0,0,7,1,8]
["SALUD SEGURIDAD E HIGIENE",null,null,null,null,null,8.0000000000000018,31,39,19,13,32,100,420.00000000000006,520]
["AERONÁUTICA",null,null,null,null,null,4,0,4,0,0,0,0,0,0]
["SEGURIDAD Y DEFENSA",null,null,null,null,null,61,20,81,2,2,4,13,6,19]
["SERVICIOS PERSONALES -ESTÉTICA",null,null,null,null,null,12,15,27,0,11,11,7,13,20]
["TECNOLÓGICA",null,null,null,null,null,0,0,0,3,2,5,4,5,9]
["EDUCACIÓN",null,null,null,null,null,5,21,26,3,29,32,43,84,127]
["OTROS",null,null,null,null,null,29.000000000000004,22,51,12,20,32,79.000000000000014,80.999999999999986,160]
["AGRARIA",null,null,null,null,null,2,3,5,9,9,18,14,28,42]
["ARTES-ARTESANIAS",null,null,null,null,null,39.999999999999986,36,75.999999999999986,18.000000000000004,22,40,42.000000000000021,45,87.000000000000028]
["COMUNICACIONES",null,null,null,null,null,22,9,31,6,14,20,17,21,38]
["CONSTRUCCIÓN -ARQUITECTURA",null,null,null,null,null,0,0,0,0,0,0,1,1,2]
["DEPORTES Y AFINES",null,null,null,null,null,3,1.0000000000000002,4,20,8,28,24,18,42]
["DISEÑOS",null,null,null,null,null,10,2,12,1,0,1,3,2,5]
["ELECTROTÉCNIA Y ELECTRÓNICA",null,null,null,null,null,0,0,0,4,0,4,2,0,2]
[]
["Fuente: Elaboración propia en base a la información del Relevamiento de Instituciones de Formación Técnico-Profesional. Realizado por el Área de Investigación y Estadística."]
[]
["Nota: Hay que sumar datos obtenidos del Ministerio de Defensa a los totales públicos. 298 docentes idóneos, 280  hombres y 18 mujeres; 133 docentes formación no terciaria, 120 hombres y 13 mujeres; 229 docentes formación terciaria, 210  hombres y 19 mujeres."]
[]
[]
[]
[" "]

{"sheet":"CONTROL","index":112,"n_rows":10,"n_cols":4,"rows_kept":10,"cut":false,"hidden":true,"merged":[]}
[null,"PRIMER CUADRO","SEGUNDO CUADRO"]
["MATRÍCULA","II-1.2.1","II-1.2.2",{"$f":"IF(#REF!, \"OK\", \"INCONSISTENCIA\")","v":{"$error":"#REF!"}}]
["MATRÍCULA","II-1.2.1","II-1.2.3",{"$f":"IF(#REF!=#REF!, \"OK\", \"INCONSISTENCIA\")","v":{"$error":"#REF!"}}]
["MATRÍCULA","II-1.2.1","II-1.2.5",{"$f":"IF(#REF!=#REF!, \"OK\", \"INCONSISTENCIA\")","v":{"$error":"#REF!"}}]
["MATRÍCULA","II-1.2.1","II-1.2.6",{"$f":"IF(#REF!=#REF!,\"OK\",\"INCONSISTENCIA\")","v":{"$error":"#REF!"}}]
["MATRÍCULA","II-1.2.4","II-1.2.5",{"$f":"IF(#REF!, \"OK\", \"INCONSISTENCIA\")","v":{"$error":"#REF!"}}]
["MATRÍCULA","II-1.2.4","II-1.2.6",{"$f":"IF(#REF!=#REF!, \"OK\", \"INCONSISTENCIA\")","v":{"$error":"#REF!"}}]
["MATRÍCULA","II-1.2.5","II-1.2.6",{"$f":"IF(#REF!=#REF!,\"OK\",\"INCONSISTENCIA\")","v":{"$error":"#REF!"}}]
["MATRÍCULA","II-1.2.5","II-1.2.7",{"$f":"IF(#REF! =#REF!, \"OK\", \"INCONSISTENCIA\")","v":{"$error":"#REF!"}}]
["PERSONAL","II-1.3.3","II-1.3.4",{"$f":"IF(#REF! =#REF!, \"OK\", \"INCONSISTENCIA\")","v":{"$error":"#REF!"}}]

{"sheet":"CONTROL ","index":113,"n_rows":23,"n_cols":11,"rows_kept":23,"cut":false,"hidden":true,"merged":[[0,0,0,5],[0,6,0,9]]}
["DENTRO DE PRIMARIA",null,null,null,null,null,"EN SINOPSIS"]
[null,"PRIMER CUADRO","SEGUNDO CUADRO","TERCER CUADRO",null,"Aclaración. ","PRIMER CUADRO","SEGUNDO CUADRO","TERCER CUADRO"]
["ESTABLEC.","II-2.1.1"," II-2.1.2 ",null,{"$f":"IF(SUM(#REF!+#REF!+#REF!+#REF!+#REF! +#REF! =#REF!),\"OK\",\"INCONSISTENCIA\")","v":{"$error":"#REF!"}}]
["ESTABLEC.","II-2.1.1","II-2.1.4",null,{"$f":"IF(#REF!=#REF!,\"OK\",\"INCONSISTENCIA\")","v":{"$error":"#REF!"}}]
["ESTABLEC.","II-2.1.1","II-2.1.4",null,{"$f":"IF(#REF!=#REF!,\"OK\",\"INCONSISTENCIA\")","v":{"$error":"#REF!"}},{"$f":"IF(E5=\"INCONSISTENCIA\",\"Número de establecimiento de especial\",\"\")","v":{"$error":"#REF!"}}]
["MATRÍCULA","II-2.2.1","II-2.2.2",null,{"$f":"IF(#REF!=#REF!,\"OK\",\"INCONSISTENCIA\")","v":{"$error":"#REF!"}},{"$f":"IF(E6=\"INCONSISTENCIA\",\"Matrícula de Primaria Pública\",\"\")","v":{"$error":"#REF!"}},null,null,null,{"$f":"IF((#REF!+#REF!)=#REF!,\"OK\",\"INCONSISTENCIA\")","v":{"$error":"#REF!"}},{"$f":"IF(J6=\"INCONSISTENCIA\",\"Matrícula de Primaria Pública\",\"\")","v":{"$error":"#REF!"}}]
["MATRÍCULA","II-2.2.2","II-2.2.3",null,{"$f":"IF(#REF!=SUM(#REF!-#REF!),\"OK\",\"INCONSISTENCIA\")","v":{"$error":"#REF!"}},null,null,null,null,{"$f":"IF((#REF!+#REF!)=#REF!,\"OK\",\"INCONSISTENCIA\")","v":{"$error":"#REF!"}}]
["MATRÍCULA","II-2.2.2","II-2.2.8",null,{"$f":"IF(#REF!=#REF!,\"OK\",\"INCONSISTENCIA\")","v":{"$error":"#REF!"}}]
["MATRÍCULA","II-2.2.1","II-2.2.6",null,{"$f":"IF(#REF!=#REF!,\"OK\",\"INCONSISTENCIA\")","v":{"$error":"#REF!"}}]
["MATRÍCULA","II-2.2.2","II-2.2.8",null,{"$f":"IF(#REF!=#REF!,\"OK\",\"INCONSISTENCIA\")","v":{"$error":"#REF!"}}]
["MATRÍCULA","II-2.2.1","II-2.2.8",null,{"$f":"IF(#REF!=#REF!,\"OK\",\"INCONSISTENCIA\")","v":{"$error":"#REF!"}}]
["MATRÍCULA","II-2.2.2","II-2.2.9",null,{"$f":"IF(#REF!=#REF!,\"OK\",\"INCONSISTENCIA\")","v":{"$error":"#REF!"}}]
["MATRÍCULA","II-2.2.1","II-2.2.10",null,{"$f":"IF(#REF!=#REF!,\"OK\",\"INCONSISTENCIA\")","v":{"$error":"#REF!"}}]
["MATRÍCULA","II-2.2.2","II-2.2.11",null,{"$f":"IF(#REF!=#REF!,\"OK\",\"INCONSISTENCIA\")","v":{"$error":"#REF!"}}]
["MATRÍCULA","II-2.2.1","II-2.2.11",null,{"$f":"IF(#REF!=#REF!,\"OK\",\"INCONSISTENCIA\")","v":{"$error":"#REF!"}}]
["MATRÍCULA","II-2.2.12","II-2.2.13",null,{"$f":"IF(#REF!=#REF!,\"OK\",\"INCONSISTENCIA\")","v":{"$error":"#REF!"}}]
["MATRÍCULA","II-2.2.10","II-2.2.12",null,{"$f":"IF(#REF!=#REF!,\"OK\",\"INCONSISTENCIA\")","v":{"$error":"#REF!"}}]
["MATRÍCULA","II-2.2.12","II-2.2.13",null,{"$f":"IF(#REF!=#REF!,\"OK\",\"INCONSISTENCIA\")","v":{"$error":"#REF!"}}]
["MATRÍCULA","II-2.2.13","II-2.2.14",null,{"$f":"IF(#REF!=#REF!,\"OK\",\"INCONSISTENCIA\")","v":{"$error":"#REF!"}}]
["MATRÍCULA","II-2.2.13","II-2.2.14",null,{"$f":"IF(#REF!=#REF!,\"OK\",\"INCONSISTENCIA\")","v":{"$error":"#REF!"}}]
["MATRÍCULA","II-2.2.1","II-2.2.15",null,{"$f":"IF(#REF!=#REF!+#REF!,\"OK\",\"INCONSISTENCIA\")","v":{"$error":"#REF!"}}]
["MATRÍCULA","II-2.2.16","II-2.2.17",null,{"$f":"IF(#REF!=#REF!,\"OK\",\"INCONSISTENCIA\")","v":{"$error":"#REF!"}}]
["MATRÍCULA","II-2.2.1","II-2.2.18",null,{"$f":"IF(#REF!=#REF!,\"OK\",\"INCONSISTENCIA\")","v":{"$error":"#REF!"}}]

{"sheet":"CONTROL Media Básica","index":114,"n_rows":15,"n_cols":4,"rows_kept":15,"cut":false,"hidden":true,"merged":[]}
[null,"PRIMER CUADRO","SEGUNDO CUADRO"]
["MATRÍCULA","II-3.2.1","II-3.2.4",{"$f":"IF(#REF! =#REF!, \"OK\", \"INCONSISTENCIA\")","v":{"$error":"#REF!"}}]
["MATRÍCULA","II-3.2.1","II-3.2.4",{"$f":"IF(#REF! =#REF!, \"OK\", \"INCONSISTENCIA\")","v":{"$error":"#REF!"}}]
["MATRÍCULA","II-3.2.1","II-3.2.4",{"$f":"IF(#REF! =#REF!, \"OK\", \"INCONSISTENCIA\")","v":{"$error":"#REF!"}}]
["MATRÍCULA","II-3.2.1","II-3.2.4",{"$f":"IF(#REF! =#REF!, \"OK\", \"INCONSISTENCIA\")","v":{"$error":"#REF!"}}]
["MATRÍCULA","II-3.2.1","II-3.2.4",{"$f":"IF(#REF! =#REF!, \"OK\", \"INCONSISTENCIA\")","v":{"$error":"#REF!"}}]
["MATRÍCULA","II-3.2.1","II-3.2.4",{"$f":"IF(#REF! =#REF!, \"OK\", \"INCONSISTENCIA\")","v":{"$error":"#REF!"}}]
["MATRÍCULA","II-3.2.2","II-3.2.5",{"$f":"IF('[1]II-3.2.2'!C14='II-3.2.7'!F9, \"OK\", \"INCONSISTENCIA\")","v":"INCONSISTENCIA"}]
["MATRÍCULA","II-3.2.2","II-3.2.5",{"$f":"IF('[1]II-3.2.2'!F14='II-3.2.7'!C9, \"OK\", \"INCONSISTENCIA\")","v":"INCONSISTENCIA"}]
["MATRÍCULA","II-3.2.2","II-3.2.5",{"$f":"IF('[1]II-3.2.2'!I14='II-3.2.7'!D9, \"OK\", \"INCONSISTENCIA\")","v":"INCONSISTENCIA"}]
["MATRÍCULA","II-3.2.2","II-3.2.5",{"$f":"IF('[1]II-3.2.2'!L14='II-3.2.7'!E9, \"OK\", \"INCONSISTENCIA\")","v":"INCONSISTENCIA"}]
["MATRÍCULA","II-3.2.5","II-3.2.6",{"$f":"IF('II-3.2.7'!C9='II-3.2.8 '!E10, \"OK\", \"INCONSISTENCIA\")","v":"INCONSISTENCIA"}]
["MATRÍCULA","II-3.2.5","II-3.2.6",{"$f":"IF('II-3.2.7'!D9='II-3.2.8 '!C10, \"OK\", \"INCONSISTENCIA\")","v":"INCONSISTENCIA"}]
["MATRÍCULA","II-3.2.5","II-3.2.6",{"$f":"IF('II-3.2.7'!E9='II-3.2.8 '!D10, \"OK\", \"INCONSISTENCIA\")","v":"OK"}]
["MATRÍCULA","II-3.2.5","II-3.2.6",{"$f":"IF('II-3.2.7'!F9='II-3.2.8 '!F10, \"OK\", \"INCONSISTENCIA\")","v":"INCONSISTENCIA"}]

{"sheet":"CONTROL Media Superior","index":115,"n_rows":21,"n_cols":4,"rows_kept":21,"cut":false,"hidden":true,"merged":[]}
[null,"PRIMER CUADRO","SEGUNDO CUADRO"]
["MATRÍCULA","II-4.2.1","II-4.2.5",{"$f":"IF(#REF!='II-4.2.5'!B10, \"OK\", \"INCONSISTENCIA\")","v":{"$error":"#REF!"}}]
["MATRÍCULA","II-4.2.1","II-4.2.5",{"$f":"IF(#REF!='II-4.2.5'!D10,\"OK\",\"INCONSISTENCIA\")","v":{"$error":"#REF!"}}]
["MATRÍCULA","II-4.2.1","II-4.2.5",{"$f":"IF(#REF!='II-4.2.5'!F10, \"OK\", \"INCONSISTENCIA\")","v":{"$error":"#REF!"}}]
["MATRÍCULA","II-4.2.1","II-4.2.5",{"$f":"IF(#REF!='II-4.2.5'!C10, \"OK\", \"INCONSISTENCIA\")","v":{"$error":"#REF!"}}]
["MATRÍCULA","II-4.2.1","II-4.2.5",{"$f":"IF(#REF!='II-4.2.5'!E10, \"OK\", \"INCONSISTENCIA\")","v":{"$error":"#REF!"}}]
["MATRÍCULA","II-4.2.1","II-4.2.5",{"$f":"IF(#REF!='II-4.2.5'!G10, \"OK\", \"INCONSISTENCIA\")","v":{"$error":"#REF!"}}]
["MATRÍCULA","II-4.2.3","II-4.2.4",{"$f":"IF('II-4.2.3 '!C10='II-4.2.4 '!C8, \"OK\", \"INCONSISTENCIA\")","v":"OK"}]
["MATRÍCULA","II-4.2.3","II-4.2.4",{"$f":"IF('II-4.2.3 '!E10='II-4.2.4 '!D8, \"OK\", \"INCONSISTENCIA\")","v":"INCONSISTENCIA"}]
["MATRÍCULA","II-4.2.3","II-4.2.4",{"$f":"IF('II-4.2.3 '!F10='II-4.2.4 '!E8, \"OK\", \"INCONSISTENCIA\")","v":"INCONSISTENCIA"}]
["MATRÍCULA","II-4.2.3","II-4.2.4",{"$f":"IF('II-4.2.3 '!I10='II-4.2.4 '!H8, \"OK\", \"INCONSISTENCIA\")","v":"INCONSISTENCIA"}]
["MATRÍCULA","II-4.2.3","II-4.2.4",{"$f":"IF('II-4.2.3 '!K10='II-4.2.4 '!I8, \"OK\", \"INCONSISTENCIA\")","v":"INCONSISTENCIA"}]
["MATRÍCULA","II-4.2.1","II-4.2.6",{"$f":"IF(#REF!=#REF!, \"OK\", \"INCONSISTENCIA\")","v":{"$error":"#REF!"}}]
["MATRÍCULA","II-4.2.5","II-4.2.9",{"$f":"IF('II-4.2.5'!F10=#REF!, \"OK\", \"INCONSISTENCIA\")","v":{"$error":"#REF!"}}]
["MATRÍCULA","II-4.2.5","II-4.2.9",{"$f":"IF('II-4.2.5'!G10=#REF!, \"OK\", \"INCONSISTENCIA\")","v":{"$error":"#REF!"}}]
["MATRÍCULA","II-4.2.6","II-4.2.7",{"$f":"IF(#REF!='II-4.2.6'!B11, \"OK\", \"INCONSISTENCIA\")","v":{"$error":"#REF!"}}]
["MATRÍCULA","II-4.2.6","II-4.2.8",{"$f":"IF(#REF!=#REF!, \"OK\", \"INCONSISTENCIA\")","v":{"$error":"#REF!"}}]
["MATRÍCULA","II-4.2.9","II-4.2.10",{"$f":"IF(#REF!='II-4.2.8'!B12, \"OK\", \"INCONSISTENCIA\")","v":{"$error":"#REF!"}}]
["MATRÍCULA","II-4.2.9","II-4.2.10",{"$f":"IF(#REF!='II-4.2.8'!B13,\"OK\",\"INCONSISTENCIA\")","v":{"$error":"#REF!"}}]
["MATRÍCULA","II-4.2.9","II-4.2.10",{"$f":"IF(#REF!='II-4.2.8'!B14,\"OK\",\"INCONSISTENCIA\")","v":{"$error":"#REF!"}}]
["MATRÍCULA","II-4.2.9","II-4.2.11",{"$f":"IF(#REF!=#REF!, \"OK\", \"INCONSISTENCIA\")","v":{"$error":"#REF!"}}]