{"text_format":"1","workbook":"xlsx","n_sheets":236,"sheets":["PRESENTACION","SINOPSIS - ÍNDICE DE CUADROS","SINOPSIS - ÍNDICE DE GRÁFICOS","ACLARACIONES AL LECTOR","Indicadores Escogidos","I-1.1.1","I-1.2.1","I-1.2.2","I-1.2.3","I-1.2.4.","I-1.2.5","I-1.2.6","I-1.2.7","I.1.2.8","I.1.2.9","I-1.2.10","I-1-2-11","I-1.2.12","I-1.2.13","I-2.1.14","I.2.2.1","I.2.2.2.","I.2.2.3","I.2.2.4","I.2.4.1","I.2.4.2","I.2.4.3","I.2.6.1.","I.2.6.2.","I.2.6.3","I.2.6.4","I.2.6.5.","I.2.6.6","I.2.7.I","I.2.7.2","I.2.8.1","I.2.8.2","I..2.8.3","I..2.8.4","I.2.8.5","I.2.8.6","I.2.8.7.","I.2.8.8","I.2.8.9.","I-3.1.1","I-3.1.2","I-3.1.3","I-3.1.4","I-3.1.5","I.3.1.6.","I-.3.1.7","I-3.1.8","I-3.3.1","I-4.5.1","I-4.5.2","G I-1.2.1","G I-1.2.2.","G I-1.2.3 ","G I-1.2.4","G I-1.2.5","G I-1.2.6","G I-1.2.7","G I-1.2.8","G I-1.2.9 ","G I-1.2.10","G I-1.2.11","G I-1.2.12","G I-1.2.13","G I-1.2.14","G I-1.2.15","G I-1.2.16","G I-1.2.17","G I-1.2.18","G I-1.2.19","G I-1.2.20","G I-1.2.21","G I-2.1.1","G I-2.1.2","G I-2.1.3","G I-2.1.4","G I-2.1.5","G I-2.2.1","G I-2.2.2","G I-2.2.3","G I-2.2.4","G I-2.3.1","G I-2.3.2","G I-2.3.3","G I-2.3.4","G I-2.3.5.","GI-2.3.6","GI-2.3.7","G I-2.3.8","G I-2.3.9","GI-2.3.10","G I-2.4.1.","G I-.2.5.1","G I-.2.5.2","G-.2.5.3","G I-2.5.4.","GI-.2.5.5","GI-.2.5.6.","GI-.2.5.7.","G I-2.6.1.","G I-2.6.2","G I-2.6.3","G I-2.6.4","G I-2.6.5","G I-2.6.6","G I-2.6.7","G I-2.6.8","G I--2-8-1-","G.I-3.1.1","G I-3.1.2","G I-3.1.3","G I-3.1.4","G I-3.1.5","G I-3.1.6.","G-I-3.1.7","G-I.3.1.8","G I-3.1.9","G I.3.1.10","G I-3.2.1","G I-3.2.2","G I-3.3.1","G I-3.3.2","G I-3.3.3","G I-4.1.1 ","G I-4.1.2","G I_4.1.3","G I 4.2.1","G I 4.2.2","G I-4.2.3","G I-4.3.1","G I-4.3.2","PRIMERA INFANCIA E INICIAL"," II-1.1.1","II-1.1.2","II-1.2.1","II-1.2.2","II-1.2.3 ","II-1.2.4","II-1.2.5","II-1.2.6","II-1.3.1","II-1.3.2"," PRIMARIA","CONTROL ","II-2.1.1"," II-2.1.2 ","II-2.1.3","II-2.1.4","II-2.2.1","II-2.2.2","II-2.2.3","II-2.2.4","II-2.2.5","II-2.2.6","II-2.2.7","II-2.2.8","II-2.2.9","II-2.2.10","II-2.2.11","II-2.2.12 ","II-2.2.13","II-2.2.14 ","II-2.2.15 ","II-2.2.16 ","II-2.3.1","II-2.3.2","MEDIA BASICA","II-3.1.1","II-3.2.1","II-3.2.2","II-3.2.3","II-3.2.4","II-3.2.5 ","II-3.2.6 ","II-3.3.1","II-3.3.2","II-3.4.1","MEDIA SUPERIOR","II-4.1.1","II-4.2.1","II-4.2.2 ","II-4.2.3 ","II-4.2.4 ","II-4.2.5","II-4.2.6","II-4.2.7","II-4.2.8 ","II_4_2_9","II_4_2_10","II-4.2.11 ","II-4.3.1 ","II-4.3.2","II-4.4.1","TERCIERIA NO UNIVERSITARIA ","II-5.1.1  ","II-5.2.1 ","II-5.2.2 ","II-5.2.3 ","II-5.2.4 ","II-5.3.1 ","II-5.3.2","II-5.3.3","II-5.3.4 ","EDUCACIÓN UNIVERSITARIA","II-6.1.1 ","II-6.2.2 ","II-6.2.3 ","II-6.2.4","II-6.2.5","II-6.2.6","II-6.2.7 ","II-6.2.8 ","II-6.2.9 ","II-6.2.10 ","EDUCACIÓN DE JÓVENES Y ADULTOS"," II-7.1.1"," II-7.1.2","II-7.1.3","II-7.1.4","II-7.1.5 ","II-7.1.6 ","II-7.1.7 ","II-7.1.8","II-7.1.9 ","II-7.2.1","II-7.2.2","II-7.2.3","II-7.3.1 ","II-7.3.2.","II-7.4.2","II-7.4.3","Hoja1"],"not_rendered":{"charts":0,"images":80,"macros":1,"external_links":1,"defined_names":269,"comments":0,"pivot_tables":0},"unopened":[],"bounds":{"document_bytes":16777216,"sheet_cells":100000,"rows_first":2000,"rows_last":500,"rows_between":2000,"halvings":0,"cell_chars":16384,"cell_head_chars":4096},"cells_cut":0,"cells_raw":0,"read":"whole","date_system":"1900"}

{"sheet":"PRESENTACION","index":0,"n_rows":0,"n_cols":0,"rows_kept":0,"cut":false,"hidden":false,"merged":[[5,1,5,9]]}

{"sheet":"SINOPSIS - ÍNDICE DE CUADROS","index":1,"n_rows":0,"n_cols":0,"rows_kept":0,"cut":false,"hidden":false,"merged":[[33,0,33,4],[35,0,35,4],[21,0,21,4],[23,0,23,4],[25,0,25,4],[27,0,27,4],[29,0,29,4],[31,0,31,4],[19,0,19,4],[10,0,10,4],[12,0,12,4],[14,0,14,4],[15,0,15,4],[17,0,17,4]]}

{"sheet":"SINOPSIS - ÍNDICE DE GRÁFICOS","index":2,"n_rows":0,"n_cols":0,"rows_kept":0,"cut":false,"hidden":false,"merged":[]}

{"sheet":"ACLARACIONES AL LECTOR","index":3,"n_rows":3,"n_cols":1,"rows_kept":3,"cut":false,"hidden":false,"merged":[[2,0,12,6]]}
[]
[]
["El lector deberá tener presente que la actualización permanente de la documentación publicada, puede traer como consecuencia diferencias entre los datos incluidos en las versiones PDF y EXCEL de cada Anuario."]

{"sheet":"Indicadores Escogidos","index":4,"n_rows":62,"n_cols":4,"rows_kept":62,"cut":false,"hidden":false,"merged":[[0,0,0,2],[2,0,2,3],[55,0,55,2],[56,0,56,2],[57,0,57,3],[46,0,46,2],[47,0,47,2],[42,0,42,2],[33,0,33,2],[38,0,38,2],[39,0,39,2],[40,0,40,2],[41,0,41,2],[34,0,34,2],[35,0,35,2],[36,0,36,2],[62,0,62,3],[61,0,61,3],[59,0,59,2],[48,0,48,2],[58,0,58,2],[49,0,49,2],[50,0,50,3],[51,0,51,2],[52,0,52,2],[53,0,53,2],[54,0,54,2],[43,0,43,3],[44,0,44,2],[45,0,45,2],[37,0,37,3],[32,0,32,2],[29,0,29,2],[30,0,30,2],[21,0,21,2],[22,0,22,2],[23,0,23,2],[24,0,24,3],[25,0,25,2],[31,0,31,2],[20,0,20,2],[9,0,9,2],[10,0,10,3],[11,0,11,2],[12,0,12,2],[13,0,13,2],[14,0,14,2],[15,0,15,2],[16,0,16,2],[17,0,17,2],[18,0,18,2],[19,0,19,2],[26,0,26,2],[27,0,27,2],[28,0,28,2],[8,0,8,2],[3,0,3,3],[4,0,4,2],[5,0,5,2],[6,0,6,2],[7,0,7,2]]}
["Ministerio de Educación y Cultura\nDirección de Educación\n"]
[]
["Cuadro I-0.0.0\nINDICADORES ESCOGIDOS"]
["INICIAL"]
["Cantidad de Estableciminetos de Educación Inicial (Supervisados por CEIP, públicos y privados) ",null,null,252]
["Cantidad de Centros CAIF[1]",null,null,333]
["Cantidad de Centros Educativos en la Primera Infancia (RNG)",null,null,478]
["Cantidad de alumnos en Educación Inicial (Supervisados por CEIP)",null,null,108244]
["Cantidad de alumnos en Primera Infancia",null,null,45237]
["Cantidad de alumnos en Centros Educativos en la Primera Infancia (RNG)",null,null,20007]
["EDUCACIÓN PRIMARIA"]
["Cantidad de establecimientos",null,null,2541]
["Cantidad de alumnos",null,null,308550]
["% de alumnos de educación pública",null,null,83.4]
["% de alumnos de educación pública en Montevideo",null,null,72.099999999999994]
["% de alumnos de educación pública en el Resto del País",null,null,90.5]
["% de alumnos de educación pública Urbana",null,null,93.9]
["Razón Público/Privado en Educación Primaria",null,null,5.3]
["% de alumnos que no aprobaron en 1ero",null,null,14.1]
["% de alumnos que no aprobaron de 1ero a 6to",null,null,6.1]
["% de alumnos que no aprobaron de 1ero a 6to en escuelas rurales",null,null,0]
["% de alumnos que no aprobaron de 1ero a 6to en escuelas urbanas",null,null,6.1]
["% de personas de 14 a 15 que culminaron primaria",null,null,95.6]
["% de personas de 15 a 20 que no culminaron educación media básica, no estudian, no trabajan ni buscan trabajo",null,null,9.1]
["EDUCACIÓN MEDIA"]
["Cantidad de establecimientos dependientes del CES",null,null,386]
["Cantidad de establecimientos dependientes del CETP (UTU)",null,null,133]
["% de establecimientos dependientes del CES en Montevideo",null,null,37]
["% de establecimientos dependientes del CETP (UTU) en Montevideo",null,null,22.5]
["Cantidad de alumnos en Educación Media Básica",null,null,182175]
["Cantidad de alumnos en Educación Media Superior",null,null,149484]
["Razón Público/Privado en Educación Media Básica[2]",null,null,5.2]
["Razón Público/Privado en Educación Media Superior",null,null,5.9]
["% de no aprobación de 1º a 3º año diurno público en Educación Media Básica General",null,null,30]
["% de desvinculación de 1º a 3º año diurno público en Educación Media Básica General",null,null,3.4]
["% de personas de 17 a 18 años que culminaron ciclo básico",null,null,65]
["% de personas de 21 a 22 años que culminaron segundo ciclo ",null,null,37.5]
["EDUCACIÓN TERCIARIA"]
["Cantidad de matriculados en cursos de grado en universidades e institutos universitarios",null,null,132420]
["Cantidad de matriculados en ofertas terciarias de Formación Docente",null,null,20995]
["Cantidad de matriculados en ofertas terciarias del Ministerio del Interior y del Ministerio de Defensa Nacional",null,null,470]
["Cantidad de ingresos en cursos de grado en universidades e institutos universitarios",null,null,22945]
["Cantidad de egresos en cursos de grado en universidades e institutos universitarios",null,null,6476]
["LOGRO EDUCATIVO Y ASISTENCIA"]
["% personas de 25 años o más con primaria completa o menos como nivel máximo alcanzado ",null,null,41]
["% personas de 25 a 29 años con primaria completa o menos como nivel máximo alcanzado",null,null,19]
["Tasa de analfabetismo (Uruguay)",null,null,2]
["Tasa de analfabetismo (MERCOSUR)",null,null,7.8]
["Tasa de analfabetismo (UNASUR)",null,null,8.3000000000000007]
["% de jóvenes de 15 a 20 años que no asiste a ningún establecimiento, no trabaja, ni busca trabajo",null,null,13]
["CONTEXTO DE LA EDUCACIÓN"]
["Cantidad de alumnos atendidos por el Programa Maestros Comunitarios",null,null,15680]
["Cantidad de alumnos atendidos por los CECAP’s",null,null,2060]
["Alumnos atendidos por el Programa de Educación Física Escolar",null,null,306318]
["Razón alumnos/docente en el Programa Maestros Comunitarios",null,null,28.3]
["Razón alumnos/educadores en los CECAP’s",null,null,10.6]
["Razón alumnos/docente en el Programa de Educación Física Escolar",null,null,313.5]
["GASTO"]
["Gasto público en educación como porcentaje de gasto del Gobierno Central",null,null,20]
["Gasto público en educación como % del PBI (Uruguay)",null,null,4.5]
[]
["Notas: CAIF incluye Centros Diurnos, y sólo en Montevideo, el Proyecto Nuestros Niños de la IMM.\nLa relación matriculados en educación pública, matriculados en educación privada, se realiza sin incorporar en el sector público la matrícula del CETP (UTU), por no contar con información sobre la matrícula técnico-vocacional en educación media del sector privado."]

{"sheet":"I-1.1.1","index":5,"n_rows":25,"n_cols":6,"rows_kept":25,"cut":false,"hidden":false,"merged":[[16,5,17,5],[13,5,14,5],[7,0,8,1],[7,5,8,5],[4,5,6,5],[11,5,12,5],[16,2,16,3],[17,2,17,3],[11,4,12,4],[11,0,12,1],[11,3,12,3],[13,0,14,1],[13,3,14,3],[13,4,14,4],[16,4,17,4],[9,2,9,3],[0,0,0,2],[9,0,10,1],[25,1,25,5],[26,1,26,5],[19,5,22,5],[18,0,18,1],[18,2,18,3],[23,0,23,5],[24,0,24,5],[19,2,19,3],[20,2,20,3],[21,2,21,3],[15,0,15,1],[16,0,17,1],[22,2,22,3],[19,0,22,1],[9,4,10,4],[9,5,10,5],[10,2,10,3],[7,2,7,3],[7,4,8,4],[8,2,8,3],[2,0,2,5],[3,0,3,1],[3,2,3,3],[4,2,4,3],[4,4,6,4],[5,2,5,3],[6,2,6,3],[4,0,6,1]]}
["Ministerio de Educación y Cultura\nDirección de Educación"]
[]
["Cuadro I-1.1.1\nUNIVERSO CUBIERTO POR EL ANUARIO ESTADÍSTICO DE EDUCACIÓN 2011 POR FORMA DE ADMINISTRACIÓN, MATRÍCULA Y FUENTE DE INFORMACIÓN SEGÚN TIPO DE OFERTA Y NIVEL EDUCATIVO\n"]
["Nivel\n(Edad teórica)",null,"Descripción\n(Oferta por forma de administración)",null,"Matricula 2011","Fuentes\nde información"]
["EDUCACIÓN EN LA PRIMERA INFANCIA\n0 a 3 años",null,"PÚBLICO: centros de educación infantil gestionados por organismos públicos (por ej centros de INAU o intendencias).",null,47845,"· Área de Educación en la Primera Infancia y Área de Investigación y Estadística de la Dirección de Educación del Ministerio de Educación y Cultura – Registro Nacional de Centros de Educación en la Primera Infancia;\n· Sistema de Información Para la Infancia (SIPI) de INAU;\n· I Montevideo (Programa Nuestros Niños)."]
[null,null,"PRIVADO: Centros de Educación Infantil Privados bajo supervisión del MEC En todos los casos la matrícula reportada excluye a los niños matriculados en centros que ya han sido habilitados por ANEP."]
[null,null,"PÚBLICO/PRIVADO: CAIF (modalidad diaria)"]
["EDUCACIÓN INICIAL\n3 a 5 años\n(4 y 5 años obligatorio)",null,"PUBLICO:Esta.del Consejo de Educación Inicial y Primaria (CEIP) Jardines y clases jardineras en escuelas de educación común.",null,108244,"· Área de Educación en la Primera Infancia, AIEde la Dir. de Edu. del MEC;\n· Depto. de Estadística Educativa del CEIP;\n· SIPI de INAU."]
[null,null,"PRIVADO: jardines de infantes privados, jardines en colegios privados y clases jardineras en colegios privados (bajo supervisión de ANEP)."]
["EDUCACIÓN PRIMARIA\n6 a 11 años\n (obligatorio)",null,"PUBLICO: Establecimientos del Consejo de Educación Inicial y Primaria.",null,337762,"· Departamento de Estadística Educativa del CEIP."]
[null,null,"PRIVADO: Establecimientos privados bajo supervisión de ANEP."]
["EDUCACIÓN MEDIA\nBÁSICA\n12 a 14 años",null,"PUBLICO: establecimientos del Consejo de Educación Secundaria, del Consejo de Educación Técnico Profesional y del Ciclo Básico Rural (7º, 8º y 9º)","MEDIA BÁSICA\n12 a 14 años (obligatorio)",182175,"· Departamento de Estadística del CES (oficiales, habilitados privados y habilitados militares);\n· Departamento de Estadística del CETP."]
[null,null,"PRIVADO: liceos habilitados privados bajo supervisión de ANEP."]
["EDUCACIÓN MEDIA SUPERIOR\n15 a 17 años",null,"PUBLICO: establecimientos del Consejo de Educación Secundaria, del Consejo de Educación Técnico Profesional  y los Habilitados Liceo Militar y Escuela Naval.","MEDIA SUPERIOR\n15 a 17 años",149484,"· Departamento de estadística del CEIP (para 7º, 8º y 9º) a través de planillas estadísticas"]
[null,null,"PRIVADO: liceos habilitados privados bajo supervisión de ANEP."]
["EDUCACIÓN TÉCNICO-PROFESIONAL DE INSERCIÓN LABORAL",null,"PUBLICO: establecimientos del Consejo de Educación Técnico Profesional.","TÉCNICO-PROFESIONAL DE INSERCIÓN LABORAL\n15 y más años",7546,"· Departamento de Estadística del CETP."]
["EDUCACIÓN TERCIARIA",null,"PÚBLICOS: Inst. Terc. Univ. y No Univ. (UdelaR; CFE, ISEF, Esc. Mun. de Arte Dramático, Cen. de Form. del INAU, Esc. Nacional de Policía, Esc. Militar, Esc. Militar de Aeronáutica y Esc. Naval).",null,129943,"· Div. de Estadística de la DGP de la UdelaR;\n· Of. de información para la Gestión delCFE de ANEP Unidades de planeamiento y/o asuntos estudiantiles de univ. e inst. univ. y no univ. públicos y privados."]
[null,null,"PRIVADOS: Univ. e Inst. Univ. Privados (UC, ORT, de Montevideo, de la Empresa; Autónomo del Sur, Asociación Cristiana de Jóvenes, CLAEH, Crandon, BIOS,  Mariano Soler); CIEP."]
["EDUCACIÓN FORMAL DE JÓVENES Y ADULTOS",null,"Dirección Sectorial de Educación de Jóvenes y Adultos de la ANEP (Niveles I y II y Acreditación).",null,4227,"· Dirección Sectorial de Educación de Jóvenes y Adultos de la ANEP."]
["EDUCACIÓN NO FORMAL",null,"Centros de Capacitación y Producción (CECAP) y Consejo De Capacitación Profesional (COCAP) del MEC.",null,2893,"· Departamento de Estadística del CETP; \n· Área de Educación No Formal de la Dirección de Educación del MEC;\n· Gerencia de Programas Especiales de CODICEN;\n· Oficina Nacional del Servicio Civil; e\n· Oficinas productoras de las instituciones universitarias"]
[null,null,"Dir. Sectorial de Edu.de Jóvenes y Adultos de la ANEP (Talleres).",null,4092]
[null,null,"Escuela de Funcionarios Públicos de la ONSC.",null,4637]
[null,null,"Educación no terciaria en universidades e instituciones universitarias privadas.",null,4311]
[]
["Nota:La matrícula de Educación Primaria incluye 1.041 alumnos que Acreditaron Primaria en la Dirección Sectorial de EJA de la ANEP.\nEducación en la primera infancia de 0 a 3 años: Esta definición etaria responde a la lógica de los hechos: prácticamente la mitad de los niños atendidos en Centros de Educación Infantil Privados tienen 3 años (también existe una porción minoritaria de niños de 4 y 5 años) En términos teóricos, este nivel atendería a niños de 0 a 36 meses (o hasta 2 años cumplidos y 11 meses) Algo similar sucede en el caso del nivel “Educación Inicial”, donde la enorme mayoría de los niños tienen 4 o 5 años y cuya definición teórica apuntaría a aquellos de 3, 4 y 5.\nMedia Básica incluye Ciclo Básico Rural, Educación Media Básica General (CEM) y Educación Media Tecnológica Básica (CETP); y Media Superior incluye Ciclo Superior de Secundaria, Bachillerato Tecnológico y Educación Media Tecnológica, Otros Cursos de Educación Técnica, incluyen a los demás cursos de las ofertas de Nivel I y II del CETP."]

{"sheet":"I-1.2.1","index":6,"n_rows":16,"n_cols":6,"rows_kept":16,"cut":false,"hidden":false,"merged":[[0,0,0,3],[2,0,2,5],[18,0,18,8],[19,0,19,8],[4,5,5,5],[4,0,5,0],[4,1,5,1],[4,2,4,3],[4,4,5,4],[3,0,3,5]]}
["Ministerio de Educación y Cultura\nDirección de Educación"]
[]
["Cuadro I-1.2.1\n"]
["TASA DE ANALFABETISMO Y PORCENTAJE DE POBLACIÓN POR ÁREA DEMOGRÁFICA SEGÚN AÑO"]
["AÑO LECTIVO","Fuente","TASA",null,"% de población rural","% de analfabetos rurales sobre total país"]
[null,null,"Total del país","Área Rural"]
[1963,"CENSO",8.8000000000000007,15.4,19.2,2.96]
[1975,"CENSO",5.7,10.3,17,1.75]
[1985,"CENSO",4.3,8.4,12.7,1.06]
[1996,"CENSO",3.1,6.2,9.1999999999999993,0.56999999999999995]
[2006,"ENHA",2.2000000000000002,3,6.4,0.19]
[2007,"ECH",2.1,3.4,6.6,0.21]
[2008,"ECH",1.9,3.1,6.2,0.19]
[2009,"ECH",1.8,3.4,7.9,0.27]
[2010,"ECH",2,3.2,5.8,0.19]
[2011,"ECH",1.7,3.4,8.58,0.28999999999999998]

{"sheet":"I-1.2.2","index":7,"n_rows":14,"n_cols":9,"rows_kept":14,"cut":false,"hidden":false,"merged":[[0,0,0,3],[13,0,13,8],[14,0,14,8],[6,0,6,1],[7,0,7,1],[8,0,8,1],[11,0,11,1],[9,0,9,1],[2,0,2,8],[3,0,3,8],[4,0,5,1],[4,2,4,8],[10,0,10,1]]}
["Ministerio de Educación y Cultura\nDirección de Educación"]
[]
["Cuadro I-1.2.2\n"]
["TASA DE ANALFABETISMO SEGÚN TRAMOS DE EDAD."]
["TASA DE ANALFABETISMO",null,"TRAMOS DE EDAD"]
[null,null,"TOTAL","15 a 20 años","21 a 39 años","40 a 49 años","50 a 59 años","60 a 64 años","65 y más años"]
[2006,null,2.2000000000000002,1.2,1.4,1.4,2.1,2.6,4.7]
[2007,null,2.1,1.2,1.3,1.5,1.8,2.2999999999999998,4.7]
[2008,null,1.9,0.9,1.3,1.3,1.9,2,4]
[2009,null,1.8,1,1.1000000000000001,1.1000000000000001,1.5,2.2999999999999998,4.2]
[2010,null,2,1.2,1.3,1.3,1.8,2.1,4.5]
[2011,null,1.7,1.3,1.1000000000000001,1.2,1.6,1.8,3.6]
[]
["Fuentes: Elaboración propia en base a la Encuesta Continua de Hogares 2011.\nNota: Población con 15 y más años para todo el país (Año 2006-2011)"]

{"sheet":"I-1.2.3","index":8,"n_rows":28,"n_cols":13,"rows_kept":28,"cut":false,"hidden":false,"merged":[[28,0,28,12],[27,0,27,12],[0,0,0,6],[2,0,2,12],[3,0,5,0],[26,0,26,12],[4,1,4,6],[4,7,4,12],[3,1,3,12]]}
["Ministerio de Educación y Cultura\nDirección de Educación"]
[]
["Cuadro I-1.2.3\nASISTENCIA A ALGÚN ESTABLECIMIENTO EDUCATIVO POR EDADES SIMPLES SEGÚN GRANDES ÁREAS Y AÑO LECTIVO."]
["EDADES\nSIMPLES","GRANDES ÁREAS"]
[null,"MONTEVIDEO",null,null,null,null,null,"RESTO DEL PAÍS"]
[null,2006,2007,2008,2009,2010,2011,2006,2007,2008,2009,2010,2011]
[3,53.7,59.6,61.5,67.2,72.2,64.7,41.9,43.3,42.8,52.5,58,57.8]
[4,79.400000000000006,82.5,86.5,86.5,89,87.1,74.8,76.900000000000006,78,86.7,86.3,85.5]
[5,95.8,94.5,96.5,95.5,95.6,93.3,94.8,94.8,96.3,98.4,98.4,98]
[6,99.1,99.1,99.1,98.6,99,97.6,99.4,99.5,98.9,99.1,99.5,98.3]
[7,99.5,99.1,98.9,98.5,98.4,97.1,99.6,99.8,99.2,98.9,99.2,99.3]
[8,99.7,99.6,99,97.9,99.2,98.8,99.8,99.7,99.1,99.3,98.4,98.9]
[9,99.8,100,99.4,99.4,98.5,98.5,99.8,99.9,99.2,98.5,99.6,98.4]
[10,99.6,99.8,98.8,99.2,99.3,98.4,99.6,99.8,99.3,98.8,99.3,98.5]
[11,99.6,99.9,98.9,99.3,98.2,97.3,99.5,99.8,99.1,98.8,98.8,97.7]
[12,99.1,99.2,98.1,98.5,97.9,97.5,98.2,98.5,97.1,97.7,98.7,97.8]
[13,96.8,96.5,96.2,96.7,96.9,97.5,94.4,94.2,93.4,93.4,95.4,95.3]
[14,93.3,90.7,92.8,93.5,93.6,94.8,88.4,87.7,88.1,89.7,91.7,91.3]
[15,86.1,85.5,87.3,88.6,85.9,89.2,79.7,80.2,79.900000000000006,80.900000000000006,81.3,83.1]
[16,79.099999999999994,80.3,79.099999999999994,81.8,82.1,81.2,75.099999999999994,71.5,69.900000000000006,75.3,77.2,75.8]
[17,72.900000000000006,70.400000000000006,74.099999999999994,74.8,70.900000000000006,73,63,62.5,63.6,67.400000000000006,64.8,65.8]
[18,62.7,60.5,57.6,60.9,56.8,57,49.6,48.9,49.7,48.5,45.6,44.8]
[19,55.1,56.9,54.2,51,52.6,53.1,41.8,38.9,39.1,40.5,39.4,40.200000000000003]
[20,51.3,49.2,51.5,50.8,50.5,50.1,33.1,32.700000000000003,35.200000000000003,34,34.799999999999997,32.299999999999997]
[21,47.9,49.1,48.5,52,48.6,48.7,25.9,27.9,31.2,26.6,28.9,27.4]
[22,46,42.6,45.9,42,44.2,49.9,24.5,23,23,24.5,23.7,26]
[]
["Fuentes:Elaboración propia en base a ECH 2006 y ECH de 2007 a 2011 del INE.\nNota:Todo el país (Años 2006 a 2011)"]

{"sheet":"I-1.2.4.","index":9,"n_rows":20,"n_cols":5,"rows_kept":20,"cut":false,"hidden":false,"merged":[[0,0,0,1],[11,0,11,1],[12,0,12,4],[6,0,6,1],[7,0,7,1],[8,0,8,1],[9,0,9,1],[10,0,10,1],[2,0,2,4],[3,0,4,1],[3,2,3,4],[5,0,5,4],[19,0,19,4],[20,0,20,4],[13,0,13,1],[14,0,14,1],[15,0,15,1],[16,0,16,1],[17,0,17,1],[18,0,18,1]]}
["Ministerio de Educación y Cultura\nDirección de Educación"]
[]
["Cuadro I-1.2.4\nASISTENCIA A ALGÚN ESTABLECIMIENTO EDUCATIVO POR EDADES SIMPLES SEGÚN AÑO LECTIVO Y PERTENENCIA DE LOS HOGARES A LOS QUINTILES EXTREMOS DE INGRESOS"]
["AÑO LECTIVO",null,"EDADES SIMPLES"]
[null,null,12,13,14]
["1er Quintil"]
[2006,null,97.5,93,83.7]
[2007,null,98.5,92.6,81.900000000000006]
[2008,null,96.9,90.2,81.8]
[2009,null,97.5,91.2,83.5]
[2010,null,97.8,92.6,83.7]
[2011,null,97.5,93.7,86.9]
["Quintil Mayor"]
[2006,null,100,99.2,99.3]
[2007,null,99.1,100,100]
[2008,null,98.3,98.1,99.3]
[2009,null,98,94.5,91]
[2010,null,99.3,99.2,99.5]
[2011,null,97.9,99.5,100]
["Fuentes:Elaboración propia en base a la ENHA 2006 y a las ECH 2007 a 2011.\nNota:Todo el país (Años 2006 a 2011)"]

{"sheet":"I-1.2.5","index":10,"n_rows":11,"n_cols":6,"rows_kept":11,"cut":false,"hidden":false,"merged":[[7,0,8,1],[11,0,11,4],[10,0,10,4],[0,0,0,4],[5,0,6,1],[2,0,2,5],[3,0,4,2],[3,3,3,5]]}
["Ministerio de Educación y Cultura\nDirección de Educación"]
[]
["Cuadro I-1.2.5\nDIFERENCIA DE ASISTENCIA ENTRE EL QUINTIL MAYOR Y EL PRIMER Y EL 2DO QUINTIL Y EL PRIMERO DE INGRESOS DE LOS HOGARES PARA 2011 Y DIFERENCIA CON 2010"]
["DIFERENCIAS",null,null,"EDADES SIMPLES"]
[null,null,null,12,13,14]
["Entre el Quintil mayor y el 1erQuintil",null,"Diferencia 2011",0.3,5.8,13.1]
[null,null,"Diferencia 2011-diferencia 2010 =",-1.2,-0.8,-2.7]
["Entre el 2do quintil y el 1erquintil",null,"Diferencia 2011",0.7,3,4.9000000000000004]
[null,null,"Diferencia 2011-diferencia 2010 =",0.3,-0.2,-2.9]
[]
["Fuentes:Elaboración propia en base en las ECH 2010 y 2011.\nNotas:Las diferencias “2011-2010” son el resultado de restar a la diferencia entre quintiles de 2011, idéntica diferencia entre quintiles de 2010. Estos valores son interpretados como indicadores de evolución de la brecha entre el año de referencia y el anterior.\nTodo el país (Años 2010y 2011)"]

{"sheet":"I-1.2.6","index":11,"n_rows":13,"n_cols":8,"rows_kept":13,"cut":false,"hidden":false,"merged":[[12,0,12,7],[2,0,2,7],[3,0,4,0],[0,0,0,7],[3,1,3,7]]}
["Ministerio de Educación y Cultura\nDirección de Educación"]
[]
["Cuadro I-1.2.6\nASISTENCIA POR GRUPOS DE EDADES TEORICAS Y NIVEL EDUCATIVO. AÑO 2011."]
["NIVEL EDUCATIVO","GRUPOS DE EDADES TEÓRICAS"]
[null,"4 a 5 años","6 a 11 años","12 a 14 años","15 a 17 años","18 a 24 años","25 a 29 años","Total"]
["No asiste",8.7783663228324507,1.6864381303496097,4.6845059067935875,22.828019438188928,61.42982643725329,80.692470067573595,35.403277018839333]
["Educación Inicial",88.466127683300812,3.3497517417718012,0,0,0,0,6.8620443173695493]
["Educación primaria",2.7555059938667412,94.246289340587822,19.387305819974575,0.74434040535735446,9.0740430352384965E-2,5.2241056373621239E-2,24.597505268938267]
["Educación media básica",0,0.71752078729076441,73.731667235124505,25.501363043735925,1.1258748937990184,0.42472403555789623,12.961051272061283]
["Educación media superior",0,0,2.1965210381073454,50.481806329263954,12.8108726686356,2.6774603201569778,10.688198498621027]
["Enseñanza Terciaria",0,0,0,0.44447078345383439,24.542685569959712,16.153104520337912,9.4879236241705467]
[]
["Fuente: Elaboración propia en base a la ECH 2011. "]

{"sheet":"I-1.2.7","index":12,"n_rows":18,"n_cols":6,"rows_kept":18,"cut":false,"hidden":false,"merged":[[3,0,4,0],[0,0,0,5],[2,0,2,5],[3,1,3,5],[18,1,18,5],[17,0,17,2]]}
["Ministerio de Educación y Cultura\nDirección de Educación"]
[]
["Cuadro I-1.2.7\nJÓVENES DE 15 A 20 AÑOS DE EDAD POR ASISTENCIA A ALGÚN ESTABLECIMIENTO DE EDUCACIÓN Y ACTIVIDAD SEGÚN NIVEL EDUCATIVO MÁXIMO ALCANZADO"]
["NIVEL EDUCATIVO MÁXIMO\nALCANZADO","ASISTENCIA A ALGÚN ESTABLECIMIENTO DE EDUCACIÓN Y ACTIVIDAD"]
[null,"TOTAL","Asiste y trabaja o busca trabajo","Asiste y no trabaja ni busca trabajo","No Asiste y trabaja o busca trabajo","No asiste, no trabaja y no busca trabajo"]
["TOTAL ",100,12.9,48.9,25.6,12.5]
["Sin instrucción ",0.1,0,0,0,0.1]
["Educación inicial ",0,0,0,0,0]
["Primaria incompleta ",2.4,0.1,0.4,0.8,1.2]
["Primaria completa ",11.5,0,0,7,4.5]
["Media básica incompleta ",25.1,2,12.2,7.2,3.6]
["Media básica completa ",6.5,0,0,5.0999999999999996,1.4]
["Media superior incompleta ",41.1,7.7,28.9,3.7,0.8]
["Media superior completa ",2.5,0,0,1.7,0.8]
["Terciaria Incompleta ",10.7,3.1,7.4,0.2,0.1]
["Terciaria Completa ",0.1,0,0,0,0]
[]
["Fuentes: Elaboración propia en base a la ECH 2011.Nota: Todo el país (Año 2011)"]

{"sheet":"I.1.2.8","index":13,"n_rows":13,"n_cols":7,"rows_kept":13,"cut":false,"hidden":false,"merged":[[7,0,7,1],[8,0,8,1],[13,1,13,6],[9,0,9,1],[10,0,10,1],[11,0,11,1],[12,0,12,5],[0,0,0,6],[2,0,2,6],[3,2,3,6],[5,0,5,1],[6,0,6,1],[4,0,4,1]]}
["Ministerio de Educación y Cultura\nDirección de Educación"]
[]
["Cuadro I-1.2.8\nJÓVENES DE 15 A 20 AÑOS DE EDAD POR ASISTENCIA A ALGÚN ESTABLECIMIENTO DE EDUCACIÓN Y ACTIVIDAD SEGÚN AÑO LECTIVO"]
[null,null,"ASISTENCIA A ALGÚN ESTABLECIMIENTO DE EDUCACIÓN Y ACTIVIDAD"]
["AÑO LECTIVO",null,"Asiste y no trabaja ni busca trabajo","Asiste y trabaja o busca trabajo","No asiste y trabaja o busca trabajo","No asiste y no trabaja ni busca trabajo","TOTAL"]
[2006,null,47.9,14.4,25.7,12.1,100]
[2007,null,47.1,13.9,27.3,11.8,100]
[2008,null,48.2,13.3,25.9,12.6,100]
[2009,null,48.4,14.3,25.6,11.7,100]
[2010,null,48.2,13.2,26.2,12.4,100]
[2011,null,48.9,12.9,25.6,12.5,100]
[]
["Fuentes: Elaboración propia en base a la ENHA 2006 y a las ECH 2007 a 2011. \nNota:Todo el país (Años 2006 a 2011)"]

{"sheet":"I.1.2.9","index":14,"n_rows":14,"n_cols":8,"rows_kept":14,"cut":false,"hidden":false,"merged":[[12,0,12,7],[3,0,4,1],[11,0,11,1],[13,0,13,7],[14,0,14,7],[0,0,0,6],[7,0,7,1],[8,0,8,1],[9,0,9,1],[10,0,10,1],[5,0,5,1],[6,0,6,1],[2,0,2,7],[3,2,4,2],[3,3,3,4],[3,6,3,7]]}
["Ministerio de Educación y Cultura\nDirección de Educación"]
[]
["Cuadro I-1.2.9\nJÓVENES DE 12 A 29 AÑOS DE EDAD POR TRAMOS DE EDAD Y QUINTILES EXTREMOS DE INGRESO SEGÚN LA PRINCIPAL RAZÓN POR LA CUAL SE HA DESVINCULADO DEL SISTEMA EDUCATIVO"]
["NIVEL EDUCATIVO MÁXIMO",null,"TOTAL","TRAMOS DE EDAD",null,null,"QUINTILES EXTREMOS DE INGRESO"]
[null,null,null,"12 a 17 años","18 a 29 años",null,"Primer\nquintil","Quintil mayor"]
["TOTAL  ",null,100,100,100,null,100,100]
["Comenzó a trabajar  ",null,29.6,5.5,32.799999999999997,null,21.9,36.799999999999997]
["No tenía interés o le interesaban otras cosas  ",null,45,62.8,42.6,null,44.2,46.8]
["Quedó ella o su pareja embarazada  ",null,6.2,4.4000000000000004,6.4,null,10.3,0.6]
["Le resultaba difícil  ",null,6,9.1999999999999993,5.6,null,6.9,4.8]
["Debió atender asuntos familiares  ",null,5.5,5.3,5.6,null,7.6,4]
["Otras razones  ",null,7.6,12.9,6.9,null,9,7]
[]
["Fuentes: Elaboración propia en base a la ECH 2011.\nNota: Jóvenes de 12 a 29 años de todo el país, que declararon haber asistido a educación media pero que hoy no lo hacen (Año 2011)"]

{"sheet":"I-1.2.10","index":15,"n_rows":20,"n_cols":4,"rows_kept":20,"cut":false,"hidden":false,"merged":[[3,1,3,2],[0,0,0,2],[2,0,2,3]]}
["Ministerio de Educación y Cultura\nDirección de Educación"]
[]
["Cuadro I-1.2.10\nSITUACIÓN DE LOS JÒVENES QUE NO ESTUDIAN Y NO TRABAJAN POR ASISTENCIA Y CONDICIÓN DE ACTIVIDAD SEGÚN SEXO, GRANDES ÁREAS Y QUINTILES DE INGRESOS DE LOS HOGARES."]
[null,"ASISTENCIA Y CONDICIÓN DE ACTIVIDAD ECONÓMICA",null,"Total"]
[null,"No estudia y no trabaja, pero en las últimas 4 semanas buscó trabajo","No estudia, no trabaja y no busca trabajo"]
["SEXO"]
["Hombre ",50.2,33.799999999999997,39.4]
["Mujer ",49.8,66.2,60.6]
["GRANDES ÁREAS"]
["Montevideo ",38.1,34,35.5]
["Resto del país ",61.9,66,64.5]
["QUINTILES DE INGRESOS DE LOS HOGARES"]
["1er quintil ",42.7,48.8,46.7]
["2do quintil ",25.4,26.2,25.9]
["3er quintil ",15.6,14.1,14.6]
["4to quintil ",11.9,7.3,8.9]
["Quintil mayor ",4.4000000000000004,3.6,3.9]
["Total ",100,100,100]
[]
["Fuente: Elaboración propia en base a la ECH 2011."]

{"sheet":"I-1-2-11","index":16,"n_rows":15,"n_cols":4,"rows_kept":15,"cut":false,"hidden":false,"merged":[[0,0,0,3],[14,0,14,3],[3,1,4,2],[13,0,13,3],[2,0,2,3],[3,0,5,0],[3,3,5,3]]}
["Ministerio de Educación y Cultura\nDirección de Educación"]
[]
["Cuadro I-1.2.11\nSITUACIÓN DE LOS JÒVENES QUE NO ESTUDIAN Y NO TRABAJAN POR ASISTENCIA Y CONDICIÓN DE ACTIVIDAD SEGÚN NIVEL EDUCATIVO ALCANZADO"]
["NIVEL EDUCATIVO ALCANZADO","ASISTENCIA Y CONDICIÓN\nDE ACTIVIDAD ECONÓMICA",null,"Total"]
[]
[null,"No estudia y no trabaja, pero en las últimas 4 semanas buscó trabajo","No estudia, no trabaja y no busca trabajo"]
["Sin instrucción ",0,0.8,0.1]
["Educación inicial ",0,0.1,0]
["Primaria ",27.2,42.6,15.9]
["Media Básica ",45.9,40,39.200000000000003]
["Media Superior ",23.3,14.5,26.4]
["Terciaria Completa ",3.6,1.9,18.399999999999999]
["Total",100,100,100]
[]
["Fuente:Elaboración propia en base a la ECH 2011."]

{"sheet":"I-1.2.12","index":17,"n_rows":71,"n_cols":13,"rows_kept":71,"cut":false,"hidden":false,"merged":[[12,1,12,2],[0,0,0,4],[2,0,2,12],[3,0,3,12],[4,0,5,2],[4,3,4,12],[6,0,6,2],[7,0,7,2],[8,0,8,2],[9,0,9,2],[10,1,10,2],[11,0,11,2],[24,0,24,2],[13,0,13,2],[14,0,14,2],[15,0,15,2],[16,0,16,2],[17,0,17,2],[18,1,18,2],[19,0,19,2],[20,0,20,2],[21,1,21,2],[22,0,22,2],[23,0,23,2],[36,0,36,2],[25,1,25,2],[26,0,26,2],[27,0,27,2],[28,0,28,2],[29,0,29,2],[30,0,30,2],[31,1,31,2],[32,0,32,2],[33,0,33,2],[34,0,34,2],[35,0,35,2],[48,0,48,2],[37,0,37,2],[38,1,38,2],[39,0,39,2],[40,0,40,2],[41,0,41,2],[42,0,42,2],[43,0,43,2],[44,0,44,2],[45,0,45,2],[46,0,46,2],[47,1,47,2],[60,0,60,2],[49,1,49,2],[50,0,50,2],[51,0,51,2],[52,0,52,2],[53,1,53,2],[54,0,54,2],[55,0,55,2],[56,0,56,2],[57,0,57,2],[58,0,58,2],[59,0,59,2],[72,0,72,12],[61,0,61,2],[62,1,62,2],[63,0,63,2],[64,1,64,2],[65,0,65,2],[66,0,66,2],[67,0,67,2],[68,0,68,2],[69,1,69,2],[70,0,70,12],[71,0,71,12],[73,0,73,12],[74,0,74,12],[75,0,75,12],[76,0,76,12],[77,0,77,12]]}
["Ministerio de Educación y Cultura\nDirección de Educación"]
[]
["Cuadro I-1.2.12"]
["MATRÍCULA DEL SISTEMA EDUCATIVO POR AÑO LECTIVO SEGÚN NIVEL, FORMA DE ADMINISTRACIÓN Y MODALIDAD"]
["NIVEL/FROMA DE ADMINISTRACIÓN/MODALIDAD",null,null,"AÑO LECTIVO"]
[null,null,null,2002,2003,2004,2005,2006,2007,2008,2009,2010,2011]
[]
["TOTAL SISTEMA  ",null,null,{"$f":"D9+D17+D30+D46+D52","v":943130},949606,954690,937573,950464,949746,973186,986125,969735,{"$f":"M9+M17+M30+M46+M52","v":966167}]
["Total Edu. en la Primera Infancia e Inicial  ",null,null,{"$f":"D11+D13","v":144319},133964,140628,133640,144052,141307,160934,173003,160504,{"$f":"M11+M13","v":156089}]
[]
[null,"Primera Infancia1 ",null,38096,30345,35413,28069,37416,34429,47928,61112,50685,47845]
[]
[null,"Total Educación Inicial2 ",null,{"$f":"D14+D15","v":106223},103619,105215,105571,106636,106878,113006,111891,109819,{"$f":"M14+M15","v":108244}]
["Inicial pública  ",null,null,86906,85628,84612,83546,81833,81176,86001,83854,81875,79405]
["Inicial privada  ",null,null,19317,17991,20603,22025,24803,25702,27005,28037,27944,28839]
[]
["Total Educación Primaria3 ",null,null,{"$f":"D19+D22+D26","v":365004},{"$f":"E19+E22+E26","v":365495},367428,365840,365879,360653,354852,349271,346183,{"$f":"M19+M22+M26","v":340989}]
[]
[null,"Primaria Común3 ",null,{"$f":"D20+D21","v":353826},354843,355568,354777,353528,348579,342498,336865,330548,{"$f":"M20+M21","v":325509}]
["Común pública3 ",null,null,307756,311141,311350,309286,306030,300143,292542,286092,279445,273440]
["Común privada ",null,null,46070,43702,44218,45491,47498,48436,49956,50773,51103,52069]
[null,"Primaria Especial  ",null,{"$f":"D23+D24","v":11178},10652,11860,11063,12351,12074,12354,12406,11808,{"$f":"M23+M24","v":11253}]
["Especial pública ",null,null,9076,8884,8553,8379,8221,7913,7778,7535,7416,7286]
["Especial privada  ",null,null,2102,1768,3307,2684,4130,4161,4576,4871,4392,3967]
[]
[null,"Programa Jóvenes y Adultos ANEP ",null,null,null,null,null,null,null,null,null,{"$f":"L27+L28","v":3827},{"$f":"M27+M28","v":4227}]
["Educación Primaria (Niveles I y II) ",null,null,null,null,null,null,null,null,null,null,2803,3186]
["Pruebas de Acreditación ",null,null,null,null,null,null,null,null,null,null,1024,1041]
[]
["Total Educación Media  ",null,null,{"$f":"D32+D39","v":295399},306417,306778,302311,300681,298925,310128,320420,322977,{"$f":"M32+M39","v":331659}]
[]
[null,"Total Educación Media Básica ",null,{"$f":"D33+D34+D37","v":162664},164180,161736,158131,160028,160367,171502,177015,177619,{"$f":"M33+M34+M37","v":182175}]
["Ciclo Básico Rural (7º, 8º y 9º) ",null,null,1498,1771,1869,1797,1818,1784,2028,1991,1934,1966]
["Total Media Básica General  ",null,null,146588,147146,144374,140743,142350,142420,151798,155409,155444,{"$f":"M35+M36","v":156418}]
["Pública  ",null,null,125367,127162,123869,120487,121195,120960,127681,130013,130073,130978]
["Privada4 ",null,null,21221,19984,20505,20256,21155,21460,24117,25396,25371,25440]
["Media Básica  Tecnológica ",null,null,14578,15263,15493,15591,15860,16163,17676,19615,20241,23791]
[]
[null,"Total Educación Media Superior  ",null,{"$f":"D40+D44","v":132735},142237,145042,144180,140653,138558,138626,143405,145358,{"$f":"M40+M44","v":149484}]
["Total Media Superior General  ",null,null,122617,129454,127356,124512,119418,112877,110507,112664,113327,{"$f":"M41+M42","v":116117}]
["Pública  ",null,null,108589,115157,112669,108459,103938,97136,94506,96319,96902,99175]
["Privada4 ",null,null,14028,14297,14687,16053,15480,15741,16001,16345,16425,16942]
[]
["Total Media Superior Tecnológica  ",null,null,10118,12783,17686,19668,21235,25681,28119,30741,32031,33367]
[]
["Total Edu. Técnica (s/cont. educativa) ",null,null,{"$f":"D48+D50","v":36416},37219,32372,27146,28840,24419,19957,16769,11912,{"$f":"M48+M50","v":7546}]
[]
[null,"Nivel Básico Tecnológico   ",null,20154,21719,20724,18180,19336,18539,16387,13653,9800,6443]
[]
[null,"Nivel Superior Tecnológico   ",null,16262,15500,11648,8966,9504,5880,3570,3116,2112,1103]
[null,null,null,null,null,null,null,null,null,null,null,". "]
["Total Educación Terciaria ",null,null,{"$f":"D54+D63+D65","v":101992},{"$f":"E54+E63+E65","v":106511},107484,108636,111012,124442,127315,126662,128159,{"$f":"M54+M63+M65","v":129884}]
[]
[null,"Terciaria No Universitaria  ",null,{"$f":"D56+D61","v":5621},7351,6866,5798,6088,6403,7357,7739,8072,{"$f":"M56+M61","v":7662}]
[]
["Terciaria No Universitaria Pública  ",null,null,{"$f":"D57+D58+D59","v":5148},6107,6421,5493,5957,6250,7182,7643,8024,{"$f":"M57+M58+M59","v":7569}]
["CETP ",null,null,2564,3514,3671,4024,3961,3896,4650,4964,6158,6780]
["Terciaria Policial o Militar ",null,null,620,623,653,679,724,652,557,649,603,470]
["Otras terciaria pública5 ",null,null,1964,1970,2097,790,1272,1702,1975,2030,1263,319]
[]
["Terciaria No Universitaria Privada6 ",null,null,473,1244,445,305,131,153,175,96,48,93]
[]
[null,"Formación en Educación ",null,16610,19298,20968,20435,21175,21992,22108,20391,20191,20919]
[]
[null,"Total Educación Universitaria7 ",null,{"$f":"D67+D69","v":79761},79862,79650,82403,83749,96047,97850,98532,99896,{"$f":"M67+M69","v":101303}]
[]
["Universitaria Pública (UdelaR)8 ",null,null,70156,70156,70156,70156,70156,81774,81774,81774,81774,81774]
[]
["Universitaria Privada  ",null,null,9605,9706,9494,12247,13593,14273,16076,16758,18122,19529]
[]
["Fuentes: Departamentos de Estadística (u oficinas productoras de información) del CEP, CES y CETP y de la Universidad de la República,  Dirección de Formación y Perfeccionamiento Docente, e instituciones privadas de educación terciaria\nNotas: \n1- Los datos de primera infancia de 2006 fueron corregidos para 2007, ya que por error se contabilizaron centros pertenecientes al censo 2007 que eran reportados por primaria.\n2- En el caso de CAÍF solo se tomaron niños de 2 a 5 años que son los que asisten a inicial, no se tomaron los niños de 0 y1 año.\n3- El dato de Educación Primaria Común Pública para 2011 incluyen 1.041 acreditados por el Programa Nacional de Jóvenes y Adultos de ANEP(Acreditación de Primaria).\n4- Los datos de secundaria privada corresponden a la educación secundaria habilitada, que se componen en su gran mayoría por liceos privados a los que se suma el Liceo Militar y el bachillerato de la Escuela Naval.\n5- La baja significativa de matriculados en la categoría “Otras terciaria pública” en 2005, responde a que el ISEF no reportó información para dicho año sí lo había hecho en 2004 (1181 matriculados). En 2006 y 2007 reportó en UdelaR, institución a la pasó a formar parte.\n6- Algunas instituciones de educación terciaria no universitaria privada fueron reportadas en distintos niveles a lo largo de la serie o bien no reportaron en algunos de los años, lo que explica la irregularidad de la evolución de la matrícula en este nivel.\n7- Los datos de enseñanza terciaria universitaria pública y privada corresponden a carreras cortas y de grado (excluyen carreras de postgrado).\n8- Los datos de UdelaR del 2000 a 2006 corresponden a una proyección realizada del Censo 1999 de carreras de grado. El dato de 2007 corresponde al Censo 2007 y los datos 2008 a 2011 responden a la proyección del Censo 2007 (no incluyen carreras de postgrado)\n"]

{"sheet":"I-1.2.13","index":18,"n_rows":35,"n_cols":10,"rows_kept":35,"cut":false,"hidden":false,"merged":[[37,1,39,14],[5,5,5,6],[5,7,6,7],[5,8,5,9],[7,0,8,0],[10,0,11,0],[13,0,14,0],[34,0,34,9],[0,0,0,4],[2,0,2,9],[3,0,6,0],[3,1,3,9],[4,1,4,3],[4,4,4,6],[4,7,4,9],[5,1,6,1],[5,2,5,3],[5,4,6,4]]}
["Ministerio de Educación y Cultura\nDirección de Educación"]
[]
["Cuadro I-1.2.13\nMATRICULA POR NIVEL Y FORMA DE ADMINISTRACIÓN SEGÚN GRANDES ÁREAS Y DEPARTAMENTO"]
["GRANDES ÁREAS / DEPARTAMENTO","NIVEL / FORMA DE ADMINISTRACIÓN"]
[null,"EDUCACIÓN INICIAL",null,null,"EDUCACIÓN PRIMARIA",null,null,"EDUCACIÓN MEDIA"]
[null,"Total","FORMA DE ADMINISTRACIÓN",null,"Total","FORMA DE ADMINISTRACIÓN",null,"Total","FORMA DE ADMINISTRACIÓN"]
[null,null,"Pública","Privada",null,"Pública","Privada",null,"Pública","Privada"]
["TOTAL ",{"$f":"B11+B14","v":108244},79405,28839.000000000004,337803,281767,56036,331659,289277,42382]
[null,{"$f":"C9+D9","v":100},{"$f":"C8/B8*100","v":73.357414729684791},{"$f":"D8/B8*100","v":26.642585270315216},{"$f":"F9+G9","v":100},{"$f":"F8/E8*100","v":83.411633407636998},{"$f":"G8/E8*100","v":16.588366592363005},{"$f":"I9+J9","v":100},{"$f":"I8/H8*100","v":87.221212148622527},{"$f":"J8/H8*100","v":12.778787851377468}]
[]
["MONTEVIDEO ",{"$f":"C11+D11","v":41202.000000000007},23693.000000000004,17509.000000000004,{"$f":"F11+G11","v":120699},86302,34397,{"$f":"I11+J11","v":124850},95916,28934]
[null,{"$f":"C12+D12","v":100},{"$f":"C11/B11*100","v":57.504490073297411},{"$f":"D11/B11*100","v":42.495509926702589},{"$f":"F12+G12","v":100},{"$f":"F11/E11*100","v":71.501835143621733},{"$f":"G11/E11*100","v":28.49816485637826},{"$f":"I12+J12","v":100},{"$f":"I11/H11*100","v":76.824989987985575},{"$f":"J11/H11*100","v":23.175010012014418}]
[]
["RESTO DEL PAÍS ",{"$f":"C14+D14","v":67042},{"$f":"SUM(C16:C33)","v":55712},{"$f":"SUM(D16:D33)","v":11330},{"$f":"F14+G14","v":217104},{"$f":"SUM(F16:F33)","v":195465},{"$f":"SUM(G16:G33)","v":21639},{"$f":"I14+J14","v":206809},{"$f":"SUM(I16:I33)","v":193361},{"$f":"SUM(J16:J33)","v":13448}]
[null,100,{"$f":"C14/B14*100","v":83.100146177023362},{"$f":"D14/B14*100","v":16.899853822976642},100,{"$f":"F14/E14*100","v":90.032887464072516},{"$f":"G14/E14*100","v":9.9671125359274821},100,{"$f":"I14/H14*100","v":93.497381641998174},{"$f":"J14/H14*100","v":6.5026183580018273}]
["Artigas  ",2169.0000000000005,2074.0000000000005,95,9294,9040,254,9070,9017,53]
["Canelones  ",16733,12984,3749,53256,46243,7013,50256,45662,4594]
["Cerro Largo  ",2941,2666,275,10154,9539,615,9475,9120,355]
["Colonia  ",4134.9999999999991,3538.9999999999991,596,11615,10891,724,11948,11903,45]
["Durazno  ",1873,1647,226,6713,6079,634,6193,5838,355]
["Flores  ",821,648,173,2656,2288,368,2722,2496,226]
["Florida  ",1994,1782,212,6931,6573,358,6344,6110,234]
["Lavalleja  ",2190,1848,342,5882,5267,615,5898,5681,217]
["Maldonado  ",5924.0000000000009,3877,2047.0000000000007,18018,13998,4020,16685,13956,2729]
["Paysandú  ",3931.0000000000005,3427.0000000000005,504,13769,12318,1451,12080,11050,1030]
["Río Negro  ",2256,1971,285,6675,6065,610,5802,5603,199]
["Rivera  ",4097,3647.9999999999995,449,12362,11682,680,12340,11685,655]
["Rocha  ",2401,2162,239,7620,7120,500,7377,7109,268]
["Salto  ",4784.0000000000009,3930.0000000000009,854,15342,14045,1297,14384,13597,787]
["San José  ",3675,3225,450,10976,10400,576,10397,9927,470]
["Soriano  ",2870.9999999999995,2606.9999999999995,264,9918,8824,1094,9458,9163,295]
["Tacuarembo ",3002.0000000000005,2516.0000000000005,486,10601,9958,643,10672,10051,621]
["Treinta y Tres  ",1245,1161,84,5322,5135,187,5708,5393,315]
[]
["Nota : Educacion Primaria  Incluye alumnos participantes en prueba de acreditación (1041)."]

{"sheet":"I-2.1.14","index":19,"n_rows":18,"n_cols":9,"rows_kept":18,"cut":false,"hidden":false,"merged":[[6,0,6,1],[0,0,0,3],[2,0,2,8],[5,0,5,1],[3,2,3,8],[3,0,4,1],[17,0,17,8],[7,0,7,1],[8,0,8,1],[9,0,9,1],[15,0,15,1],[16,0,16,8],[10,0,10,1],[11,0,11,1],[12,0,12,1],[13,0,13,1],[14,0,14,1]]}
["Ministerio de Educación y Cultura\nDirección de Educación"]
[]
["Cuadro I-1.2.14\nPORCENTAJE DE POBLACIÓN DE 25 AÑOS O MÁS POR TRAMOS DE EDAD SEGÚN NIVEL EDUCATIVO MÁXIMO ALCANZADO"]
["NIVEL EDUCATIVO MÁXIMO\nALCANZADO",null,"TRAMOS DE EDAD"]
[null,null,"TOTAL","25 a 29 años","30 a 39 años","40 a 49 años","50 a 59 años","60 a 69 años","70 y más años"]
["TOTAL ",null,100,100,100,100,100,100,100]
["Sin instrucción ",null,0.8,0.2,0.3,0.3,0.6,0.9,2.5]
["Primaria incompleta ",null,11.5,2.9,3.7,5.6,10.1,20.2,30.2]
["Primaria completa ",null,28.4,16,20.5,28.5,30.1,35.299999999999997,40.1]
["HASTA PRIMARIA COMPLETA ",null,40.700000000000003,19.100000000000001,24.5,34.4,40.799999999999997,56.4,72.8]
["Media básica incompleta ",null,8.6999999999999993,11.7,10.9,9.8000000000000007,8.1999999999999993,6.4,4.5999999999999996]
["Media básica completa ",null,10.5,12.4,14.7,12.7,10.199999999999999,7.2,4]
["Media superior incompleta ",null,13.5,17.8,17.899999999999999,14.8,13.4,9.4,6.1]
["Media superior completa ",null,8.1,8.4,8.9,8.6999999999999993,10.3,7.1,4.0999999999999996]
["Terciaria Incompleta ",null,7.8,18.8,9.8000000000000007,7.4,5.9,4.4000000000000004,2.8]
["Terciaria Completa ",null,10.8,11.8,13.2,12.3,11.4,9,5.6]
[]
["Fuentes:Elaboración propia en base a la Encuesta Continua de Hogares 2011.\nNota:Todo el país (Año 2011)"]

{"sheet":"I.2.2.1","index":20,"n_rows":9,"n_cols":5,"rows_kept":9,"cut":false,"hidden":false,"merged":[[0,0,0,1],[7,0,7,4],[2,0,2,4],[3,0,4,0],[8,0,8,4],[3,1,3,3]]}
["Ministerio de Educación y Cultura\nDirección de Educación\n"]
[]
["Cuadro I-2.2.1\nTASA NETA DE MATRICULACIÓN ENTRE LOS NIÑOS DE 3 A 5 AÑOS POR AÑO LECTIVO Y TRAMOS DE EDAD"]
["TRAMOS\nDE EDAD","AÑO LECTIVO",null,null,"TOTAL"]
[null,2008,2009,2010,2011]
["3 a 5 años ",76.8,81.2,81.900000000000006,81.5]
["4 y 5 años ",88.9,92,91.9,91.2]
[]
["Fuente: Elaboración propia en base en las ECH 2008 a 2011 del INE"]

{"sheet":"I.2.2.2.","index":21,"n_rows":13,"n_cols":3,"rows_kept":13,"cut":false,"hidden":false,"merged":[[11,0,11,2],[12,0,12,2],[0,0,0,2],[2,0,2,2],[4,0,5,0]]}
["Ministerio de Educación y Cultura\nDirección de Educación"]
[]
["Cuadro I-2.2.2\nMATRÍCULA EN EDUCACIÓN PRIMARIA ESPECIAL SEGÚN REGIÓN Y FORMA DE ADMINISTRACIÓN"]
["REGIÓN Y FORMA DE ADMINISTRACIÓN","Cantidad\nabsoluta","Porcentaje"]
["TOTAL REGIÓN",12406,100]
[]
["Montevideo ",5762,46.4]
["Resto del país ",6644,53.6]
["FORMA DE ADMINISTRACIÓN"]
["Público ",7535,60.7]
["Privado ",4871,39.299999999999997]
[]
["Fuentes: Elaboración propia en base a información del Departamento de Estadística del CEIP."]

{"sheet":"I.2.2.3","index":22,"n_rows":12,"n_cols":13,"rows_kept":12,"cut":false,"hidden":false,"merged":[[11,1,11,12],[0,0,0,11],[2,0,2,12],[10,0,10,12],[4,0,5,0],[4,1,4,12]]}
["Ministerio de Educación y Cultura\nDirección de Educación"]
[]
["Cuadro I-2.2.3\nMATRÍCULA EN EDUCACIÓN PRIMARIA PÚBLICA COMÚN POR AÑO LECTIVO SEGÚN ÁREAS DEMOGRÁFICAS  \n(2001 – 2011)"]
[]
["ÁREAS ","AÑO LECTIVO"]
[null,2000,2001,2002,2003,2004,2005,2006,2007,2008,2009,2010,2011]
["Urbana ",285077,288168,291484,294182,293879,292143,285826,280554,273491,267638,262192,256775]
["Rural ",16105,16284,16272,16959,17471,17143,20204,19589,19051,18454,17253,16665]
["% Urbana ",94.7,94.7,94.7,94.5,94.4,94.5,93.4,93.5,93.5,93.6,93.8,93.9]
[]
[]
["Fuente: Elaboración ","propia en base a información del Departamento de Estadística del CEIP"]

{"sheet":"I.2.2.4","index":23,"n_rows":14,"n_cols":3,"rows_kept":14,"cut":false,"hidden":false,"merged":[[0,0,0,2],[0,3,0,5],[2,0,2,2],[12,0,12,2],[13,0,13,2]]}
["Ministerio de Educación y Cultura\nDirección de Educación\n"]
[]
["Cuadro I-2.2.4\nPORCENTAJE DE ASISTENCIA INSUFICIENTE Y ABANDONO INTERMITENTE DE  1º A 6º GRADO EN EDUCACIÓN PRIMARIA COMÚN PÚBLICA SEGÚN REGIONES Y CONTEXTO 1er QUINTIL Y QUINTIL MAYOR (AÑO 2011)"]
[null,"ASISTENCIA INSUFICIENTE","ABANDONO INTERMITENTE"]
["TOTAL",6.1,1.1000000000000001]
["MONTEVIDEO ",8.1,1.5]
["RESTO DEL PAÍS ",5.2,0.9]
["1Quintil-Urbano ",10.8,2.1]
["1Quintil-Rural ",5.7,2.4]
["5Quintil-Urbano ",2.7,0.6]
["5Quintil-Rural ",3.8,0.2]
[]
[]
["Fuentes:Monitor Educativo de Enseñanza Estado de Situación 2011."]

{"sheet":"I.2.4.1","index":24,"n_rows":23,"n_cols":4,"rows_kept":23,"cut":false,"hidden":false,"merged":[[2,0,2,3],[3,2,3,3],[22,0,22,3],[3,1,4,1],[3,0,4,0]]}
["Ministerio de Educación y Cultura\nDirección de Educación\n"]
[]
["Cuadro I-2.4.1.\nESTABLECIMIENTOS DE EDUCACIÓN TÉCNICO PROFESIONAL POR TIPO DE ESTABLECIMIENTO SEGÚN GRANDES ÁREAS"]
[null,"TOTAL","GRANDES ÁREAS"]
[null,null,"Resto del País","Montevideo"]
["TOTAL",{"$f":"C6+D6","v":173},{"$f":"SUM(C7:C19)","v":136},{"$f":"SUM(D7:D19)","v":37}]
["básica",{"$f":"C7+D7","v":13},8,5]
["basica y superior",19,19,0]
["superior",10,9,1]
["terciaria",34,30,4]
["jya",5,2,3]
["superior y terciaria",8,4,4]
["superior y jya",11,6,5]
["basico superior y jya",19,12,7]
["superior terc y jya",9,3,6]
["basico superior y terciaria",11,9,2]
["basico superior  jya y terciaria",31,31,0]
["terciaria y jya",1,1,0]
["básica y jya",2,2,0]
[]
[]
["Fuentes: Departamento de Estidísticas  CETP-UTU "]
["Nota: Dentro de la cantidad de establecimentos declarados se encuentran 50 reparticiones denominadas\nsatelites en las cuales se  imparten cursos administrados por el CETP, en establecimientos que no forman parte de los activos de ANEP. "]

{"sheet":"I.2.4.2","index":25,"n_rows":14,"n_cols":11,"rows_kept":14,"cut":false,"hidden":false,"merged":[[5,9,5,10],[2,0,2,6],[0,0,0,4],[3,0,6,1],[3,2,3,10],[13,0,13,10],[4,2,4,4],[8,0,8,1],[5,3,5,4],[10,0,10,1],[11,0,11,1],[12,0,12,1],[4,8,4,10],[7,0,7,1],[9,0,9,1],[4,5,4,7],[5,6,5,7]]}
["Ministerio de Educación y Cultura\nDirección de Educación\n"]
[]
["Cuadro  I.2.4.2\nALUMNOS MATRICULADOS EN EDUCACIÓN TÉCNICA POR GRANDES ÁREAS Y SEXO SEGÚN NIVEL Y TIPO DE CURSO"]
["NIVEL\nDEL CURSO",null,"GRANDES ÁREAS"]
[null,null,"TOTAL",null,null,"MONTEVIDEO",null,null,"RESTO DEL PAÍS"]
[null,null,null,"Sexo",null,null,"Sexo",null,null,"Sexo"]
[null,null,"Total","Femenino","Masculino","Total","Femenino","Masculino","Total","Femenino","Masculino"]
["TOTAL ",null,{"$f":"D8+E8","v":71484},{"$f":"SUM(D9:D13)","v":30740},{"$f":"SUM(E9:E13)","v":40744},{"$f":"G8+H8","v":27756},{"$f":"SUM(G9:G13)","v":11776},{"$f":"SUM(H9:H13)","v":15980},{"$f":"J8+K8","v":43728},{"$f":"SUM(J9:J13)","v":18964},{"$f":"SUM(K9:K13)","v":24764}]
["Educación Media Básica ",null,23791,{"$f":"G9+J9","v":9255},{"$f":"H9+K9","v":14536},4259,1631,2628,19532,7624,11908]
["Educación Media superior",null,33367,{"$f":"G10+J10","v":14896},{"$f":"H10+K10","v":18471},15042,6296,8746,18325,8600,9725]
["Nivel Básico de Formación Profesional",null,6443,3127,3316,3562,1778,1784,2881,1349,1532]
["Nivel Superior de Formación Profesional",null,1103,690,413,664,396,268,439,294,145]
["Terciaria no universitaria ",null,6780,2772,4008,4229,1675,2554,2551,1097,1454]
["Fuente: Elaboración propia en base a información del Departamento de Estadísticas CETP - U.T.U"]

{"sheet":"I.2.4.3","index":26,"n_rows":17,"n_cols":8,"rows_kept":17,"cut":false,"hidden":false,"merged":[[0,0,0,5],[3,3,3,7],[16,0,16,6],[5,0,5,1],[7,0,7,1],[6,0,6,1],[13,0,13,1],[9,0,9,1],[8,0,8,1],[14,0,14,1],[12,0,12,1],[10,0,10,1],[11,0,11,1],[2,0,2,6],[3,0,4,1],[3,2,4,2]]}
["Ministerio de Educación y Cultura \nDirección de Educación Área de Investigación y Estadística"]
[]
["Cuadro I.2.4.3\nALUMNOS MATRICULADOS EN EDUCACIÓN MEDIA, TÉCNICA Y TERCIARIA POR NIVEL DEL CURSO SEGÚN SECTORES DE ESTUDIO"]
["ÁREAS\nDE ESTUDIO",null,"TOTAL","NIVEL DEL CURSO"]
[null,null,null,"Educación Media Básica","Educación Media Superior","Nivel Básico de Formación Profesional","Nivel Superior de Formación Profesional","Nivel Terciario"]
["TOTAL ",null,{"$f":"SUM(D6:H6)","v":71484},{"$f":"SUM(D7:D15)","v":23791},{"$f":"SUM(E7:E15)","v":33367},6443,1103,6780]
["Agricultura y Pesca",null,{"$f":"SUM(D7:H7)","v":2724},182,2101,56,0,385]
["Artes y Artesanías",null,{"$f":"SUM(D8:H8)","v":1121},0,117,1004,0,0]
["Comercio y Administración",null,13241,0,11480,68,117,1576]
["Comunicación",null,787,0,0,0,0,787]
["Construcción",null,3384,150,2613,319,8,294]
["Industria",null,17151,3191,7061,3662,239,2998]
["Informática",null,7347,779,5441,249,416,462]
["Programas Generales",null,17272,17272,0,0,0,0]
["Servicios",null,8457,2217,4554,1085,323,278]
[]
["Fuentes:Departamento de Estadísticas CETP - U.T.U"]

{"sheet":"I.2.6.1.","index":27,"n_rows":35,"n_cols":13,"rows_kept":35,"cut":false,"hidden":false,"merged":[[0,0,0,2],[2,0,2,3],[34,0,34,9],[3,1,3,12],[30,0,30,8],[31,0,31,8],[32,0,32,8],[33,0,33,9]]}
["Ministerio de Educación y Cultura\nDirección de Educación\n"]
[]
["Cuadro I.2.6.1\nEVOLUCIÓN DE LA MATRÍCULA DE LAS INSTITUCIONES UNIVERSITARIAS (2000 – 2011)"]
["INSTITUCIONES","AÑO LECTIVO"]
["UNIVERSITARIAS",2000,2001,2002,2003,2004,2005,2006,2007,2008,2009,2010,2011]
["TOTAL  ",{"$f":"B8+B18","v":78634},{"$f":"C8+C18","v":79678},79761,79862,79650,85019,86802,131000,132905,133699,135288,136946]
[]
["Total Universidades   ",{"$f":"SUM(B10,B12)","v":78419},{"$f":"SUM(C10,C12)","v":79340},79353,79449,79057,83621,85153,129122,130136,131409,132726,133910]
[]
["UdelaR ",70156,70156,70156,70156,70156,70156,70156,112891,112891,112891,112891,112891]
[]
["Universidades privadas  ",8263,9184,9197,9293,{"$f":"SUM(F13:F16)","v":8901},13465,14997,16231,17245,18518,19835,21019]
["Univ. Católica del Uruguay  ",4057,4180,3591,3849,3286,5580,5911,6401,7126,7227,7996,8899]
["Univ. ORT Uruguay  ",3445,3572,3900,3777,3827,5674,5863,6118,6442,7202,7199,7622]
["Univ. de Montevideo  ",575,775,749,824,916,1300,1612,1956,1938,2025,2175,2246]
["Univ. de la Empresa ",0,609,909,790,872,911,1611,1756,1739,2064,2465,2252]
[]
["Total Inst. Universitarios  ",{"$f":"SUM(B19:B28)","v":215},{"$f":"SUM(C19:C28)","v":338},408,413,593,1398,1649,1878,2769,2290,2562,{"$f":"SUM(M19:M30)","v":3036}]
["I.U. Autónomo del Sur ",215,211,218,184,195,318,428,414,428,515,605,691]
["I.U. Asoc. Cristiana de Jóvenes ",0,93,140,141,184,407,508,449,352,346,427,515]
["I.U. CLAEH ",0,0,0,39,91,283,412,483,483,740,651,706]
["I.U. Monseñor Mariano Soler ",0,0,0,0,59,65,50,83,54,50,42,61]
["I.U. Asoc. Psico. del Uru. ",0,0,0,0,35,25,31,29,34,38,40,48]
["I.U. Crandon ",0,0,0,0,29,60,59,72,21,89,78,57]
["I.U. San Francisco de Asís ",0,0,0,0,0,83,161,202,202,237,380,489]
["I.U. Bios ",0,0,0,0,0,157,0,146,178,112,109,94]
["I.U. Maldonado – P. del Este ","n/c","n/c","n/c","n/c","n/c","n/c","n/c","n/c",1017,"n/c","n/c","n/c"]
["I.U. CEDIIAP ",0,34,50,49,0,0,0,0,0,163,230,269]
["Escuela Naval","n/c","n/c","n/c","n/c","n/c","n/c","n/c","n/c","n/c","n/c","n/c","s/d"]
["Centro de Altos Estudios Nacionales","n/c","n/c","n/c","n/c","n/c","n/c","n/c","n/c","n/c","n/c","n/c",106]
["Fuentes: Oficinas productoras de cada una de las instituciones"]
["Nota:   UdelaR incluye tecnicaturas y grado, no incluye matrícula de postgrados"]
["Las Universidades privadas incluyen grado y postgrado. "]
["Para el instituto CEDIIAP no se incluye información de los años anteriores por no haber reportado información en el períodos 2004-2008. "]
["El Instituto Universitario \"Instituto de Estudios para la Salud y el Desarrollo Florence Ninghtingale\" (INSADE), que registrara actividad en los años 2000 a 2003 de la serie presentada, luego no reportó información, por lo cual fue retirado de la tabla. Sin embargo la matrícula correspondiente a dichos años sigue incluida en el ítem \"Total de Institutos Universitarios\"."]

{"sheet":"I.2.6.2.","index":28,"n_rows":30,"n_cols":13,"rows_kept":30,"cut":false,"hidden":false,"merged":[[28,0,28,12],[29,0,29,12],[30,0,30,12],[0,0,0,1],[2,0,2,12],[3,0,3,12],[4,0,5,0],[4,1,4,12]]}
["Ministerio de Educación y Cultura\nDirección de Educación \n"]
[]
["Cuadro I-2.6.2"]
["INGRESOS A INSTITUCIONES UNIVERSITARIAS POR AÑO LECTIVO SEGÚN ÁREA DE CONOCIMIENTO"]
["ÁREA DE CONOCIMIENTO","AÑO LECTIVO"]
[null,2000,2001,2002,2003,2004,2005,2006,2007,2008,2009,2010,2011]
["TOTAL ",18131,19265,20090,21169,21558,21964,22798,23014,23566,24981,26357,26283]
["Docencia y ciencias de la educación  ",315,505,542,588,515,766,911,901,941,709,800,785]
["Artes  ",488,539,574,642,710,809,744,752,746,839,1219,997]
["Humanidades  ",568,663,709,803,899,967,1038,889,909,791,541,707]
["Ciencias sociales y del comportamiento  ",2965,2466,3152,2933,3126,3353,2987,3057,4830,5692,5936,5399]
["Periodismo e información  ",945,838,1118,1174,972,1170,1219,1036,1038,1049,816,1218]
["Enseñanza comercial y administración  ",2546,4252,3903,4132,3942,3828,4292,4885,3127,3253,4176,3661]
["Derecho  ",2378,2033,2047,2087,1828,2000,1837,1754,1850,1855,2031,2005]
["Ciencias de la vida  ",474,492,515,633,815,785,955,939,818,581,650,649]
["Ciencias físicas  ",505,374,545,540,653,624,771,653,687,760,636,667]
["Matemáticas y estadística  ",107,142,113,131,324,244,328,329,238,218,155,176]
["Informática  ",792,701,749,790,813,843,917,962,1186,1248,1319,1280]
["Ingeniería y profesiones afines  ",720,676,672,752,767,570,701,633,671,686,856,828]
["Industria y producción  ",43,151,172,214,247,114,141,104,111,115,116,219]
["Arquitectura y construcción  ",788,704,756,645,602,628,648,665,646,832,770,754]
["Agricultura, silvicultura y pesca  ",210,225,176,252,283,398,362,414,436,638,806,864]
["Veterinaria  ",295,320,317,381,411,508,484,525,519,533,508,578]
["Medicina  ",3673,3817,3573,3960,4135,3633,3572,3562,3888,4823,4361,4656]
["Servicios sociales  ",311,367,457,498,508,724,573,626,594,87,146,82]
["Servicios personales  ",8,0,0,14,8,0,318,328,331,272,411,327]
["Protección del medio ambiente  ","n/c","n/c","n/c","n/c","n/c","n/c","n/c","n/c","n/c","n/c","n/c",6]
["Otras  ","n/c","n/c","n/c","n/c","n/c","n/c","n/c","n/c","n/c","n/c",104,327]
[]
["Fuente:Elaboración propia en base información de las oficinas productoras de las instituciones.\nNota:Las áreas corresponden a la clasificación CINE 1997 de UNESCO"]

{"sheet":"I.2.6.3","index":29,"n_rows":29,"n_cols":8,"rows_kept":29,"cut":false,"hidden":false,"merged":[[28,0,28,7],[2,0,3,7],[4,0,5,0],[4,3,4,7],[4,1,5,1],[4,2,5,2]]}
["Ministerio de Educación y Cultura Dirección de Educación \n"]
[]
["Cuadro I.2.6.3\nEGRESOS DE INSTITUCIONES UNIVERSITARIAS POR NIVEL ACADÉMICO SEGÚN ÁREA DE CONOCIMIENTO"]
[]
["INSTITUCIONES UNIVERSITARIAS","TOTAL","%","NIVEL ACADÉMICO"]
[null,null,null,"Carrera corta o tecnicatura","Carrera de grado, licenciatura","Postgrado de especialización","Maestría","Doctorado"]
["TOTAL ",{"$f":"SUM(D7:H7)","v":7808},{"$f":"SUM(C8:C27)","v":100.00000000000001},620,5857,534,761,36]
["Agricultura, silvicultura y pesca ",{"$f":"SUM(D8:H8)","v":294},{"$f":"(B8*100)/$B$7","v":3.7653688524590163},55,169,42,28,0]
["Arquitectura y construcción ",349,4.4697745901639347,0,316,0,33,0]
["Artes ",162,2.074795081967213,42,120,0,0,0]
["Ciencias de la vida ",240,3.0737704918032787,0,166,0,57,17]
["Ciencias físicas ",158,2.0235655737704916,4,129,0,17,8]
["Ciencias sociales y del comportamiento ",930,11.910860655737705,3,758,105,61,3]
["Derecho ",910,11.654713114754099,56,811,4,39,0]
["Enseñanza comercial y administración ",1239,15.868340163934427,185,726,214,114,0]
["Formación de personal docente y ciencias de la educación ",246,3.1506147540983607,65,54,64,59,4]
["Humanidades ",75,0.96055327868852458,11,59,2,3,0]
["Industria y producción ",25,0.32018442622950821,0,25,0,0,0]
["Informática ",277,3.5476434426229506,28,204,35,9,1]
["Ingeniería y profesiones afines ",232,2.971311475409836,15,199,1,14,3]
["Matemáticas y estadística ",11,0.1408811475409836,0,8,0,3,0]
["Medicina ",1953,25.012807377049182,126,1449,63,315,0]
["Periodismo e información ",241,3.086577868852459,19,222,0,0,0]
["Protección del medio ambiente",5,6.4036885245901634E-2,0,0,4,1,0]
["Servicios personales ",183,2.34375,11,170,0,2,0]
["Servicios sociales ",146,1.8698770491803278,0,146,0,0,0]
["Veterinaria ",132,1.6905737704918034,0,126,0,6,0]
[]
["Fuente: Elaboración propia en base información de las oficinas productoras de las instituciones \nNota: Las áreas corresponden a la clasificación CINE 1997 de UNESCO."]

{"sheet":"I.2.6.4","index":30,"n_rows":27,"n_cols":13,"rows_kept":27,"cut":false,"hidden":false,"merged":[[27,0,27,9],[26,0,26,9],[0,0,0,3],[3,0,4,0],[2,0,2,10],[3,1,3,12]]}
["Ministerio de Educación  y Cultura\nDirección de Educación\n"]
[]
["Cuadro I-2.6.4\nEGRESOS DE INSTITUCIONES UNIVERSITARIAS POR AÑO LECTIVO SEGÚN ÁREA DE CONOCIMIENTO - (2000 - 2011)"]
["INSTITUCIONES\nUNIVERSITARIAS","AÑO LECTIVO"]
[null,2000,2001,2002,2003,2004,2005,2006,2007,2008,2009,2010,2011]
["TOTAL ",{"$f":"SUM(B7:B26)","v":4646},4402,5902,5697,6177,5514,6151,6381,7018,7185,7223,{"$f":"SUM(M7:M26)","v":7808}]
["Agricultura, silvicultura y pesca ",226,145,164,161,213,123,126,111,164,301,279,294]
["Arquitectura y construcción ",233,136,294,208,308,437,324,303,280,275,341,349]
["Artes ",40,33,39,60,46,42,104,120,181,184,211,162]
["Ciencias de la vida ",97,62,72,73,107,108,141,137,183,169,166,240]
["Ciencias físicas ",110,94,153,118,162,140,105,125,143,154,158,158]
["Ciencias sociales y del comportamiento ",381,534,739,671,655,634,689,641,923,720,746,930]
["Derecho ",500,613,686,676,816,781,838,777,886,806,786,910]
["Enseñanza comercial y administración ",914,865,1328,1509,1205,918,1032,1071,1135,1289,1280,1239]
["Formación de personal docente y ciencias de la educación ",66,61,81,120,113,136,291,372,399,275,235,246]
["Humanidades ",80,33,74,33,73,64,76,75,92,90,66,75]
["Industria y producción ",0,12,8,16,10,26,16,31,33,24,27,25]
["Informática ",285,234,257,194,237,277,235,215,242,260,250,277]
["Ingeniería y profesiones afines ",133,124,187,201,224,214,200,204,194,257,222,232]
["Matemáticas y estadística ",9,4,6,9,10,12,5,13,27,19,14,11]
["Medicina ",1323,1311,1476,1276,1578,1243,1537,1726,1532,1874,1962,1953]
["Periodismo e información ",120,78,208,249,289,174,191,213,234,242,201,241]
["Protección del medio ambiente",null,null,null,null,null,null,null,null,null,null,null,5]
["Servicios personales ",0,0,0,16,7,19,96,145,194,67,51,181]
["Servicios sociales ",17,14,23,18,33,48,51,47,106,88,123,148]
["Veterinaria ",112,49,107,89,91,118,94,55,70,91,105,132]
["Fuente: Elaboración propia en base a información brindada por las oficinas productoras de las instituciones.\nNota: Las áreas corresponden a la clasificación CINE 1997 de UNESCO."]

{"sheet":"I.2.6.5.","index":31,"n_rows":31,"n_cols":8,"rows_kept":31,"cut":false,"hidden":false,"merged":[[2,0,2,6],[3,0,5,0],[0,0,0,1],[28,0,28,7],[29,0,29,7],[30,0,30,10],[3,1,3,7],[4,1,5,2],[4,3,5,3],[4,4,5,4],[4,6,5,6],[4,7,5,7],[4,5,5,5]]}
["Ministerio de Educación y Cultura \nDirección de Educación\n"]
[]
["Cuadro I-2.6.5\nINGRESOS A INSTITUCIONES UNIVERSITARIAS POR NIVEL ACADÉMICO SEGÚN ÁREA DE CONOCIMIENTO"]
["INSTITUCIONES UNIVERSITARIAS","NIVEL ACADÉMICO"]
[null,"TOTAL",null,"Carrera corta o tecnicatura","Carrera de grado, licenciatura","Postgrado de especialización","Maestría","Doctorado"]
[]
["TOTAL ",{"$f":"SUM(D7:H7)","v":26283},{"$f":"SUM(C8:C28)","v":99.999999999999986},{"$f":"SUM(D8:D28)","v":3277},{"$f":"SUM(E8:E28)","v":19668},1257,2001,80]
["Agricultura, silvicultura y pesca ",{"$f":"SUM(D8:H8)","v":864},{"$f":"(B8*100)/$B$7","v":3.2872959707795912},134,525,105,80,20]
["Arquitectura y construcción ",754,2.868774493018301,4,702,0,47,1]
["Artes ",997,3.793326484800061,26,971,0,0,0]
["Ciencias de la vida ",649,2.4692767187916145,6,473,0,170,0]
["Ciencias físicas ",667,2.5377620515161894,43,569,0,27,28]
["Ciencias sociales y del comportamiento ",5399,20.541795076665526,19,4684,410,282,4]
["Derecho ",2005,7.6285051173762506,0,1946,5,54,0]
["Enseñanza comercial y administración ",3661,13.929155728037134,1516,1538,352,251,4]
["Formación de personal docente y ciencias de la educación ",785,2.9867214549328462,101,393,179,112,0]
["Humanidades ",707,2.6899516797930221,135,445,0,127,0]
["Industria y producción ",219,0.83323821481566029,0,203,0,16,0]
["Informática ",1280,4.870068104858654,106,1109,20,41,4]
["Ingeniería y profesiones afines ",926,3.5231898946086826,90,763,17,46,10]
["Matemáticas y estadística ",176,0.6696343644180649,0,171,0,2,3]
["Medicina ",4656,17.714872731423352,291,3608,108,649,0]
["Periodismo e información ",1218,4.6341741810295627,388,768,15,47,0]
["Servicios personales ",327,1.2441502111631093,91,236,0,0,0]
["Servicios sociales ",82,0.31198873796750753,0,0,40,42,0]
["Protección del medio ambiente",6,2.2828444241524939E-2,0,0,6,0,0]
["Veterinaria ",578,2.1991401286002361,0,564,0,8,6]
["Otras",{"$f":"SUM(D28:H28)","v":327},{"$f":"(B28*100)/$B$7","v":1.2441502111631093},327,"n/c","n/c","n/c","n/c"]
["Fuente: Elaboración propia en base información de las oficinas productoras de las instituciones"]
["Nota: Las áreas corresponden a la clasificación CINE 1997 de UNESCO."]
["La categoría \"Otras\", refiere a estudiantes que ingresaron al Ciclo Inicial en UdelaR y no pueden ser clasificables por área."]

{"sheet":"I.2.6.6","index":32,"n_rows":12,"n_cols":4,"rows_kept":12,"cut":false,"hidden":false,"merged":[[0,0,0,3],[2,0,2,3]]}
["Ministerio de Educación y Cultura\nDirección de Educación"]
[]
["Cuadro I-2.6.6\nINGRESOS, MATRÍCULA Y EGRESOS SEGÚN FORMA DE ADMINISTRACIÓN EN CANTIDADES ABSOLUTAS Y PORCENTAJES"]
["FORMA DE ADMINISTRACIÓN","INGRESOS","MATRÍCULA","EGRESOS"]
["TOTAL VALORES ABSOLUTOS",{"$f":"SUM(B6:B7)","v":22945},{"$f":"SUM(C6:C7)","v":132420},{"$f":"SUM(D6:D7)","v":6476}]
["Universidad de la República ",18705,112891,5284]
["Instituciones Universitarias Privadas ",4240,19529,1192]
["TOTAL PORCENTAJES",1,1,1]
["Universidad de la República ",{"$f":"B6/B5*100%","v":0.81521028546524299},{"$f":"C6/C5*100%","v":0.85252227760157073},{"$f":"D6/D5*100%","v":0.81593576281655344}]
["Instituciones Universitarias Privadas ",{"$f":"B7/B5*100%","v":0.18478971453475704},{"$f":"C7/C5*100%","v":0.14747772239842924},{"$f":"D7/D5*100%","v":0.18406423718344658}]
["Fuentes: Elaboración propia en base a información brindada por las oficinas productoras de las instituciones."]
["Nota: Se toma en cuenta solo las ofertas de grado."]

{"sheet":"I.2.7.I","index":33,"n_rows":14,"n_cols":11,"rows_kept":14,"cut":false,"hidden":false,"merged":[[0,0,0,5],[1,0,1,5],[2,0,2,5],[7,8,9,8],[4,0,4,10],[5,0,5,10],[6,0,9,0],[6,1,6,7],[6,8,6,10],[7,1,9,1],[7,9,8,10],[8,2,9,2],[8,3,8,4],[8,5,9,5],[8,6,8,7],[7,2,7,4],[7,5,7,7]]}
["Ministerio de Educación y Cultura"]
["Dirección de Educación"]
[]
[]
["Cuadro I-2.7.1"]
["ALUMNOS MATRICULADOS EN EL PROGRAMA NACIONAL DE JÓVENES Y ADULTOS POR MODALIDAD, NIVEL Y SEXO SEGÚN GRANDES ÁREAS"]
["GRANDES ÁREAS","ALUMNOS MATRICULADOS\nEN EDUCACIÓN PRIMARIA",null,null,null,null,null,null,"ALUMNOS MATRICULADOS EN TALLERES"]
[null,"TOTAL","PRIMER  TRAMO: NIVEL I",null,null,"PRIMER  TRAMO: NIVEL II",null,null,"TOTAL\n","SEXO"]
[null,null,"TOTAL\nSEXO","SEXO",null,"TOTAL\n","SEXO"]
[null,null,null,"Masculino","Femenino",null,"Masculino","Femenino",null,"Masculino","Femenino"]
["TOTAL ",{"$f":"C11+F11","v":3186},{"$f":"SUM(D11:E11)","v":1365},{"$f":"D12+D13","v":783},{"$f":"E12+E13","v":582},{"$f":"SUM(G11:H11)","v":1821},{"$f":"G12+G13","v":920},{"$f":"H12+H13","v":901},{"$f":"SUM(J11:K11)","v":4092},{"$f":"J12+J13","v":1404},{"$f":"K12+K13","v":2688}]
["Montevideo ",{"$f":"C12+F12","v":1623},704,470,234,919,574,345,{"$f":"SUM(J12:K12)","v":3312},1023,2289]
["Resto del País ",1563,661,313,348,902,346,556,780,381,399]
["Fuente : ANEP -CODICEN - Programa de Eduacación de Jóvenes y Adultos "]

{"sheet":"I.2.7.2","index":34,"n_rows":15,"n_cols":4,"rows_kept":15,"cut":false,"hidden":false,"merged":[[0,0,0,3],[2,0,2,3],[5,0,5,3],[14,0,14,3],[6,1,6,3],[7,1,9,1],[7,2,8,3],[6,0,9,0]]}
["Ministerio de Educación y Cultura"]
["Dirección de Educación"]
[]
[]
["Cuadro I.2.7.2"]
["ALUMNOS QUE RINDIERON LA PRUEBA DE ACREDITACIÓN EN EL PROGRAMA NACIONAL DE JÓVENES Y ADULTOS POR SEXO SEGÚN GRANDES ÁREAS"]
["GRANDES ÁREAS","ALUMNOS PARTICIPANTES EN PRUEBA DE ACREDITACIÓN"]
[null,"TOTAL\nPRUEBAS DE ACREDITACIÓN","SEXO"]
[]
[null,null,"Masculino","Femenino"]
["TOTAL",{"$f":"SUM(C11:D11)","v":1041},{"$f":"C12+C13","v":435},{"$f":"D12+D13","v":606}]
["Montevidel",{"$f":"SUM(C12:D12)","v":301},169,132]
["Resto del País ",740,266,474]
[]
["Fuentes : ANEP-CODICEN - Programa de Educación de jóvnes y Adultos ."]

{"sheet":"I.2.8.1","index":35,"n_rows":23,"n_cols":10,"rows_kept":23,"cut":false,"hidden":false,"merged":[[0,0,0,20],[1,0,1,20],[2,0,2,20],[5,0,6,9],[7,0,10,0],[7,1,7,9],[8,1,8,3],[8,4,8,6],[8,7,8,9],[9,1,10,1],[9,2,9,3],[9,4,10,4],[9,5,9,6],[9,7,10,7],[9,8,9,9]]}
["Ministerio de Educación y Cultura"]
["Dirección de Educación"]
[]
[]
["Cuadro I.2.8.1"]
["ALUMNOS MATRICULADOS POR REGIÓN Y SEXO SEGÚN ÁREA DE CONOCIMIENTO "]
[]
["ÁREA DE CONOCIMIENTO","REGIÓN"]
[null,"TOTAL",null,null,"MONTEVIDEO",null,null,"RESTO DEL PAÍS"]
[null,"Total","SEXO",null,"Total","SEXO",null,"Total","SEXO"]
[null,null,"Masculino","Femenino",null,"Masculino","Femenino",null,"Masculino","Femenino"]
["TOTAL",{"$f":"SUM(B13:B19)","v":78544},{"$f":"SUM(C13:C19)","v":39471},39073,64028,33351,30677,14516,6120,8396]
["Idiomas",{"$f":"(C13+D13)","v":13325},{"$f":"(F13+I13)","v":5862},{"$f":"(G13+J13)","v":7463},{"$f":"(F13+G13)","v":9228},4049,5179,{"$f":"(I13+J13)","v":4097},1813,2284]
["Informática",{"$f":"(C14+D14)","v":12444},{"$f":"(F14+I14)","v":8100},4344,{"$f":"(F14+G14)","v":8599},6532,2067,{"$f":"(I14+J14)","v":3845},1568,2277]
["Adm y Comercio",24350,11486,12864,22838,10897,11941,1512,589,923]
["Artes",3995,915,3080,3702,861,2841,293,54,239]
["Servicios Personales",1829,674,1155,1349,552,797,480,122,358]
["Otros Técnicos",11777,8192,3585,9716,7002,2714,2061,1190,871]
["Otros Diversos",10824,4242,6582,8596,3458,5138,2228,784,1444]
[]
["Fuente : Elaboración propia enbase en la iformación del Primer Censo Nacional de Instituciones de Formación Técnico-Profesional "]
["Nota: Las áreas de conocimiento corresponden a la clasificación CINE 1997 de UNESCO "]
["Al total de alumnos matriculados se le debe sumar 159 alumnos mas, de los cuáles no se obtuvo la información por sexo."]

{"sheet":"I.2.8.2","index":36,"n_rows":15,"n_cols":11,"rows_kept":15,"cut":false,"hidden":false,"merged":[[0,0,0,16383],[2,0,2,4],[3,0,6,0],[3,3,3,6],[3,7,3,10],[4,1,4,2],[4,3,4,4],[4,5,4,6],[4,7,4,8],[4,9,4,10],[5,1,5,2],[5,3,5,4],[5,5,5,6],[5,7,5,8],[5,9,5,10]]}
["Ministerio de Educación y Cultura\nDirección de Educación"]
[]
["Cuadro I.2.8.2\nALUMNOS MATRICULADOS POR TIPO DE INSTITUCIÓN Y SEXO SEGÚN ÁREA DE CONOCIMIENTO "]
["ÁREA DE CONOCIMIENTO",null,null,"TIPO DE INSTITUCIÓN",null,null,null,"AREA GEOGRÁFICA"]
[null,"TOTAL",null,"PÚBLICO",null,"PRIVADO",null,"MONTEVIDEO",null,"RESTO DEL PAÍS"]
[]
[null,"Ingresados","Egresados","Ingresados","Egresados","Ingresados","Egresados","Ingresados","Egresados","Ingresados","Egresados"]
["TOTAL",{"$f":"SUM(B9:B15)","v":72182},{"$f":"SUM(C9:C15)","v":57786},3248,3060,68934,54726,59862,48018,12320,9768]
["Idiomas",{"$f":"(D9+F9)","v":10016},{"$f":"(E9+G9)","v":7910},211,64,9805,7846,7508,6596,2508,1314]
["Informática",{"$f":"(D10+F10)","v":9631},7031,0,0,9631,7031,5847,3653,3784,3378]
["Adm y Comercio",24806,21932,0,0,24806,21932,23316,20667,1490,1265]
["Artes",2671,1147,59,23,2612,1124,2459,1068,212,79]
["Servicios Personales",2254,1685,0,0,2254,1685,2088,1520,166,165]
["Otros Técnicos",11762,9214,2978,2973,8784,6241,9695,7441,2067,1773]
["Otros Diversos",11042,8867,0,0,11042,8867,8949,7073,2093,1794]

{"sheet":"I..2.8.3","index":37,"n_rows":20,"n_cols":8,"rows_kept":20,"cut":false,"hidden":false,"merged":[[16,0,16,1],[17,0,17,1],[12,0,12,1],[13,0,13,1],[14,0,14,1],[15,0,15,1],[0,0,0,20],[1,0,1,20],[2,0,2,20],[10,0,10,1],[11,0,11,1],[6,0,7,7],[8,0,9,1],[8,2,9,2],[8,3,9,3],[8,4,9,4],[8,5,9,5],[8,6,9,6],[8,7,9,7]]}
["Ministerio de Educación y Cultura"]
["Dirección de Educación"]
[]
[]
[]
["Cuadro I-2.8.3"]
["CANTIDAD DE CURSOS POR TRAMOS DE DURACIÓN EN HORAS SEGÚN ÁREA DE CONOCIMIENTO"]
[]
["AREA DE CONOCIMIENTO",null,"TOTAL","0 a 40","41 a 140","141 a 320","321 a 440","440 y más "]
[]
["TOTAL",null,{"$f":"SUM(D11:H11)","v":1754},{"$f":"SUM(D12:D18)","v":393},{"$f":"SUM(E12:E18)","v":748},{"$f":"SUM(F12:F18)","v":366},{"$f":"SUM(G12:G18)","v":103},{"$f":"SUM(H12:H18)","v":144}]
["Idiomas",null,{"$f":"SUM(D12:H12)","v":324},59,191,64,1,9]
["Informática",null,{"$f":"SUM(D13:H13)","v":330},80,180,31,8,31]
["Administración y Comercio",null,409,71,183,90,49,16]
["Artes",null,77,24,19,20,2,12]
["Servicios Personales",null,57,5,21,20,2,9]
["Otros técnicos",null,341,98,108,98,16,21]
["Otros diversos",null,216,56,46,43,25,46]
["Fuente : Elaboración propia en base en la iformacioón del Primer Centro Nacional de Instituciones de Formación Técnico -Profesional "]
["Nota: Las áreas de conocimiento corresponden a la clasificación CINE 1997 de UNESCO "]

{"sheet":"I..2.8.4","index":38,"n_rows":15,"n_cols":6,"rows_kept":15,"cut":false,"hidden":false,"merged":[[14,0,14,4],[3,4,3,5],[3,2,3,3],[0,0,0,20],[1,0,1,20],[2,1,2,5],[3,1,4,1],[3,0,4,0]]}
["Ministerio de Educación y Cultura\nDirección de Educación"]
[]
["Cuadro I.2.8.4","Total de Estabecimientos por forma de administración, Grandes Áreas según Área de Conocimiento"]
["AREA DE CONOCIMIENTO","TOTAL","FORMA DE ADMINISTRACIÓN",null,"ÁREA GEOGRAFICA "]
[null,null,"PÚBLICO","PRIVADO","MONTEVIDEO","RESTO DEL PAÍS"]
["TOTAL",318,20,298,213,105]
["Idiomas",85,null,85,49,36]
["Informática",39,null,39,16,23]
["Administración y Comercio",40,null,40,28,12]
["Artes",35,1,34,29,6]
["Servicios Personales",13,null,13,11,2]
["Otros técnicos",42,18,24,30,12]
["Otros diversos",64,1,63,50,14]
[]
["Fuente : Elaboración propia en base en la iformacioón del Primer Centro Nacional de Instituciones de Formación Técnico -Profesional.\nNota: Las áreas de conocimiento corresponden a la clasificación CINE 1997 de UNESCO "]

{"sheet":"I.2.8.5","index":39,"n_rows":10,"n_cols":7,"rows_kept":10,"cut":false,"hidden":false,"merged":[[3,0,4,1],[0,0,0,4],[10,0,10,1],[9,1,9,6],[5,0,5,1],[7,0,7,1],[8,0,8,6],[6,0,6,1],[2,0,2,6],[3,2,4,2],[3,3,3,4],[3,5,3,6]]}
["Ministerio de Educación y Cultura\nDirección de Educación\n"]
[]
["Cuadro I.2.8.5.\nALUMNOS MATRICULADOS EN CURSOS DE EDUCACIÓN TÉCNICA (CETP-UTU) PARA JÓVENES Y ADULTOS POR SEXO Y GRANDES ÁREAS SEGÚN TIPO DE CURSO"]
["NIVEL EDUCATIVO MÁXIMO \nALCANZADO",null,"TOTAL","SEXO",null,"GRANDES ÁREAS"]
[null,null,null,"Masculino","Femenino","Montevideo","Resto del País"]
["TOTAL ",null,{"$f":"C7+C8","v":7546},{"$f":"D7+D8","v":3729},{"$f":"E7+E8","v":3817},{"$f":"F7+F8","v":4226},{"$f":"G7+G8","v":3320}]
["Nivel Básico",null,{"$f":"D7+E7","v":6443},3316,3127,3562,2881]
["Nivel Superior",null,{"$f":"D8+E8","v":1103},413,690,664,439]
[]
["Fuente: U.T.U"]

{"sheet":"I.2.8.6","index":40,"n_rows":10,"n_cols":7,"rows_kept":10,"cut":false,"hidden":false,"merged":[[0,0,0,3],[9,0,9,6],[3,2,3,3],[3,5,3,6],[3,0,4,0],[3,1,4,1],[2,0,2,2]]}
["Ministerio de Educación y Cultura\nDirección de Educación\n"]
[]
["Cuadro I.2.8.6\nALUMNOS INGRESADOS Y MATRICULADOS EN CECAP POR SEXO SEGÚN GRANDES ÁREAS "]
["NIVEL EDUCATIVO MÁXIMO\nALCANZADO","TOTAL","INGRESADOS",null,null,"MATRICULADOS"]
[null,null,"Masculino","Femenino","TOTAL","Masculino","Femenino"]
["TOTAL ",{"$f":"B7+B8","v":835},419,416,2060,1067,993]
["Montevideo",{"$f":"C7+D7","v":227},115,112,{"$f":"F7+G7","v":669},355,314]
["Resto del país",{"$f":"C8+D8","v":608},304,304,{"$f":"F8+G8","v":1391},712,679]
[]
["Fuente: Área de Educación No Formal de la Dirección de Educación - MEC"]

{"sheet":"I.2.8.7.","index":41,"n_rows":11,"n_cols":5,"rows_kept":11,"cut":false,"hidden":false,"merged":[[0,0,0,4],[4,0,5,1],[11,0,11,1],[6,0,6,1],[8,0,8,1],[9,0,9,6],[7,0,7,1],[10,0,10,7],[4,5,4,6],[3,0,3,4],[2,0,2,4],[4,2,5,2],[4,3,4,4]]}
["Ministerio de Educación y Cultura \nDirección de Educación\n"]
[]
["Cuadro I-2.8.7."]
["ALUMNOS MATRICULADOS DEL COCAP SEGÚN TIPO DE CURSO Y ÁREA DE FORMACIÓN"]
["TIPO DE CURSO ",null,"TOTAL","SEXO"]
[null,null,null,"Masculino","Femenino"]
["TOTAL ",null,{"$f":"C8+C9","v":833},{"$f":"D8+D9","v":824},{"$f":"E8+E9","v":9}]
["Cursos Abiertos (Industrial)",null,{"$f":"D8+E8","v":749},740,9]
["Cursos Cerrados (Industrial)",null,{"$f":"D9+E9","v":84},84,0]
[]
["Fuente: COCAP"]

{"sheet":"I.2.8.8","index":42,"n_rows":13,"n_cols":5,"rows_kept":13,"cut":false,"hidden":false,"merged":[[11,0,11,4],[0,0,0,4],[3,0,3,4],[4,0,4,1],[5,0,5,1],[6,0,6,1],[7,0,7,1],[8,0,8,1],[9,0,9,1]]}
["Ministerio de Educación y Cultura\nDirección de Educación\n"]
[]
[]
["Cuadro I-2.8.8.\nFUNCIONARIOS PARTICIPANTES EN LOS CURSOS DE LA ENAP \"DR. AQUILES LANZA\", CANTIDAD DE CURSOS Y HORAS TIPO DE CURSO"]
["GRANDES ÁREAS",null,"FUNCIONARIOS PARTICIPANTES","CANTIDAD DE CURSOS","HORAS"]
["TOTAL ",null,{"$f":"SUM(C7:C10)","v":4637},{"$f":"SUM(D7:D10)","v":195},9392]
["Maestría en Políticas y Gestión Pública ",null,"s/d","s/d","s/d"]
["Programas de Formación: Programa de Dirección Media, Diploma en Gestión Humana y Programa de Desarrollo Administrativo ",null,175,7,2560]
["Cursos y Seminarios ",null,3843,167,6320]
["Cursos e-learning",null,619,21,512]
[]
["Fuentes: Oficina Nacional del Servicio Civil - Escuela Nacional de Administración Pública \"Dr. Aquiles Lanza\""]
["Nota: En el período 2011 no se dictó la Maestría en Políticas y Gestión Pública."]

{"sheet":"I.2.8.9.","index":43,"n_rows":10,"n_cols":8,"rows_kept":10,"cut":false,"hidden":false,"merged":[[0,0,0,2],[2,0,2,5],[8,0,8,1],[11,0,11,1],[3,0,4,1],[3,3,3,4],[3,6,3,7],[4,3,4,4],[4,6,4,7],[5,0,5,1],[7,0,7,1],[4,2,5,2],[4,5,5,5]]}
["Ministerio de Educación y Cultura\nDirección de Educación\n"]
[]
["Cuadro I-2.8.9.\nALUMNOS INGRESADOS Y MATRICULADOS EN CARRERAS NO TERCIARIAS EN UNIVERSIDADES E INSTITUTOS UNIVERSITARIOS"]
["UNIVERSIDADES E INSTITUTOS UNIVERSITARIOS",null,null,"INGRESADOS",null,null,"MATRICULADOS"]
[null,null,"TOTAL","SEXO",null,"TOTAL","SEXO"]
[null,null,null,"Masculino","Femenino",null,"Masculino","Femenino"]
["TOTAL ",null,{"$f":"C8+C9","v":1126},727,399,4311,3006,1305]
["Universidad ORT Uruguay ",null,{"$f":"D8+E8","v":905},612,293,{"$f":"G8+H8","v":4014},2846,1168]
["Universidad de la Empresa ",null,{"$f":"D9+E9","v":221},115,106,{"$f":"G9+H9","v":297},160,137]
["Fuente: Procesamiento propio en base a datos proporcionados por el  Área de Educación No Formal, Dirección de Educación, MEC."]

{"sheet":"I-3.1.1","index":44,"n_rows":14,"n_cols":7,"rows_kept":14,"cut":false,"hidden":false,"merged":[[13,1,13,6],[0,0,0,6],[10,0,10,1],[11,0,11,1],[12,0,12,1],[6,0,6,1],[7,0,7,1],[8,0,8,1],[9,0,9,1],[2,0,2,6],[3,0,3,6],[4,0,5,1],[4,2,4,4],[4,5,5,5]]}
["Ministerio de Educación y Cultura\n"]
[]
["Cuadro I-3.1.1"]
["ESCUELAS, MAESTROS Y ALUMNOS ATENDIDOS POR EL PROGRAMA MAESTROS COMUNITARIOS SEGÚN AÑO LECTIVO"]
["AÑO LECTIVO",null,"Escuelas",null,null,"Maestros comunitarios","Alumnos"]
[null,null,"Total","Montevideo","Resto del país",null,"atendidos"]
[2005,null,255,97,158,437,9292]
[2006,null,252,95,157,433,14884]
[2007,null,334,101,233,553,18163]
[2008,null,334,100,234,533,16802]
[2009,null,337,101,236,553,16166]
[2010,null,337,101,236,553,16749]
[2011,null,342,104,238,554,15680]
["Fuente:","Coordinación Técnica, Programa INFAMILIA / CEP INFAMILIA"]

{"sheet":"I-3.1.2","index":45,"n_rows":10,"n_cols":4,"rows_kept":10,"cut":false,"hidden":false,"merged":[[0,0,0,3],[9,1,9,3],[7,0,7,1],[5,0,5,1],[6,0,6,1],[8,0,8,1],[3,0,3,3],[4,0,4,1]]}
["Ministerio de Educación y Cultura\nDirección de Educación\n"]
[]
["Cuadro I-3.1.2"]
["ESCUELAS, MAESTROS Y ALUMNOS ATENDIDOS POR EL PROGRAMA MAESTROS COMUNITARIOS SEGÚN AÑO LECTIVO"]
["AÑO LECTIVO",null,"Maestros comunitarios","Escuelas"]
["Total ",null,554,342]
["Requerimiento 1 ",null,273,152]
["Requerimiento 2 ",null,211,124]
["Requerimiento 3 ",null,70,66]
["Fuente:","Coordinación Técnica, Programa INFAMILIA / CEP INFAMILIA Nota: Todo el país (Año 2011)"]

{"sheet":"I-3.1.3","index":46,"n_rows":16,"n_cols":5,"rows_kept":16,"cut":false,"hidden":false,"merged":[[15,1,15,4],[10,0,10,1],[11,0,11,1],[16,0,16,1],[13,0,13,1],[12,0,12,1],[14,0,14,1],[8,0,8,1],[9,0,9,1],[5,0,5,4],[6,0,6,4],[7,0,7,1]]}
["Ministerio de Educación y Cultura"]
["Dirección de Educación"]
[]
[]
[]
["Cuadro I-3.1.3"]
["EDUCACIÓN FÍSICA ESCOLAR SEGÚN AÑO LECTIVO"]
["AÑO LECTIVO",null,"Escuelas","Profesores","Alumnos atendidos"]
[2005,null,160,157,67462]
[2006,null,248,238,86473]
[2007,null,245,248,88023]
[2008,null,605,605,213858]
[2008,null,1004,973,325164]
[2010,null,1016,977,308260]
[2011,null,1016,977,306318]
["Nota: ","Todo el país (Año 2011)"]

{"sheet":"I-3.1.4","index":47,"n_rows":12,"n_cols":6,"rows_kept":12,"cut":false,"hidden":false,"merged":[[16,0,16,1],[15,0,15,3],[11,1,11,5],[5,0,5,5],[6,0,6,5],[7,0,7,2],[9,0,9,2],[10,0,10,2],[8,0,8,2]]}
["Ministerio de Educación y Cultura"]
["Dirección de Educación"]
[]
[]
[]
["Cuadro I-3.1.4"]
["ESCUELAS, PROFESORES Y ALUMNOS ATENDIDOS POR EL PROGRAMA DE EDUCACIÓN FÍSICA ESCOLAR SEGÚN GRANDES ÁREAS"]
["AÑO LECTIVO",null,null,"Escuelas","Profesores","Alumnos atendidos"]
["Todo el país  ",null,null,1016,977,306318]
["Montevideo  ",null,null,283,308,94724]
["Resto del país  ",null,null,733,669,211594]
[" Fuente:","Coordinación Técnica, Programa INFAMILIA / CEP INFAMILIA"]

{"sheet":"I-3.1.5","index":48,"n_rows":34,"n_cols":12,"rows_kept":34,"cut":false,"hidden":false,"merged":[[26,0,26,1],[32,0,32,1],[33,1,33,11],[27,0,27,1],[28,0,28,1],[29,0,29,1],[30,0,30,1],[31,0,31,1],[21,0,21,1],[22,0,22,1],[23,0,23,1],[24,0,24,1],[25,0,25,1],[16,0,16,1],[17,0,17,1],[18,0,18,1],[19,0,19,1],[20,0,20,1],[11,0,11,1],[12,0,12,1],[13,0,13,1],[14,0,14,1],[15,0,15,1],[7,9,8,10],[3,0,3,5],[4,0,4,11],[5,0,5,11],[6,0,10,1],[6,2,8,4],[6,5,6,11],[7,5,8,6],[7,7,8,8],[7,11,10,11],[9,2,10,2],[9,3,9,4],[9,5,9,6],[9,7,9,8],[9,9,9,10]]}
["Ministerio de Educación y Cultura"]
["Dirección de Educación"]
[]
[]
["Cuadro I-3.1.5"]
["BECAS OTORGADAS EN 2011 POR PROGRAMAS DE BECAS Y SEXO SEGÚN GRANDES ÁREAS Y DEPARTAMENTO"]
["GRANDES ÁREAS / DEPTO.",null,"TOTAL",null,null,"PROGRAMAS DE BECAS"]
[null,null,null,null,null,"Becas MEC",null,"Compromiso Educativo",null,"Becas del Fondo de Solidaridad",null,"Becas Carlos Quijano"]
[]
[null,null,"TOTAL","SEXO",null,"SEXO",null,"SEXO",null,"SEXO"]
[null,null,null,"Hombres","Mujeres","Hombres","Mujeres","Hombres","Mujeres","Hombres","Mujeres"]
["Total ",null,9204,2592,6600,556,880,507,1103,1529,4617,12]
[]
["Montevideo ",null,1916,586,1318,255,355,162,347,169,616,12]
["Resto del País ",null,7288,2006,5282,301,525,345,756,1360,4001,"s/d"]
["Artigas ",null,564,181,383,27,31,71,114,83,238]
["Canelones ",null,1444,375,1069,54,101,100,230,221,738]
["Cerro Largo ",null,287,75,212,16,36,0,0,59,176]
["Colonia ",null,522,151,371,12,20,23,64,116,287]
["Durazno ",null,240,67,173,8,23,0,0,59,150]
["Flores ",null,130,38,92,8,7,0,0,30,85]
["Florida ",null,319,84,235,19,12,0,0,65,223]
["Lavalleja ",null,199,56,143,12,14,0,0,44,129]
["Maldonado ",null,170,49,121,10,16,0,0,39,105]
["Paysandú ",null,652,189,463,21,37,60,175,108,251]
["Rio Negro ",null,201,59,142,12,16,0,0,47,126]
["Rivera ",null,546,151,395,16,44,53,125,82,226]
["Rocha ",null,207,56,151,15,19,0,0,41,132]
["Salto ",null,594,172,422,19,47,26,34,127,341]
["San José ",null,413,92,321,13,23,0,0,79,298]
["Soriano ",null,302,78,224,16,20,12,14,50,190]
["Tacuarembó ",null,347,91,256,16,34,0,0,75,222]
["Treinta y Tres ",null,151,42,109,7,25,0,0,35,84]
[" Fuente:","Área de Becas, Dir. de Edu, MEC; Fondo de Solidaridad."]

{"sheet":"I.3.1.6.","index":49,"n_rows":33,"n_cols":9,"rows_kept":33,"cut":false,"hidden":false,"merged":[[28,0,28,1],[25,0,25,1],[26,0,26,1],[32,1,32,8],[31,0,31,1],[29,0,29,1],[30,0,30,1],[23,0,23,1],[24,0,24,1],[21,0,21,1],[22,0,22,1],[27,0,27,1],[16,0,16,1],[13,0,13,1],[14,0,14,1],[19,0,19,1],[20,0,20,1],[17,0,17,1],[18,0,18,1],[11,0,11,1],[12,0,12,1],[9,0,9,1],[10,0,10,1],[15,0,15,1],[0,0,0,2],[5,0,5,8],[6,0,6,8],[7,0,8,1],[7,2,8,2],[7,3,7,6],[7,7,7,8]]}
["Ministerio de Educación y Cultura\nDirección de Educación\n"]
[]
[]
[]
[]
["Cuadro I-3.1.6"]
["BECAS DE APOYO ECONÓMICO DEL MEC OTORGADAS EN 2011 POR CICLO Y CONSEJO DESCONCENTRADO SEGÚN GRANDES ÁREAS Y DEPARTAMENTO"]
["GRANDES ÁREAS / DEPTO.",null,"TOTAL","EDUCACIÓN MEDIA BÁSICA",null,null,null,"EDUCACIÓN MEDIA SUPERIOR"]
[null,null,null,"PPEE","CES","CEIP","CETP","CES","Emt – Emp"]
["Total",null,1436,12,653,17,174,433,147]
[]
["Montevideo ",null,610,10,358,0,77,121,44]
["Resto del interior ",null,826,2,295,17,97,312,103]
[]
["Artigas ",null,58,0,20,2,7,26,3]
["Canelones ",null,155,0,61,0,17,70,7]
["Cerro Largo ",null,52,0,13,0,13,18,8]
["Colonia ",null,32,0,6,6,4,7,9]
["Durazno ",null,31,0,15,0,1,13,2]
["Flores ",null,15,0,4,0,3,1,7]
["Florida ",null,31,0,9,0,6,15,1]
["Lavalleja ",null,26,0,6,2,5,6,7]
["Maldonado ",null,26,0,8,0,5,10,3]
["Paysandú ",null,58,2,20,2,5,13,16]
["Rio Negro ",null,28,0,9,0,5,11,3]
["Rivera ",null,60,0,26,4,0,30,0]
["Rocha ",null,34,0,10,0,7,8,9]
["Salto ",null,66,0,30,0,3,18,15]
["San José ",null,36,0,15,0,2,17,2]
["Soriano ",null,36,0,6,0,12,8,10]
["Tacuarembó  ",null,50,0,22,1,1,25,1]
["Treinta y Tres ",null,32,0,15,0,1,16,0]
[" Fuente:","Área de Becas, Dir. de Edu, MEC; Fondo de Solidaridad."]

{"sheet":"I-.3.1.7","index":50,"n_rows":31,"n_cols":5,"rows_kept":31,"cut":false,"hidden":false,"merged":[[30,1,30,4],[26,0,26,1],[27,0,27,1],[28,0,28,1],[29,0,29,1],[25,0,25,1],[14,0,14,1],[15,0,15,1],[16,0,16,1],[17,0,17,1],[18,0,18,1],[19,0,19,1],[20,0,20,1],[21,0,21,1],[22,0,22,1],[23,0,23,1],[24,0,24,1],[13,0,13,1],[5,0,5,4],[6,0,7,1],[6,2,7,2],[6,3,6,4],[8,0,8,1],[9,0,9,1],[10,0,10,1],[11,0,11,1],[12,0,12,1]]}
["Ministerio de Educación y Cultura"]
["Dirección de Educación"]
[]
[]
["Cuadro I-3.1.7"]
["BECAS DEL FONDO DE SOLIDARIDAD OTORGADAS EN 2011 POR SEXO SEGÚN GRANDES ÁREAS Y DEPARTAMENTO"]
["GRANDES ÁREAS / DEPTO.",null,"TOTAL","SEXO"]
[null,null,null,"Masculino","Femenino"]
["Total ",null,6146,1529,4538]
[]
["Montevideo ",null,785,169,616]
["Resto del interior ",null,5361,1360,4001]
["Artigas ",null,321,83,238]
["Canelones ",null,959,221,738]
["Cerro Largo ",null,235,59,176]
["Colonia ",null,403,116,287]
["Durazno ",null,209,59,150]
["Flores ",null,115,30,85]
["Florida ",null,288,65,223]
["Lavalleja ",null,173,44,129]
["Maldonado ",null,144,39,105]
["Paysandú ",null,359,108,251]
["Rio Negro ",null,173,47,126]
["Rivera ",null,308,82,226]
["Rocha ",null,173,41,132]
["Salto ",null,468,127,341]
["San José ",null,377,79,298]
["Soriano ",null,240,50,190]
["Tacuarembó  ",null,297,75,222]
["Treinta y Tres ",null,119,35,84]
[" Fuente:","Área de Becas, Dir. de Edu, MEC; Fondo de Solidaridad."]

{"sheet":"I-3.1.8","index":51,"n_rows":18,"n_cols":6,"rows_kept":18,"cut":false,"hidden":false,"merged":[[12,0,12,1],[9,0,10,1],[5,0,5,20],[8,0,8,5],[9,2,9,3],[9,4,9,5],[11,0,11,1],[17,1,17,5],[13,0,13,1],[14,0,14,1],[15,0,15,1],[16,0,16,1]]}
["Ministerio de Educación y Cultura"]
["Dirección de Educación"]
[]
[]
["Ministerio de Educación y Cultura"]
["Dirección de Educación"]
[]
["Cuadro I-3.1.8"]
["PORCENTAJE DE PERSONAS DE 6 AÑOS Y MÁS QUE UTILIZARON PC EL ÚLTIMO MES Y DE HOGARES CON ACCESO A INTERNET POR ÁREA GEOGRÁFICA SEGÚN AÑO LECTIVO"]
["AÑO LECTIVO",null,"% PERSONAS DE 6 AÑOS Y MÁS QUE UTILIZARON PC EL ÚLTIMO MES",null,"% HOGARES CON ACCESO A INTERNET"]
[null,null,"Todo el país","Áreas urbanas","Todo el país","Áreas urbanas"]
[2006,null,24.4,26.4,13.5,14.8]
[2007,null,28.2,30.3,15.8,17.399999999999999]
[2008,null,35.299999999999997,37.299999999999997,20.6,22.6]
[2009,null,47.6,49.3,27.7,30.5]
[2010,null,53.4,53.4,33.5,37.4]
[2011,null,60,62.3,43.8,47.1]
["Fuente:","Plan Ceibal con base en la ENHA 2006 y las ECH 2007 a 2011 del INE."]

{"sheet":"I-3.3.1","index":52,"n_rows":26,"n_cols":9,"rows_kept":26,"cut":false,"hidden":false,"merged":[[5,0,5,6],[6,0,6,6],[7,0,8,0],[29,0,29,5],[24,0,24,5],[25,0,25,4],[26,0,26,5],[28,0,28,5],[27,0,27,5],[7,1,7,8]]}
["Ministerio de Educación y Cultura"]
["Dirección de Educación"]
[]
[]
[]
["Cuadro I-3.3.1"]
["GASTO EN MILLONES DE PESOS CONSTANTES DE 2006 POR AÑO LECTIVO SEGÚN ÁMBITO DEL GASTO (2004 - 2011)"]
["ÁMBITO DEL GASTO","AÑO LECTIVO"]
[null,2004,2005,2006,2007,2008,2009,2010,2011]
[]
["TOTAL ",13806,14406,15866,18883,22388,{"$f":"G12+G15+G19+G20+G23+G24","v":25023},{"$f":"H12+H15+H19+H20+H23+H24","v":25608.201631370044},{"$f":"I12+I15+I19+I20+I23+I24","v":28090.376114455728}]
["Inst. básicas del sist. educación formal ",12883,13314,14345,16157,19010,22020,22218.742914241426,24360.780876643297]
["ANEP ",10337,10702,11455,12881,15223,17662,17771.812404214783,19422.883933100606]
["UDELAR ",2546,2612,2890,3276,3787,4357,4446.9305100266438,4937.8969435426907]
["Administración Central e Inciso 21 ",656,733,1079,1152,1327,1294,1523.0821154119599,1734.1173783754887]
["Educación policial y militar ",391,436,482,569,608,628,694.24126367036013,708.74089587940853]
["Otros Administración Central1  ",69,91,185,159,257,164,263.16409612463804,390.15565443085165]
["Partidas del inciso 21 con destino a educación2  ",196,206,412,424,462,502,565.67675561696171,635.2208280652286]
["Educación no formal inicial (CAIF) y CENFORES  ",141,191,240,281,473,540,535.62586508544496,666.66659918596088]
["Ciencia y Tecnología ",126,168,202,299,291,206,229.97380050800547,278.1368348016295]
["MEC3 ",109,125,147,240,161,79,84.644022929806567,73.695798686653944]
["PEDECIBA, Instituto Pasteur, ANII4  ",17,43,55,59,129,127,145.3297775781989,204.44103611497556]
["Plan Ceibal ",0,0,0,497,1203,801,908.95567893742884,843.90740107828003]
["Incentivo a la demanda educativa en secundaria ",0,0,0,0,84,162,191.82125718577964,206.76702437107159]
[]
["Fuentes: Elaborado en base a datos del MEF."]

{"sheet":"I-4.5.1","index":53,"n_rows":15,"n_cols":7,"rows_kept":15,"cut":false,"hidden":false,"merged":[[12,0,12,2],[13,0,13,2],[14,1,14,6],[5,0,5,6],[6,0,6,6],[7,0,8,2],[9,0,9,1],[10,0,10,1],[11,0,11,1]]}
["Ministerio de Educación y Cultura"]
["Dirección de Educación"]
[]
[]
[]
["Cuadro I-4.5.1"]
["INDICADORES Y VALORES 2008 a 2011 PARA LA META NACIONAL 3 (ODM)"]
["Asistencia (%) al sistema educativo del grupo 3 a 5 por edad simple:",null,null,2008,2009,2010,2011]
[]
[null,null,"3 años ",53.8,58.5,61.3,60.4]
[null,null,"4 años ",83,86.6,86.1,86.1]
[null,null,"5 años ",96.9,97.3,97.3,96.3]
["Tasa neta de asistencia a Educ. Media Básica (12 a 14 años) ",null,null,69.2,73.099999999999994,73.400000000000006,75.900000000000006]
["Tasa neta de asistencia e Educ. Media Superior (15 a 17 años) ",null,null,53.2,47.6,43.2,50.5]
["Fuente:","Procesamiento propio con base en la Encuesta Continua de Hogares 2010"]

{"sheet":"I-4.5.2","index":54,"n_rows":67,"n_cols":9,"rows_kept":67,"cut":false,"hidden":false,"merged":[[58,0,58,5],[59,1,59,8],[54,8,55,8],[55,3,55,4],[56,0,57,2],[56,3,56,5],[56,8,57,8],[57,3,57,5],[54,0,55,2],[54,3,54,4],[52,0,52,5],[53,0,53,5],[46,0,46,5],[47,0,48,1],[47,2,47,5],[49,0,49,5],[50,0,50,5],[51,0,51,5],[47,8,48,8],[48,2,48,5],[41,6,42,6],[41,7,42,7],[41,8,42,8],[43,0,43,5],[45,0,45,5],[44,0,44,5],[41,0,41,5],[42,0,42,5],[37,0,40,2],[37,3,37,5],[38,3,38,5],[39,3,39,5],[40,3,40,5],[36,0,36,5],[26,0,26,5],[27,0,32,2],[27,3,27,5],[27,8,32,8],[28,3,28,5],[29,3,29,5],[30,3,30,5],[31,3,31,5],[32,3,32,5],[33,0,33,5],[33,6,33,8],[34,0,35,2],[34,3,34,5],[35,3,35,5],[22,0,23,2],[22,3,22,5],[23,3,23,5],[24,0,25,2],[24,3,24,5],[25,3,25,5],[20,0,21,2],[20,3,20,5],[21,3,21,5],[15,8,16,8],[17,0,17,7],[18,0,19,2],[18,3,18,5],[19,3,19,5],[20,8,21,8],[15,0,15,5],[16,0,16,5],[9,0,9,5],[10,0,10,5],[11,0,11,5],[12,0,12,5],[13,0,14,3],[13,4,13,5],[14,4,14,5],[4,0,4,8],[5,0,5,8],[6,0,6,5],[7,0,8,5],[7,7,8,7],[7,8,8,8]]}
["Ministerio de Educación y Cultura"]
["Dirección de Educación"]
[]
[]
["Cuadro I-4.5.2"]
["INDICADORES Y VALORES 2011 PARA LAS METAS ESPECÍFICAS NACIONALES (Metas 2021)"]
[]
["INDICADOR:",null,null,null,null,null,"VALOR",null,"META 2021"]
[null,null,null,null,null,null,2011]
[]
["Indicador 1: Número de proyectos en los que diferentes sectores sociales participan y que se aplican de forma integrada ",null,null,null,null,null,"Muchas",null,"Incrementar anualmente"]
["Indicador 2: Porcentaje de familias con dificultades socioeconómicas que reciben apoyo para garantizar la asistencia habitual de sus hijos ",null,null,null,null,null,"Más del 70 %",null,1]
["Indicador 3: Porcentaje de niños de estos colectivos escolarizados en la educación inicial, primaria y secundaria básica ",null,null,null,null,null,"s/d",null,"Igual demás niños"]
["Indicador 4: Porcentaje de alumnado de minorías étnicas, poblaciones originarias y afro descendientes que realiza estudios de educación técnico-profesional (ETP) y universitarios.",null,null,null,"Educación Técnico-profesional",null,"s/d",null,"+2% por año"]
[null,null,null,null,"Educación Universitaria",null,"s/d",null,"+1% por año"]
["Indicador 5: Porcentaje de alumnos pertenecientes a minorías étnicas y pueblos originarios que dispone de libros y materiales educativos en su lengua materna ",null,null,null,null,null,null,null,"No aplica"]
["Indicador 6: Porcentaje de maestros bilingües trabajando en las aulas bilingües con estudiantes que hablan en su mismo idioma originario"]
["Indicador 7: Porcentaje de alumnos con necesidades educativas especiales escolarizados en la escuela ordinaria",null,null,null,null,null,null,null,0.04]
["Indicador 8: Porcentaje de niñas y niños de 0 a 6 años que participa en programas educativos",null,null,"Niños de 0 a 3 años de edad",null,null,0.32,null,"20% a 50%"]
[null,null,null,"Niños de 3 a 6 años de edad",null,null,0.8,null,1]
["Indicador 9: Porcentaje de educadores que tienen el título específico de educación inicial",null,null,"Educadores titulados en 1era infancia (0 a 2 años)",null,null,0.3,null,"60% al 100%"]
[null,null,null,"Educadores titulados en Educación Inicial (3 a 5 años)",null,null,0.9]
["Indicador 10: Porcentaje de escolarización y de finalización de la educación primaria",null,null,"Escolarización[1]",null,null,0.94,null,"80% al 100%"]
[null,null,null,"Finalización[2]",null,null,0.79,null,"> 90%"]
["Indicador 11: Porcentaje de escolarización y de finalización de la educación secundaria básica",null,null,"Escolarización[3]",null,null,0.74,null,"70% al 100%"]
[null,null,null,"Finalización[4]",null,null,0.66,null,"60% al 90%"]
["Indicador 12: Porcentaje de alumnado que completa la educación secundaria superior[5]",null,null,null,null,null,0.31,null,"60% al 90%"]
["Indicador 13: Porcentaje de alumnos con niveles satisfactorios de logro en competencias básicas en las pruebas nacionales e internacionales",null,null,"PISA (Lectura) 2009",null,null,0.57999999999999996,null,"Disminuye en al menos un 20% el número de alumnos situados entre los dos niveles bajos de rendimiento en las pruebas"]
[null,null,null,"PISA (Matemática) 2009",null,null,0.52]
[null,null,null,"PISA (Ciencias) 2009",null,null,0.56999999999999995]
[null,null,null,"SERCE (Lectura) 2006",null,null,0.95]
[null,null,null,"SERCE (Matemática) 2006",null,null,0.98]
[null,null,null,"SERCE (Ciencias) 2006",null,null,0.98]
["Indicador 14: Actualización de la educación en valores y para la ciudadanía en los currículos de las diferentes etapas educativas",null,null,null,null,null,"Está reforzada la educación en valores y para la ciudadanía en las distintas áreas y materias."]
["Indicador 15: Tiempo semanal de lectura en las distintas etapas",null,null,"Primaria",null,null,"4 hs o más",null," ³ ≥ 3 hs"]
[null,null,null,"Secundaria",null,null,"2 hs",null," ³ ≥ 2 hs"]
["Indicador 16:Frecuencia de uso del computador en la escuela por los alumnos para tareas de aprendizaje.",null,null,null,null,null,"Todas las materias.",null,"De forma habitual"]
["Indicador 17: Tiempo semanal dedicado a la educación artística y a la educación física en las escuelas.",null,null,"Primaria, media de hs (Artística)",null,null,"s/d",null,"³ ≥ 3 hs"]
[null,null,null,"Secundaria, media de hs (Artística)",null,null,"4 hs ",null," ³ ≥ 2 hs"]
[null,null,null,"Primaria, media de hs (Edu. Física)",null,null,"3 hs",null," ³ ≥ 3 hs"]
[null,null,null,"Secundaria, media de hs (Edu. Física)",null,null,"3 hs",null," ³ ≥ 2 hs"]
["Indicador 18: Porcentaje de alumnos que elige formación científica o",null,null,null,null,null,"s/d",null,0.2]
["técnica en los estudios postobligatorios."]
["Indicador 19: Porcentaje de escuelas con bibliotecas[6]",null,null,null,null,null,0.878,null,1]
["Indicador 20: Razón de alumnos por computador",null,null,null,null,null,1.7999999999999999E-2,null,"10 a 2"]
["Indicador 21: Porcentaje de escuelas públicas de primaria de tiempo completo ",null,null,null,null,null,7.0000000000000007E-2,null,"20% al 50%"]
["Indicador 22:Porcentaje de escuelas que participan en programas de evaluación",null,null,null,null,null,"s/d",null,"40% al 80%"]
["Indicador 23: Porcentaje de carreras técnico-profesionales cuyos currículos son diseñados por competencias teniendo en cuenta la demanda laboral",null,"Existen currículos de carreras Técnico-profesionales diseñados por competencias básicas",null,null,null,"s/d",null,"50% al 100%"]
[null,null,"La elaboración de los currículos de carreras técnico-profesionales tienen en cuenta la demanda laboral",null,null,null,"s/d"]
["Indicador 24: Porcentaje de alumnos que realizan prácticas formativas en empresas",null,null,null,null,null,"s/d",null,1]
["Indicador 25: Porcentaje de jóvenes que acceden a un puesto de trabajo acorde a sus estudios de ETP",null,null,null,null,null,"s/d",null,"50% al 75%"]
["Indicador 26: Porcentaje de población alfabetizada",null,null,null,null,null,0.98299999999999998,null,0.95]
["Indicador 27: Porcentaje de personas jóvenes y adultas recién alfabetizadas que continúan estudiando",null,null,null,null,null,"s/d",null,"30% al 70%"]
["Indicador 28: Porcentaje de jóvenes y adultos que participa en programas de formación y capacitación continua presenciales y a distancia",null,null,null,null,null,"s/d",null,0.2]
["Indicador 29: Porcentaje de titulación en formación inicial docente con acreditación oficial de su calidad",null,null,"CINE 1",null,"CEIP",1,null,"50% al 100%"]
[null,null,null,null,null,"CES y CETP",0.54800000000000004]
["Indicador 30: Porcentaje de profesorado de primaria con formación especializada en docencia superior al nivel de la Clasificación Internacional Normalizada de la Educación (CINE, nivel 3), y porcentaje de profesorado de secundaria con formación universitaria y pedagógica",null,null,"Porcentaje de maestros de primaria (CINE 1) que tienen una formación especializada en docencia, superior a la clasificación CINE 3 ",null,null,1,null,"70% al 100%"]
[null,null,null,"Porcentaje de profesorado de secundaria (CINE 2) que tiene una formación universitaria y capacitación pedagógica",null,null,0.14399999999999999]
["Indicador 31: Porcentaje de docentes que participan en programas de formación continua e innovación educativa",null,null,null,null,null,"Más del 80%",null,"³ ≥ 35%"]
["Fuente:","OEI (2011). Miradas sobre la Educación en Iberoamérica 2011, Consejo Rector, IESME, OEI."]
[]
["[1] Tasa neta de matriculación en Educación Primaria (niños de 6 a 11 años de edad; ECH-2011)."]
["[2] Niños de 14 y 15 años de edad con Educación Primaria culminada (ECH-2011)."]
["[3] Tasa neta de matriculación en Educación Media Básica (niños y jóvenes de 12 a 14 años de edad; ECH-2011)."]
["[4] Jóvenes de 17 y 18 años de edad con Educación Media Básica concluida (ECH-2011)."]
["[5] Jóvenes de 21y 22 años de edad con Educación Media Superior concluida (ECH-2011)."]
["[6] Sólo se contabilizan escuelas con bibliotecas con volúmenes en papel; no se contabiliza las bibliotecas digitales incluidas en las XO del Plan Ceibal (en dicho caso se alcanzaría el 100%)."]

{"sheet":"G I-1.2.1","index":55,"n_rows":31,"n_cols":1,"rows_kept":31,"cut":false,"hidden":false,"merged":[[0,0,0,3],[30,0,30,4]]}
["Ministerio de Educación y Cultura\nDirección de Educación"]
[]
[]
[]
[]
["Gráfico I-1.2.1"]
[]
[]
[]
[]
[]
[]
[]
[]
[]
[]
[]
[]
[]
[]
[]
[]
[]
[]
[]
[]
[]
[]
[]
[]
["Fuente: Censos de Población 1963, 1975, 1985 y 1996, ENHA 2006 y ECH de 2007 a 2011 del INE."]

{"sheet":"G I-1.2.2.","index":56,"n_rows":29,"n_cols":1,"rows_kept":29,"cut":false,"hidden":false,"merged":[[0,0,0,3]]}
["Ministerio de Educación y Cultura\nDirección de Educación"]
[]
[]
[]
["Gráfico I-1.2.2"]
[]
[]
[]
[]
[]
[]
[]
[]
[]
[]
[]
[]
[]
[]
[]
[]
[]
[]
[]
[]
[]
[]
[]
["Fuente: Elaboración propia en base a Encuesta Continua de Hogares 2011."]

{"sheet":"G I-1.2.3 ","index":57,"n_rows":29,"n_cols":1,"rows_kept":29,"cut":false,"hidden":false,"merged":[[0,0,0,3]]}
["Ministerio de Educación y Cultura\nDirección de Educación"]
[]
[]
[]
["Gráficos I-1.2.3 "]
[]
[]
[]
[]
[]
[]
[]
[]
[]
[]
[]
[]
[]
[]
[]
[]
[]
[]
[]
[]
[]
[]
[]
["Fuente: Elaboración propia en base a la ECH "]

{"sheet":"G I-1.2.4","index":58,"n_rows":29,"n_cols":2,"rows_kept":29,"cut":false,"hidden":false,"merged":[[0,0,0,3]]}
["Ministerio de Educación y Cultura\nDirección de Educación"]
[]
[]
[]
["Gráfico I-1.2.4"]
[]
[]
[]
[]
[]
[]
[]
[]
[]
[]
[]
[]
[]
[]
[]
[]
[]
[]
[]
[]
[]
[]
[]
["Fuente:","Elaboración propia en base a la ECH 2011 del INE."]

{"sheet":"G I-1.2.5","index":59,"n_rows":29,"n_cols":2,"rows_kept":29,"cut":false,"hidden":false,"merged":[[28,1,28,4],[0,0,0,3]]}
["Ministerio de Educación y Cultura\nDirección de Educación"]
[]
[]
[]
["Gráfico I-1.2.5"]
[]
[]
[]
[]
[]
[]
[]
[]
[]
[]
[]
[]
[]
[]
[]
[]
[]
[]
[]
[]
[]
[]
[]
["Fuente:","Elaboración propia en base a la ECH 2011 del INE."]

{"sheet":"G I-1.2.6","index":60,"n_rows":27,"n_cols":2,"rows_kept":27,"cut":false,"hidden":false,"merged":[[0,0,0,3],[26,1,26,5]]}
["Ministerio de Educación y Cultura\nDirección de Educación"]
[]
[]
[]
["Gráfico I-1.2.6"]
[]
[]
[]
[]
[]
[]
[]
[]
[]
[]
[]
[]
[]
[]
[]
[]
[]
[]
[]
[]
[]
["Fuentes:","Departamentos de Estadística u oficinas productoras de información del CEIP, CES, CETP, UdelaR, DFPD, INAU, y restantes instituciones públicas y privadas de educación terciaria."]

{"sheet":"G I-1.2.7","index":61,"n_rows":30,"n_cols":2,"rows_kept":30,"cut":false,"hidden":false,"merged":[[0,0,0,3],[28,1,28,7],[29,1,29,7]]}
["Ministerio de Educación y Cultura\nDirección de Educación"]
[]
[]
[]
["Gráfico I-1.2.7"]
[]
[]
[]
[]
[]
[]
[]
[]
[]
[]
[]
[]
[]
[]
[]
[]
[]
[]
[]
[]
[]
[]
[]
["Fuentes:","Departamentos de Estadística y oficinas productoras de información del CEIP, CES, CETP (UTU), UdelaR e instituciones privadas de educación terciaria."]
["Nota:","Por razones de escala, no se incluye Terciaria No Universitaria 2011. No se cuenta con información sobre la cantidad de hombres y mujeres en Formación Docente, sólo existe esta información para Seguridad y Defensa y Otras Terciarias No Universitarias, que constituyen un volumen de matrícula demasiado bajo como para poder visualizarse en el gráfico."]

{"sheet":"G I-1.2.8","index":62,"n_rows":29,"n_cols":2,"rows_kept":29,"cut":false,"hidden":false,"merged":[[28,1,29,8],[0,0,0,3]]}
["Ministerio de Educación y Cultura\nDirección de Educación"]
[]
[]
[]
["Gráfico I-1.2.8"]
["Gráfico I-1.2.8"]
[]
[]
[]
[]
[]
[]
[]
[]
[]
[]
[]
[]
[]
[]
[]
[]
[]
[]
[]
[]
[]
[]
["Fuentes:","Departamentos de Estadística u oficinas productoras de información del CEIP, CES, CETP (UTU), UdelaR, CFE e instituciones privadas de educación terciaria."]

{"sheet":"G I-1.2.9 ","index":63,"n_rows":27,"n_cols":1,"rows_kept":27,"cut":false,"hidden":false,"merged":[[0,0,0,3],[25,0,25,8],[26,0,26,7]]}
["Ministerio de Educación y Cultura\nDirección de Educación"]
[]
["Gráfico I-1.2.9"]
[]
[]
[]
[]
[]
[]
[]
[]
[]
[]
[]
[]
[]
[]
[]
[]
[]
[]
[]
[]
[]
[]
["Fuentes : Departamentos de Estadística y oficinas productoras de informacion del CEIP. CES,CETP , (UTU) . UELAR e instituciones privadas de educacion terciaria."]
["Nota: Por razonesde escala , n se incluye Terciaria  No Universitaria 2011. No se cuenta informacion sobre la cantidad de mujres y hombres en Formación Docente, sólo existe esta información para Seguridad y Defensa y Otras Terciarias No Universitarias, que constituyen un columen de matrícula demasido bajo como para poder visualizarse en el gráfico."]

{"sheet":"G I-1.2.10","index":64,"n_rows":27,"n_cols":1,"rows_kept":27,"cut":false,"hidden":false,"merged":[[0,0,0,3],[40,0,40,6],[41,0,41,6],[37,0,37,6],[38,0,38,6],[39,0,39,6]]}
["Ministerio de Educación y Cultura\nDirección de Educación"]
[]
["Gráfico I-1.2.10"]
[]
[]
[]
[]
[]
[]
[]
[]
[]
[]
[]
[]
[]
[]
[]
[]
[]
[]
[]
[]
[]
[]
[]
["Fuente : Elaboración propia en base a ECH"]

{"sheet":"G I-1.2.11","index":65,"n_rows":29,"n_cols":1,"rows_kept":29,"cut":false,"hidden":false,"merged":[[36,0,36,6],[37,0,37,6],[38,0,38,6],[0,0,0,3]]}
["Ministerio de Educación y Cultura\nDirección de Educación"]
[]
[]
[]
["Gráfico I-1.2.11"]
[]
[]
[]
[]
[]
[]
[]
[]
[]
[]
[]
[]
[]
[]
[]
[]
[]
[]
[]
[]
[]
[]
[]
["Fuente : Elaboración propia en base a la ECH 2011"]

{"sheet":"G I-1.2.12","index":66,"n_rows":28,"n_cols":1,"rows_kept":28,"cut":false,"hidden":false,"merged":[[0,0,0,3]]}
["Ministerio de Educación y Cultura\nDirección de Educación"]
[]
[]
[]
["Gráfico I-1.2.12"]
[]
[]
[]
[]
[]
[]
[]
[]
[]
[]
[]
[]
[]
[]
[]
[]
[]
[]
[]
[]
[]
[]
["Fuente : Elaboración propia en base a la ECH  2011"]

{"sheet":"G I-1.2.13","index":67,"n_rows":28,"n_cols":1,"rows_kept":28,"cut":false,"hidden":false,"merged":[[0,0,0,3]]}
["Ministerio de Educación y Cultura\nDirección de Educación"]
[]
[]
[]
["Gráfico I-1.2.13"]
[]
[]
[]
[]
[]
[]
[]
[]
[]
[]
[]
[]
[]
[]
[]
[]
[]
[]
[]
[]
[]
[]
["Fuente: Elaboración propia en base a Encuesta Continua de Hogares 2011."]

{"sheet":"G I-1.2.14","index":68,"n_rows":26,"n_cols":1,"rows_kept":26,"cut":false,"hidden":false,"merged":[[0,0,0,3]]}
["Ministerio de Educación y Cultura\nDirección de Educación"]
[]
[]
[]
["Gráfico I-1.2.14"]
[]
[]
[]
[]
[]
[]
[]
[]
[]
[]
[]
[]
[]
[]
[]
[]
[]
[]
[]
[]
["Fuente : Elaboración propia en base a la ECH  2011"]

{"sheet":"G I-1.2.15","index":69,"n_rows":25,"n_cols":1,"rows_kept":25,"cut":false,"hidden":false,"merged":[[0,0,0,3]]}
["Ministerio de Educación y Cultura\nDirección de Educación"]
[]
[]
[]
["Gráfico I-1.2.15"]
[]
[]
[]
[]
[]
[]
[]
[]
[]
[]
[]
[]
[]
[]
[]
[]
[]
[]
[]
["Fuente : Elaboración propia en base a la ECH  2011"]

{"sheet":"G I-1.2.16","index":70,"n_rows":25,"n_cols":1,"rows_kept":25,"cut":false,"hidden":false,"merged":[[0,0,0,3]]}
["Ministerio de Educación y Cultura\nDirección de Educación"]
[]
[]
[]
["Gráfico I-1.2.16"]
[]
[]
[]
[]
[]
[]
[]
[]
[]
[]
[]
[]
[]
[]
[]
[]
[]
[]
[]
["Fuente : Elaboración propia en base a la ECH  2011"]

{"sheet":"G I-1.2.17","index":71,"n_rows":42,"n_cols":1,"rows_kept":42,"cut":false,"hidden":false,"merged":[[0,0,0,3]]}
["Ministerio de Educación y Cultura\nDirección de Educación"]
[]
[]
[]
["Gráfico I-1.2.17"]
[]
[]
[]
[]
[]
[]
[]
[]
[]
[]
[]
[]
[]
[]
[]
[]
[]
[]
[]
[]
[]
[]
[]
[]
[]
[]
[]
[]
[]
[]
[]
[]
[]
[]
[]
[]
["Fuente: Elaboración propia en base a Encuesta Continua de Hogares 2011."]

{"sheet":"G I-1.2.18","index":72,"n_rows":29,"n_cols":1,"rows_kept":29,"cut":false,"hidden":false,"merged":[[0,0,0,3]]}
["Ministerio de Educación y Cultura\nDirección de Educación"]
[]
[]
[]
["Gráfico I-1.2.18"]
[]
[]
[]
[]
[]
[]
[]
[]
[]
[]
[]
[]
[]
[]
[]
[]
[]
[]
[]
[]
[]
[]
[]
["Fuente: Elaboración propia en base a la ECH 2011."]

{"sheet":"G I-1.2.19","index":73,"n_rows":27,"n_cols":1,"rows_kept":27,"cut":false,"hidden":false,"merged":[[0,0,0,3]]}
["Ministerio de Educación y Cultura\nDirección de Educación"]
[]
[]
[]
["Gráfico I-1.2.19"]
[]
[]
[]
[]
[]
[]
[]
[]
[]
[]
[]
[]
[]
[]
[]
[]
[]
[]
[]
[]
[]
["Fuente: Elaboración propia en base a la ECH 2011."]

{"sheet":"G I-1.2.20","index":74,"n_rows":27,"n_cols":1,"rows_kept":27,"cut":false,"hidden":false,"merged":[[0,0,0,3]]}
["Ministerio de Educación y Cultura\nDirección de Educación"]
[]
[]
["Gráfico I-1.2.20"]
[]
[]
[]
[]
[]
[]
[]
[]
[]
[]
[]
[]
[]
[]
[]
[]
[]
[]
[]
[]
[]
[]
["Fuente: Elaboración propia en base a la ECH 2011."]

{"sheet":"G I-1.2.21","index":75,"n_rows":18,"n_cols":1,"rows_kept":18,"cut":false,"hidden":false,"merged":[[0,0,0,3]]}
["Ministerio de Educación y Cultura\nDirección de Educación"]
[]
["Gráfico I-1.2.21"]
[]
[]
[]
[]
[]
[]
[]
[]
[]
[]
[]
[]
[]
[]
["Fuente: Elaboración propia en base a la ECH 2011."]

{"sheet":"G I-2.1.1","index":76,"n_rows":33,"n_cols":2,"rows_kept":33,"cut":false,"hidden":false,"merged":[[0,0,0,3],[32,1,32,7]]}
["Ministerio de Educación y Cultura\nDirección de Educación"]
[]
[]
[]
["Gráfico I-2.1.1"]
[]
[]
[]
[]
[]
[]
[]
[]
[]
[]
[]
[]
[]
[]
[]
[]
[]
[]
[]
[]
[]
[]
[]
[]
[]
[]
[]
["Fuente:","Elaboración propia en base en datos del Departamento de Estadística del CEIP, Sistema de Información para la Infancia de INAU Programa Nuestros Niños de la IMM y Área de Investigación y Estadística, MEC (CEIP)"]

{"sheet":"G I-2.1.2","index":77,"n_rows":41,"n_cols":2,"rows_kept":41,"cut":false,"hidden":false,"merged":[[27,0,27,5],[0,0,0,3],[39,1,39,9],[40,1,40,9]]}
["Ministerio de Educación y Cultura\nDirección de Educación"]
[]
[]
[]
["Gráfico I-2.1.2"]
[]
[]
[]
[]
[]
[]
[]
[]
[]
[]
[]
[]
[]
[]
[]
[]
[]
[]
[]
[]
[]
[]
[]
[]
[]
[]
[]
[]
[]
[]
[]
[]
[]
[]
["Fuente:","Elaboración propia en base a datos del Departamento de Estadística del CEIP, Sistema de Información para la Infancia de INAU y Área de Primera Infancia del MEC"]
["Nota:","En el presente gráfico no se han incluido los 1.222 niños que asisten al Programa Nuestros Niños de la IMM ni los 1.505 que asisten al INAU en la modalidad “Diurna”"]

{"sheet":"G I-2.1.3","index":78,"n_rows":30,"n_cols":2,"rows_kept":30,"cut":false,"hidden":false,"merged":[[0,0,0,3],[28,1,28,9],[29,1,29,9]]}
["Ministerio de Educación y Cultura\nDirección de Educación"]
[]
[]
[]
["Gráfico I-2.1.3"]
[]
[]
[]
[]
[]
[]
[]
[]
[]
[]
[]
[]
[]
[]
[]
[]
[]
[]
[]
[]
[]
[]
[]
["Fuente:","Elaboración propia en base a datos del Departamento de Estadística del CEIP, Sistema de Información para la Infancia de INAU y Área de Primera Infancia del MEC"]
["Nota:","En el presente gráfico no se han incluido los 1.222 niños que asisten al Programa Nuestros Niños de la IMM ni los 1.505 que asisten al INAU en la modalidad “Diurna”"]

{"sheet":"G I-2.1.4","index":79,"n_rows":29,"n_cols":1,"rows_kept":29,"cut":false,"hidden":false,"merged":[[0,0,0,3]]}
["Ministerio de Educación y Cultura\nDirección de Educación"]
[]
[]
[]
["Gráfico I-2.1.4"]
[]
[]
[]
[]
[]
[]
[]
[]
[]
[]
[]
[]
[]
[]
[]
[]
[]
[]
[]
[]
[]
[]
[]
["Fuente: Elaboración propia en base a información del Departamento de Estadística del CEIP."]

{"sheet":"G I-2.1.5","index":80,"n_rows":30,"n_cols":7,"rows_kept":30,"cut":false,"hidden":false,"merged":[[0,0,0,3]]}
["Ministerio de Educación y Cultura\nDirección de Educación"]
[]
[]
[]
["Gráfico I-2.1.5"]
[]
[]
[]
[]
[]
[]
[]
[]
[]
[]
[]
[]
[null,null,null,null,null,null," "]
[]
[]
[]
[]
[]
[]
[]
[]
[]
[]
[]
["Fuente: Elaboración propia en base a información del Departamento de Estadística del CEIP."]

{"sheet":"G I-2.2.1","index":81,"n_rows":31,"n_cols":2,"rows_kept":31,"cut":false,"hidden":false,"merged":[[28,1,29,8],[30,1,31,10],[0,0,0,3]]}
["Ministerio de Educación y Cultura\nDirección de Educación"]
[]
[]
[]
[]
["Gráfico I-2.2.1"]
[]
[]
[]
[]
[]
[]
[]
[]
[]
[]
[]
[]
[]
[]
[]
[]
[]
[]
[]
[]
[]
[]
[null,"Elaboración propia en base a datos del Departamento de Estadística del CEIP."]
["Fuente:"]
["Nota:","Educación primaria común incluye la matrícula de educación en Jardines de Infantes con Ciclo Inicial (JICI) compuesta por 783 alumnos."]

{"sheet":"G I-2.2.2","index":82,"n_rows":29,"n_cols":1,"rows_kept":29,"cut":false,"hidden":false,"merged":[[0,0,0,3],[28,0,28,4]]}
["Ministerio de Educación y Cultura\nDirección de Educación"]
[]
[]
[]
[]
["Gráfico I-2.2.2"]
[]
[]
[]
[]
[]
[]
[]
[]
[]
[]
[]
[]
[]
[]
[]
[]
[]
[]
[]
[]
[]
[]
["Fuente: Elaboración propia en base a datos proporcionados por el Departamento de Estadística del CEIP."]

{"sheet":"G I-2.2.3","index":83,"n_rows":30,"n_cols":1,"rows_kept":30,"cut":false,"hidden":false,"merged":[[29,0,29,1],[0,0,0,2]]}
["Ministerio de Educación y Cultura\nDirección de Educación"]
[]
[]
[]
["Gráfico I-2.2.3"]
[]
[]
[]
[]
[]
[]
[]
[]
[]
[]
[]
[]
[]
[]
[]
[]
[]
[]
[]
[]
[]
[]
[]
[]
["Fuente: Monitor Educativo de Enseñanza Primaria ANEP."]

{"sheet":"G I-2.2.4","index":84,"n_rows":27,"n_cols":1,"rows_kept":27,"cut":false,"hidden":false,"merged":[[0,0,0,3]]}
["Ministerio de Educación y Cultura\nDirección de Educación"]
[]
[]
[]
["Gráfico I-2.2.4"]
[]
[]
[]
[]
[]
[]
[]
[]
[]
[]
[]
[]
[]
[]
[]
[]
[]
[]
[]
[]
[]
["Fuente: Monitor Educativo de Enseñanza Primaria. ANEP"]

{"sheet":"G I-2.3.1","index":85,"n_rows":32,"n_cols":1,"rows_kept":32,"cut":false,"hidden":false,"merged":[[0,0,0,3]]}
["Ministerio de Educación y Cultura\nDirección de Educación"]
[]
[]
[]
["Gráfico I-2.3.1"]
[]
[]
[]
[]
[]
[]
[]
[]
[]
[]
[]
[]
[]
[]
[]
[]
[]
[]
[]
[]
[]
[]
[]
[]
["Fuente: Departamentos de Estadísticas del CEIP, CES y CETP"]
["Nota: Incluye Ciclo Básico Rural, Media General y Media Técnica."]
["         Enseñanza técnica incluye educación de Jóvenes y Adultos y excuye educación Terciaria"]

{"sheet":"G I-2.3.2","index":86,"n_rows":34,"n_cols":1,"rows_kept":34,"cut":false,"hidden":false,"merged":[[0,0,0,3]]}
["Ministerio de Educación y Cultura\nDirección de Educación"]
[]
[]
[]
["Gráfico I-2.3.2"]
[]
[]
[]
[]
[]
[]
[]
[]
[]
[]
[]
[]
[]
[]
[]
[]
[]
[]
[]
[]
[]
[]
[]
[]
["Fuente: Departamentos de Estadísticas del CEIP, CES y CETP"]
["Nota: Incluye Ciclo Básico Rural, enseñanza secundaria y enseñanza técnica"]
["         El cambio en la tendencia en Bachillerato se explica por el peso de la matrícula del CEPT en 2009."]
["         En dicho año se transformó la estructura de la Educación Superior con la subsiguiente incorporación de "]
["         Bachillerato Figari, Bachillerato Profesional, EMP Especialización y Articulación en tanto se eliminó"]

{"sheet":"G I-2.3.3","index":87,"n_rows":28,"n_cols":1,"rows_kept":28,"cut":false,"hidden":false,"merged":[[27,0,28,5],[0,0,0,3]]}
["Ministerio de Educación y Cultura\nDirección de Educación"]
[]
[]
[]
["Gráfico I-2.3.3"]
[]
[]
[]
[]
[]
[]
[]
[]
[]
[]
[]
[]
[]
[]
[]
[]
[]
[]
[]
[]
[]
[]
["Fuente Departamentos de Estadísticas del CEIP, CES y CETP."]

{"sheet":"G I-2.3.4","index":88,"n_rows":27,"n_cols":2,"rows_kept":27,"cut":false,"hidden":false,"merged":[[25,1,25,5],[0,0,0,3]]}
["Ministerio de Educación y Cultura\nDirección de Educación"]
[]
[]
[]
["Gráfico I-2.3.4"]
[]
[]
[]
[]
[]
[]
[]
[]
[]
[]
[]
[]
[]
[]
[]
[]
[]
[]
[]
[]
["Fuente:","Departamentos de Estadística del CEIP, CES y del CETP"]
["Nota:","Media Básica General incluye Ciclo Básico Rural"]

{"sheet":"G I-2.3.5.","index":89,"n_rows":34,"n_cols":2,"rows_kept":34,"cut":false,"hidden":false,"merged":[[32,1,32,6],[0,0,0,3]]}
["Ministerio de Educación y Cultura\nDirección de Educación"]
[]
[]
[]
["Gráfico I-2.3.5"]
[]
[]
[]
[]
[]
[]
[]
[]
[]
[]
[]
[]
[]
[]
[]
[]
[]
[]
[]
[]
[]
[]
[]
[]
[]
[]
[]
["Fuente:","Departamento de Estadística del CES."]
["Nota:","La matrícula de la oferta pública no incluye la correspondiente a enseñanza técnica, por no contarse con información sobre la oferta técnica privada."]

{"sheet":"GI-2.3.6","index":90,"n_rows":30,"n_cols":1,"rows_kept":30,"cut":false,"hidden":false,"merged":[[28,0,28,5],[29,0,29,5],[0,0,0,3]]}
["Ministerio de Educación y Cultura\nDirección de Educación"]
[]
[]
[]
["Gráfico I-2.3.6"]
[]
[]
[]
[]
[]
[]
[]
[]
[]
[]
[]
[]
[]
[]
[]
[]
[]
[]
[]
[]
[]
[]
[]
["Fuente: Departamento de Estadística del CES."]
["Nota: La matrícula de la oferta pública no incluye la correspondiente a enseñanza técnica, por no contarse con información sobre la oferta técnica privada."]

{"sheet":"GI-2.3.7","index":91,"n_rows":30,"n_cols":1,"rows_kept":30,"cut":false,"hidden":false,"merged":[[0,0,0,3]]}
["Ministerio de Educación y Cultura\nDirección de Educación"]
[]
[]
[]
["Gráfico I-2.3.7"]
[]
[]
[]
[]
[]
[]
[]
[]
[]
[]
[]
[]
[]
[]
[]
[]
[]
[]
[]
[]
[]
[]
["Fuente: Departamento de Estadística del CES."]
["Nota: La matrícula de la oferta pública no incluye la correspondiente a enseñanza técnica, ni liceos de extraedad y Plan 2003 "]
["         y Plan 2003 (TEMS)"]

{"sheet":"G I-2.3.8","index":92,"n_rows":33,"n_cols":1,"rows_kept":33,"cut":false,"hidden":false,"merged":[[0,0,0,3]]}
["Ministerio de Educación y Cultura\nDirección de Educación"]
[]
[]
[]
["Gráfico I-2.3.8"]
[]
[]
[]
[]
[]
[]
[]
[]
[]
[]
[]
[]
[]
[]
[]
[]
[]
[]
[]
[]
[]
[]
[]
[]
[]
[]
[]
["Fuente: Departamentos de Estadística del CES y del CETP."]

{"sheet":"G I-2.3.9","index":93,"n_rows":34,"n_cols":1,"rows_kept":34,"cut":false,"hidden":false,"merged":[[33,0,33,5],[0,0,0,3]]}
["Ministerio de Educación y Cultura\nDirección de Educación"]
[]
[]
[]
["Gráfico I-2.3.9"]
[]
[]
[]
[]
[]
[]
[]
[]
[]
[]
[]
[]
[]
[]
[]
[]
[]
[]
[]
[]
[]
[]
[]
[]
[]
[]
[]
["Fuente: Departamento de Estadística del CES."]
["Nota:   La matrícula de la oferta pública no incluye la correspondiente a enseñanza técnica"]

{"sheet":"GI-2.3.10","index":94,"n_rows":29,"n_cols":2,"rows_kept":29,"cut":false,"hidden":false,"merged":[[0,0,0,3]]}
["Ministerio de Educación y Cultura\nDirección de Educación"]
[]
[]
[]
["Gráfico I-2.3.10"]
[]
[]
[]
[]
[]
[]
[]
[]
[]
[]
[]
[]
[]
[]
[]
[]
[]
[]
[]
[]
[]
[]
["Fuente:","Elaboración propia en base a información del Departamento de Estadística del CETP."]
["Nota:","No incluye educación Terciaria."]

{"sheet":"G I-2.4.1.","index":95,"n_rows":33,"n_cols":1,"rows_kept":33,"cut":false,"hidden":false,"merged":[[0,0,0,3]]}
["Ministerio de Educación y Cultura\nDirección de Educación"]
[]
[]
[]
["Gráfico I-2.4.1"]
[]
[]
[]
[]
[]
[]
[]
[]
[]
[]
[]
[]
[]
[]
[]
[]
[]
[]
[]
[]
[]
[]
[]
[]
[]
[]
["Fuente: Elaboración propia en base a información del Departamento de Estadística del CETP. "]
["Nota: El total no incluye Nivel Terciario."]

{"sheet":"G I-.2.5.1","index":96,"n_rows":30,"n_cols":2,"rows_kept":30,"cut":false,"hidden":false,"merged":[[26,1,27,6],[29,1,31,11],[28,1,28,10],[0,0,0,3]]}
["Ministerio de Educación y Cultura\nDirección de Educación"]
[]
[]
[]
["Gráfico I-2.5.1"]
[]
[]
[]
[]
[]
[]
[]
[]
[]
[]
[]
[]
[]
[]
[]
[]
[]
[]
[]
[]
[]
[null,"Elaboración propia en base a información del Departamento de Estadística del CETP"]
["Fuente:"]
["Notas:","No incluye las ofertas del Consejo de Formación en Educación (CFE) de ANEP ni Seguridad y Defensa, que se presentan aparte más adelante."]
[null,"En 2005 el ISEF no reportó información, de manera que se incluye el último dato disponible: 1181 matriculados (2004). A partir de 2006 reportó en UdelaR porque pasó a formar parte de dicha institución."]

{"sheet":"G I-.2.5.2","index":97,"n_rows":27,"n_cols":1,"rows_kept":27,"cut":false,"hidden":false,"merged":[[0,0,0,3]]}
["Ministerio de Educación y Cultura\nDirección de Educación"]
[]
[]
[]
["Gráfico I-2.5.2"]
[]
[]
[]
[]
[]
[]
[]
[]
[]
[]
[]
[]
[]
[]
["Fuente:"]
[]
[]
[]
[]
[]
[]
["Elaboración propia en base a información proporcionada por las oficinas productoras de estadísticas de cada una de las instituciones."]

{"sheet":"G-.2.5.3","index":98,"n_rows":27,"n_cols":2,"rows_kept":27,"cut":false,"hidden":false,"merged":[[0,0,0,3],[26,1,26,5]]}
["Ministerio de Educación y Cultura\nDirección de Educación"]
[]
[]
[]
["Gráfico I-2.5.4"]
[]
[]
[]
[]
[]
[]
[]
[]
[]
[]
[]
[]
[]
[]
[]
[]
[]
[]
[]
[]
[]
["Fuente:","Elaboración propia en base a información proporcionada por las oficinas productoras de estadísticas de cada una de las instituciones."]

{"sheet":"G I-2.5.4.","index":99,"n_rows":35,"n_cols":2,"rows_kept":35,"cut":false,"hidden":false,"merged":[[0,0,0,3],[34,1,34,7]]}
["Ministerio de Educación y Cultura\nDirección de Educación"]
[]
[]
[]
["Gráfico I-2.5.4"]
[]
[]
[]
[]
[]
[]
[]
[]
[]
[]
[]
[]
[]
[]
[]
[]
[]
[]
[]
[]
[]
[]
[]
[]
[]
[]
[]
[]
[]
["Fuente:","Elaboración propia en base a información proporcionada por las oficinas productoras de estadísticas de cada una de las instituciones."]

{"sheet":"GI-.2.5.5","index":100,"n_rows":27,"n_cols":2,"rows_kept":27,"cut":false,"hidden":false,"merged":[[0,0,0,3]]}
["Ministerio de Educación y Cultura\nDirección de Educación"]
[]
[]
[]
["Gráfico I-2.5.6"]
[]
[]
[]
[]
[]
[]
[]
[]
[]
[]
[]
[]
[]
[]
[]
[]
[]
[]
[]
[]
[]
["Fuente:","Dirección de Formación y Perfeccionamiento Docente"]

{"sheet":"GI-.2.5.6.","index":101,"n_rows":33,"n_cols":1,"rows_kept":33,"cut":false,"hidden":false,"merged":[[0,0,0,3]]}
["Ministerio de Educación y Cultura\nDirección de Educación"]
[]
[]
[]
["Gráfico I-2.5.7"]
["Gráfico I-2.5.3."]
[]
[]
[]
[]
[]
[]
[]
[]
[]
[]
[]
[]
[]
[]
[]
[]
[]
[]
[]
[]
[]
[]
[]
[]
[]
[]
["Fuente: Dirección de Formación y Perfeccionamiento Docente"]

{"sheet":"GI-.2.5.7.","index":102,"n_rows":38,"n_cols":1,"rows_kept":38,"cut":false,"hidden":false,"merged":[[0,0,0,3]]}
["Ministerio de Educación y Cultura\nDirección de Educación"]
[]
[]
[]
["Gráfico I-2.5.4"]
[]
[]
[]
[]
[]
[]
[]
[]
[]
[]
[]
[]
[]
[]
[]
[]
[]
[]
[]
[]
[]
[]
[]
[]
[]
[]
[]
[]
[]
[]
["Fuente: Dirección de Formación y Perfeccionamiento Docente"]
["Nota: La serie presentada fue ajustada por la fuente, de manera que no coincide exactamente con la presentada "]
["         en años anteriores. "]

{"sheet":"G I-2.6.1.","index":103,"n_rows":26,"n_cols":2,"rows_kept":26,"cut":false,"hidden":false,"merged":[[0,0,0,3],[25,1,25,4]]}
["Ministerio de Educación y Cultura\nDirección de Educación"]
[]
[]
[]
["Gráfico I-2.6.1"]
[]
[]
[]
[]
[]
[]
[]
[]
[]
[]
[]
[]
[]
[]
[]
[]
[]
[]
[]
[]
["Fuente:","Elaboración propia en base a información proporcionada por las oficinas productoras de estadísticas de cada una de las instituciones."]

{"sheet":"G I-2.6.2","index":104,"n_rows":37,"n_cols":1,"rows_kept":37,"cut":false,"hidden":false,"merged":[[36,0,36,7],[0,0,0,3]]}
["Ministerio de Educación y Cultura\nDirección de Educación"]
[]
[]
[]
[]
["Gráfico I-2.6.2"]
[]
[]
[]
[]
[]
[]
[]
[]
[]
[]
[]
[]
[]
[]
[]
[]
[]
[]
[]
[]
[]
[]
[]
[]
[]
[]
[]
[]
[]
["Fuente: Elaboración propia en base información de las oficinas productoras de las instituciones."]
["Nota: Los ingresos  a cursos de grado para UdelaR correspondientes al período 2000-2010 son extraídos de Estadísticas Básicas 2010 - Dirección General de Planeamiento -UdelaR."]

{"sheet":"G I-2.6.3","index":105,"n_rows":29,"n_cols":2,"rows_kept":29,"cut":false,"hidden":false,"merged":[[28,1,29,8],[0,0,0,3]]}
["Ministerio de Educación y Cultura\nDirección de Educación"]
[]
[]
[]
["Gráfico I-2.6.3"]
[]
[]
[]
[]
[]
[]
[]
[]
[]
[]
[]
[]
[]
[]
[]
[]
[]
[]
[]
[]
[]
[]
[]
["Fuente:","Elaboración propia en base a información proporcionada por la UdelaR y las oficinas productoras de estadísticas educativas de los Institutos Universitarios y de las Universidades Privadas."]

{"sheet":"G I-2.6.4","index":106,"n_rows":31,"n_cols":2,"rows_kept":31,"cut":false,"hidden":false,"merged":[[27,1,27,8],[28,1,29,9],[0,0,0,3]]}
["Ministerio de Educación y Cultura\nDirección de Educación"]
[]
[]
[]
["Gráfico I-2.6.4"]
[]
[]
[]
[]
[]
[]
[]
[]
[]
[]
[]
[]
[]
[]
[]
[]
[]
[]
[]
[]
[]
[]
["Fuente:","Elaboración propia en base a información proporcionada por UdelaR."]
["Nota:","Los ingresos y egresos a cursos de grado para UdelaR correspondientes al período 2000-2009 son extraídos de Estadísticas Básicas 2010 - Dirección General de Planeamiento –UdelaR."]
[]
[null,"No Incluye postgrado "]

{"sheet":"G I-2.6.5","index":107,"n_rows":38,"n_cols":2,"rows_kept":38,"cut":false,"hidden":false,"merged":[[0,0,0,3],[35,0,35,7],[37,1,37,6]]}
["Ministerio de Educación y Cultura\nDirección de Educación"]
[]
[]
[]
[]
["Gráfico I-2.6.5"]
[]
[]
[]
[]
[]
[]
[]
[]
[]
[]
[]
[]
[]
[]
[]
[]
[]
[]
[]
[]
[]
[]
[]
[]
[]
[]
[]
[]
[]
["Elaboración propia en base a información proporcionada por la UdelaR y las oficinas productoras de estadísticas educativas de los Institutos Universitarios y de las Universidades Privadas."]
[]
["Nota:","No incluye postgrado."]

{"sheet":"G I-2.6.6","index":108,"n_rows":30,"n_cols":2,"rows_kept":30,"cut":false,"hidden":false,"merged":[[27,1,27,9],[28,1,28,11],[0,0,0,3]]}
["Ministerio de Educación y Cultura\nDirección de Educación"]
[]
[]
[]
["Gráfico I-2.6.6"]
[]
[]
[]
[]
[]
[]
[]
[]
[]
[]
[]
[]
[]
[]
[]
[]
[]
[]
[]
[]
[]
[]
["Fuente:","Elaboración propia en base información de las oficinas productoras de las instituciones."]
["Nota:","Los ingresos y egresos a cursos de postgrado para el período 2001-2009 son extraídos de Estadísticas Básicas 2010 - Dirección General de Planeamiento –UdelaR."]
[null,"No incluye grado."]

{"sheet":"G I-2.6.7","index":109,"n_rows":28,"n_cols":2,"rows_kept":28,"cut":false,"hidden":false,"merged":[[29,0,29,6],[26,1,26,11],[27,1,27,2],[0,0,0,3]]}
["Ministerio de Educación y Cultura\nDirección de Educación"]
[]
[]
[]
["Gráfico I-2.6.7"]
[]
[]
[]
[]
[]
[]
[]
[]
[]
[]
[]
[]
[]
[]
[]
[]
[]
[]
[]
[]
[]
["Nota:","Los ingresos y egresos a cursos de postgrado para el período 2001-2009 son extraídos de Estadísticas Básicas 2010 - Dirección General de Planeamiento –UdelaR."]
[null,"No incluye grado"]

{"sheet":"G I-2.6.8","index":110,"n_rows":5,"n_cols":1,"rows_kept":5,"cut":false,"hidden":false,"merged":[[0,0,0,3]]}
["Ministerio de Educación y Cultura\nDirección de Educación"]
[]
[]
[]
["Gráfico I-2.6.8"]

{"sheet":"G I--2-8-1-","index":111,"n_rows":5,"n_cols":1,"rows_kept":5,"cut":false,"hidden":false,"merged":[[0,0,0,3]]}
["Ministerio de Educación y Cultura\nDirección de Educación"]
[]
[]
[]
["Gráfico I-2.8.1."]

{"sheet":"G.I-3.1.1","index":112,"n_rows":28,"n_cols":2,"rows_kept":28,"cut":false,"hidden":false,"merged":[[0,0,0,3]]}
["Ministerio de Educación y Cultura\nDirección de Educación"]
[]
[]
[]
["Gráfico I-3.1.1."]
[]
[]
[]
[]
[]
[]
[]
[]
[]
[]
[]
[]
[]
[]
[]
[]
[]
[]
[]
[]
[]
["Fuente:","Elaboración propia con base en información proporcionada por el Área de Becas de la Dirección de Educación del MEC y el Fondo de Solidaridad."]
["Nota:","No se han graficado las Becas “Carlos Quijano” por problemas de escala: la relación de volumen entre unas y otras no permite su visualización en un mismo gráfico."]

{"sheet":"G I-3.1.2","index":113,"n_rows":27,"n_cols":2,"rows_kept":27,"cut":false,"hidden":false,"merged":[[0,0,0,3]]}
["Ministerio de Educación y Cultura\nDirección de Educación"]
[]
[]
[]
["Gráfico I-3.1.2"]
[]
[]
[]
[]
[]
[]
[]
[]
[]
[]
[]
[]
[]
[]
[]
[]
[]
[]
[]
[]
[]
["Fuente:","Elaboración propia con base en información proporcionada por el Área de Becas de la Dirección de Educación del MEC y el Fondo de Solidaridad."]

{"sheet":"G I-3.1.3","index":114,"n_rows":22,"n_cols":2,"rows_kept":22,"cut":false,"hidden":false,"merged":[[0,0,0,3],[21,1,21,4]]}
["Ministerio de Educación y Cultura\nDirección de Educación"]
[]
[]
[]
["Gráfico I-3.1.3"]
[]
[]
[]
[]
[]
[]
[]
[]
[]
[]
[]
[]
[]
[]
[]
[]
["Fuente:","Elaboración propia con base en información proporcionada por el Área de Becas de la Dirección de Educación del MEC."]

{"sheet":"G I-3.1.4","index":115,"n_rows":24,"n_cols":2,"rows_kept":24,"cut":false,"hidden":false,"merged":[[0,0,0,3]]}
["Ministerio de Educación y Cultura\nDirección de Educación"]
[]
[]
[]
["Gráfico I-3.1.4"]
[]
[]
[]
[]
[]
[]
[]
[]
[]
[]
[]
[]
[]
[]
[]
[]
[]
[]
["Fuente:","Elaboración propia con base en información proporcionada por el  Fondo de Solidaridad."]

{"sheet":"G I-3.1.5","index":116,"n_rows":28,"n_cols":2,"rows_kept":28,"cut":false,"hidden":false,"merged":[[0,0,0,3]]}
["Ministerio de Educación y Cultura\nDirección de Educación"]
[]
[]
[]
["Gráfico I-3.1.5"]
[]
[]
[]
[]
[]
[]
[]
[]
[]
[]
[]
[]
[]
[]
[]
[]
[]
[]
[]
[]
[]
[]
["Fuente:","Elaboración propia con base en información proporcionada por el  Fondo de Solidaridad."]

{"sheet":"G I-3.1.6.","index":117,"n_rows":27,"n_cols":2,"rows_kept":27,"cut":false,"hidden":false,"merged":[[0,0,0,3]]}
["Ministerio de Educación y Cultura\nDirección de Educación"]
[]
[]
[]
["Gráfico I-3.1.6"]
[]
[]
[]
[]
[]
[]
[]
[]
[]
[]
[]
[]
[]
[]
[]
[]
[]
[]
[]
[]
[]
["Fuente:","Elaboración propia con base en información proporcionada por el  Fondo de Solidaridad."]

{"sheet":"G-I-3.1.7","index":118,"n_rows":29,"n_cols":2,"rows_kept":29,"cut":false,"hidden":false,"merged":[[0,0,0,3]]}
["Ministerio de Educación y Cultura\nDirección de Educación"]
[]
[]
[]
["Gráfico I-3.1.7"]
[]
[]
[]
[]
[]
[]
[]
[]
[]
[]
[]
[]
[]
[]
[]
[]
[]
[]
[]
[]
[]
[]
[]
["Fuente:","Plan Ceibal."]

{"sheet":"G-I.3.1.8","index":119,"n_rows":28,"n_cols":1,"rows_kept":28,"cut":false,"hidden":false,"merged":[[0,0,0,3]]}
["Ministerio de Educación y Cultura\nDirección de Educación"]
[]
[]
["Gráfico I-3.1.8"]
[]
[]
[]
[]
[]
[]
[]
[]
[]
[]
[]
[]
[]
[]
[]
[]
[]
[]
[]
[]
[]
[]
[]
["Fuentes:Elaboración propia en basa a la ENH 2006 a 2011 del INE."]

{"sheet":"G I-3.1.9","index":120,"n_rows":27,"n_cols":2,"rows_kept":27,"cut":false,"hidden":false,"merged":[[0,0,0,3]]}
["Ministerio de Educación y Cultura\nDirección de Educación"]
[]
[]
["Gráfico I-3.1.9"]
[]
[]
[]
[]
[]
[]
[]
[]
[]
[]
[]
[]
[]
[]
[]
[]
[]
[]
[]
[]
[]
[]
["Fuente:","Plan Ceibal."]

{"sheet":"G I.3.1.10","index":121,"n_rows":27,"n_cols":2,"rows_kept":27,"cut":false,"hidden":false,"merged":[[0,0,0,3]]}
["Ministerio de Educación y Cultura\nDirección de Educación"]
[]
[]
[]
["Gráfico I-3.1.10"]
[]
[]
[]
[]
[]
[]
[]
[]
[]
[]
[]
[]
[]
[]
[]
[]
[]
[]
[]
[]
[]
["Fuente:","Plan Ceibal"]

{"sheet":"G I-3.2.1","index":122,"n_rows":30,"n_cols":1,"rows_kept":30,"cut":false,"hidden":false,"merged":[[29,0,30,3],[0,0,0,3]]}
["Ministerio de Educación y Cultura\nDirección de Educación"]
[]
[]
[]
["Gráfico I-3.2.1"]
[]
[]
[]
[]
[]
[]
[]
[]
[]
[]
[]
[]
[]
[]
[]
[]
[]
[]
[]
[]
[]
[]
[]
[]
["Fuente: Banco Central del Uruguay (2005 – 2011)."]

{"sheet":"G I-3.2.2","index":123,"n_rows":34,"n_cols":1,"rows_kept":34,"cut":false,"hidden":false,"merged":[[0,0,0,3]]}
["Ministerio de Educación y Cultura\nDirección de Educación"]
[]
[]
[]
["Gráfico I-3.2.2"]
[]
[]
[]
[]
[]
[]
[]
[]
[]
[]
[]
[]
[]
[]
[]
[]
[]
[]
[]
[]
[]
[]
[]
[]
[]
[]
[]
["Nota: Los valores medios anuales fueron estimados por el Método del Ingreso de 2006 sobre los datos de las personas."]
["Fuente: Incidencia de la pobreza e indigencia, INE."]

{"sheet":"G I-3.3.1","index":124,"n_rows":31,"n_cols":1,"rows_kept":31,"cut":false,"hidden":false,"merged":[[0,0,0,3]]}
["Ministerio de Educación y Cultura\nDirección de Educación"]
[]
[]
[]
["Gráfico I-3.3.1"]
[]
[]
[]
[]
[]
[]
[]
[]
[]
[]
[]
[]
[]
[]
[]
[]
[]
[]
[]
[]
[]
[]
[]
[]
[]
["Fuente: Elaborado en base a datos del MEF en base a CGN.."]

{"sheet":"G I-3.3.2","index":125,"n_rows":31,"n_cols":1,"rows_kept":31,"cut":false,"hidden":false,"merged":[[0,0,0,3]]}
["Ministerio de Educación y Cultura\nDirección de Educación"]
[]
[]
[]
["Gráfico I-3.3.2"]
[]
[]
[]
[]
[]
[]
[]
[]
[]
[]
[]
[]
[]
[]
[]
[]
[]
[]
[]
[]
[]
[]
[]
[]
[]
["Fuente: Elaborado en base a datos del MEF en base a CGN."]

{"sheet":"G I-3.3.3","index":126,"n_rows":34,"n_cols":1,"rows_kept":34,"cut":false,"hidden":false,"merged":[[30,0,30,5],[31,0,31,5],[33,0,33,6],[0,0,0,3]]}
["Ministerio de Educación y Cultura\nDirección de Educación"]
[]
[]
[]
["Gráfico I-3.3.3"]
[]
[]
[]
[]
[]
[]
[]
[]
[]
[]
[]
[]
[]
[]
[]
[]
[]
[]
[]
[]
[]
[]
[]
[]
[]
["Fuente: Gerencia General de Programación y Presupuesto, Unidad de Programación y Control Presupuestal del CODICEN"]
["Nota: Datos al 1º de enero de cada año a valores constantes del 1º de enero de 1997. La información corresponde al salario nominal más la partida de alimentación"]
[]
["Fuente: Gerencia General de Programación y Presupuesto, Unidad de Programación y Control Presupuestal del CODICEN"]

{"sheet":"G I-4.1.1 ","index":127,"n_rows":36,"n_cols":1,"rows_kept":36,"cut":false,"hidden":false,"merged":[[31,0,31,6],[32,0,32,6],[33,0,33,6],[0,0,0,3]]}
["Ministerio de Educación y Cultura\nDirección de Educación"]
[]
[]
[]
["Gráfico I-4.1.1"]
[]
[]
[]
[]
[]
[]
[]
[]
[]
[]
[]
[]
[]
[]
[]
[]
[]
[]
[]
[]
[]
[]
[]
[]
[]
[]
[]
["Fuente: Indicadores Educativos del  Mercosur 20000-2008 y Unidades Productoras de Estadísticas Oficiales de los Países."]
["Nota: La Tasa de Analfabetismo se mide con base en personas con 15 y más años de edad, con excepción de Argentina, en que refiere a personas con 10 y más años de edad."]
[]
["Brasil y Chile no actualizaron la información para el 2010, por lo que se replica el último dato disponible: año 2009."]

{"sheet":"G I-4.1.2","index":128,"n_rows":29,"n_cols":2,"rows_kept":29,"cut":false,"hidden":false,"merged":[[0,0,0,3],[28,1,28,7]]}
["Ministerio de Educación y Cultura\nDirección de Educación"]
[]
[]
[]
["Gráfico I-4.1.2"]
[]
[]
[]
[]
[]
[]
[]
[]
[]
[]
[]
[]
[]
[]
[]
[]
[]
[]
[]
[]
[]
[]
["Fuente:","Datos UNESCO."]
["Nota:","Los porcentajes por región son promedios ponderados, teniendo en cuenta el tamaño poblacional relativo de los países. Los cálculos se realizaron con el último dato disponible de UNESCO (año 2000 en adelante). Para Uruguay es el dato 2011."]

{"sheet":"G I_4.1.3","index":129,"n_rows":29,"n_cols":2,"rows_kept":29,"cut":false,"hidden":false,"merged":[[0,0,0,3],[28,1,28,7]]}
["Ministerio de Educación y Cultura\nDirección de Educación"]
[]
[]
[]
["Gráfico I-4.1.3"]
[]
[]
[]
[]
[]
[]
[]
[]
[]
[]
[]
[]
[]
[]
[]
[]
[]
[]
[]
[]
[]
[]
[]
["Nota:","Los porcentajes por región son promedios ponderados, teniendo en cuenta el tamaño poblacional relativo de los países. Los cálculos se realizaron con el último dato disponible de UNESCO (año 2000 en adelante). Para Uruguay es el dato 2011."]

{"sheet":"G I 4.2.1","index":130,"n_rows":34,"n_cols":1,"rows_kept":34,"cut":false,"hidden":false,"merged":[[0,0,0,3]]}
["Ministerio de Educación y Cultura\nDirección de Educación"]
[]
[]
[]
["Gráfico I-4.2.1"]
[]
[]
[]
[]
[]
[]
[]
[]
[]
[]
[]
[]
[]
[]
[]
[]
[]
[]
[]
[]
[]
[]
[]
[]
[]
[]
[]
[]
["Fuente: Indicadores Educativos del Mercosur 2000 – 2009."]

{"sheet":"G I 4.2.2","index":131,"n_rows":33,"n_cols":1,"rows_kept":33,"cut":false,"hidden":false,"merged":[[0,0,0,3]]}
["Ministerio de Educación y Cultura\nDirección de Educación"]
[]
[]
[]
["Gráfico I-4.2.2"]
[]
[]
[]
[]
[]
[]
[]
[]
[]
[]
[]
[]
[]
[]
[]
[]
[]
[]
[]
[]
[]
[]
[]
[]
[]
[]
[]
["Fuente: Indicadores Educativos del Mercosur 2000 – 2009."]

{"sheet":"G I-4.2.3","index":132,"n_rows":33,"n_cols":1,"rows_kept":33,"cut":false,"hidden":false,"merged":[[0,0,0,3]]}
["Ministerio de Educación y Cultura\nDirección de Educación"]
[]
[]
[]
["Gráfico I-4.2.3"]
[]
[]
[]
[]
[]
[]
[]
[]
[]
[]
[]
[]
[]
[]
[]
[]
[]
[]
[]
[]
[]
[]
[]
[]
["Fuente: Indicadores Educativos del Mercosur 2000 - 2009."]
[]
[]
["Fuente: Indicadores Educativos del Mercosur 2000 – 2009"]

{"sheet":"G I-4.3.1","index":133,"n_rows":32,"n_cols":2,"rows_kept":32,"cut":false,"hidden":false,"merged":[[26,0,26,5],[28,1,30,10],[0,0,0,3]]}
["Ministerio de Educación y Cultura\nDirección de Educación"]
[]
[]
[]
["Gráfico I-4.3.1"]
[]
[]
[]
[]
[]
[]
[]
[]
[]
[]
[]
[]
[]
[]
[]
[]
[]
[]
[]
[]
[]
[]
[]
[null,"Instituto de Estadística de la Organización de las Naciones Unidas para la Educación, la Ciencia y la Cultura (UNESCO) y, para Uruguay, Área de Investigación y Estadística de la Dirección de Educación del MEC, en base a datos del MEF, en base a CGN."]
["Fuente:"]
[]
["Nota:","Último dato disponible posterior a 2000 y, para Uruguay, dato 2011."]

{"sheet":"G I-4.3.2","index":134,"n_rows":31,"n_cols":2,"rows_kept":31,"cut":false,"hidden":false,"merged":[[31,0,31,5],[30,1,30,12],[0,0,0,3],[29,1,29,9]]}
["Ministerio de Educación y Cultura\nDirección de Educación"]
[]
[]
[]
["Gráfico I-4.3.2"]
[]
[]
[]
[]
[]
[]
[]
[]
[]
[]
[]
[]
[]
[]
[]
[]
[]
[]
[]
[]
[]
[]
[]
[]
["Fuente:","Instituto de Estadística de la Organización de las Naciones Unidas para la Educación, la Ciencia y la Cultura (UNESCO) y, para Uruguay, Área de Investigación y Estadística de la Dirección de Educación del MEC, en base a datos del MEF, en base a CGN."]
["Nota:","Los porcentajes por región, son promedios ponderados. Los cálculos se realizaron con base en el año 2010 o el último dato disponible en la fuente (año 2005 en adelante)."]

{"sheet":"PRIMERA INFANCIA E INICIAL","index":135,"n_rows":0,"n_cols":0,"rows_kept":0,"cut":false,"hidden":false,"merged":[[19,0,19,4],[10,0,10,4],[12,0,12,4],[14,0,14,4],[15,0,15,4],[17,0,17,4],[33,0,33,4],[35,0,35,4],[21,0,21,4],[23,0,23,4],[25,0,25,4],[27,0,27,4],[29,0,29,4],[31,0,31,4]]}

{"sheet":" II-1.1.1","index":136,"n_rows":33,"n_cols":8,"rows_kept":33,"cut":false,"hidden":false,"merged":[[0,5,1,7],[4,0,4,7],[5,0,9,0],[5,1,9,1],[7,2,9,2],[5,2,5,7],[7,3,9,3],[7,7,9,7],[7,4,9,4],[7,5,9,5],[6,2,6,5],[7,6,9,6]]}
["CONSEJO DE EDUCACIÓN PRIMARIA",null,null,null,null,"ESTABLECIMIENTOS"]
[]
["Cuadro Nº II-1.1.1",null,null,null,null,null,null,"VOLVER"]
[]
["CANTIDAD DE ESTABLECIMIENTOS DE EDUCACIÓN INICIAL POR FORMA DE ADMINISTRACIÓN Y MODALIDAD SEGÚN DEPARTAMENTO. AÑO 2011."]
["DEPARTAMENTO","TOTAL","FORMA DE ADMINISTRACIÓN"]
[null,null,"PÚBLICA",null,null,null,null,"PRIVADA"]
[null,null,"Total","Jardines de Infantes","JICI","Guarderías","Jardines de Tiempo Completo","Jardines de Infantes"]
[]
[]
["TOTAL",{"$f":"+B12+B13","v":252},{"$f":"+C12+C13","v":189},{"$f":"SUM(D12:D13)","v":139},{"$f":"SUM(E12:E13)","v":14},{"$f":"SUM(F12:F13)","v":3},{"$f":"SUM(G12:G13)","v":33},{"$f":"SUM(H12:H13)","v":63}]
["MONTEVIDEO",{"$f":"+C12+H12","v":101},{"$f":"+D12+E12+F12+G12","v":62},44,3,2,13,39]
["RESTO DEL PAÍS",{"$f":"+C13+H13","v":151},{"$f":"+D13+E13+F13+G13","v":127},{"$f":"SUM(D15:D32)","v":95},{"$f":"SUM(E15:E32)","v":11},{"$f":"SUM(F15:F32)","v":1},{"$f":"SUM(G15:G32)","v":20},{"$f":"SUM(H15:H32)","v":24}]
[]
["Artigas",{"$f":"+C15+H15","v":3},{"$f":"+D15+E15+F15+G15","v":3},3,0,0,0,0]
["Canelones",41,{"$f":"+D16+E16+F16+G16","v":34},30,2,1,1,7]
["Cerro Largo",8,7,5,1,0,1,1]
["Colonia",6,6,5,1,0,0,0]
["Durazno",5,5,3,1,0,1,0]
["Flores",2,2,1,0,0,1,0]
["Florida",6,4,2,0,0,2,2]
["Lavalleja",7,7,4,1,0,2,0]
["Maldonado",10,7,7,0,0,0,3]
["Paysandú",5,4,1,1,0,2,1]
["Río Negro",6,6,3,1,0,2,0]
["Rivera",7,7,4,1,0,2,0]
["Rocha",8,7,7,0,0,0,1]
["Salto",9,4,4,0,0,0,5]
["San José",7,6,5,1,0,0,1]
["Soriano",6,5,4,0,0,1,1]
["Tacuarembó",{"$f":"+C31+H31","v":10},{"$f":"+D31+E31+F31+G31","v":9},6,0,0,3,1]
["Treinta y Tres",{"$f":"+C32+H32","v":5},{"$f":"+D32+E32+F32+G32","v":4},1,1,0,2,1]
["Fuente: Procesamiento propio en base a datos proporcionados por el D.E.E. — C.E.I.P."]

{"sheet":"II-1.1.2","index":137,"n_rows":35,"n_cols":5,"rows_kept":35,"cut":false,"hidden":false,"merged":[[1,0,1,2],[5,0,5,4],[7,2,9,2],[7,1,9,1],[6,2,6,4],[6,0,9,0],[0,4,1,5],[7,3,9,3],[7,4,9,4]]}
["MINISTERIO DE EDUCACIÓN Y CULTURA",null,null,null,"Establecimientos"]
["Dirección de Educación – Área de Educación en la Primera Infancia"]
[]
["Cuadro Nº  II-1.1.2"]
[]
["CANTIDAD DE ESTABLECIMIENTOS DE PRIMERA INFANCIA POR FORMA DE ADMINISTRACIÓN SEGÚN DEPARTAMENTO. AÑO 2011."]
["DEPARTAMENTO"]
[null,"TOTAL","CAIF","DIURNOS-INAU","PRIVADOS"]
[]
[]
["TOTAL",{"$f":"C11+D11+E11","v":851},{"$f":"C12+C13","v":333},{"$f":"D12+D13","v":40},478]
["MONTEVIDEO",347,76,9,262]
["RESTO DEL PAÍS",504,{"$f":"SUM(C15:C32)","v":257},{"$f":"SUM(D15:D32)","v":31},{"$f":"SUM(E15:E32)","v":216}]
[]
["Artigas",21,14,2,5]
["Canelones",133,46,2,85]
["Cerro Largo",25,19,2,4]
["Colonia",37,13,2,22]
["Durazno",19,14,3,2]
["Flores",9,5,1,3]
["Florida",18,9,2,7]
["Lavalleja",15,5,1,9]
["Maldonado",28,10,2,16]
["Paysandú",39,23,2,14]
["Río Negro",17,11,2,4]
["Rivera",22,14,1,7]
["Rocha",15,9,1,5]
["Salto",29,21,1,7]
["San José",23,9,2,12]
["Soriano",22,12,1,9]
["Tacuarembó",20,13,3,4]
["Treinta y Tres",12,10,1,1]
["Fuente: Procesamiento propio en base a datos proporcionados por:"]
["        Registro Nacional de Centros Educativos en la Primera Infancia. MEC"]
["        Para CAIF Y CENTROS DIURNOS: SIPI de INAU."]

{"sheet":"II-1.2.1","index":138,"n_rows":35,"n_cols":18,"rows_kept":35,"cut":false,"hidden":false,"merged":[[0,14,1,17],[7,14,7,15],[4,0,4,17],[7,13,9,13],[7,7,7,8],[8,5,8,6],[8,9,8,10],[5,0,8,0],[5,1,5,17],[8,16,8,17],[8,1,9,1],[8,2,8,3],[7,5,7,6],[7,16,7,17],[8,14,8,15],[8,7,8,8],[6,13,6,17],[7,4,9,4],[6,1,7,3],[8,11,8,12],[7,11,7,12],[7,9,7,10],[6,4,6,12]]}
["CONSEJO DE EDUCACIÓN PRIMARIA",null,null,null,null,null,null,null,null,null,null,null,null,null,"ALUMNOS MATRICULADOS"]
[]
["Cuadro Nº II-1.2.1"]
[]
["ALUMNOS MATRICULADOS EN EDUCACIÓN INICIAL POR FORMA DE ADMINISTRACIÓN, MODALIDAD Y SEXO SEGÚN DEPARTAMENTO AÑO 2011"]
["departamento","FORMA DE ADMINISTRACIÓN"]
[null,"TOTAL",null,null,"PÚBLICA",null,null,null,null,null,null,null,null,"PRIVADA"]
[null,null,null,null,"Total Público","Clases Jardineras",null,"Jardines de Infantes",null,"JICI",null,"Guarderías",null,"Total Privada","Jardines de Infantes",null,"Clases Jardineras"]
[null,"TOTAL","SEXO",null,null,"SEXO",null,"SEXO",null,"SEXO",null,"SEXO",null,null,"SEXO",null,"SEXO"]
[null,null,"M","F",null,"M","F","M","F","M","F","M","F",null,"M","F","M","F"]
["TOTAL",{"$f":"+B12+B13","v":108244.00000000001},{"$f":"+C12+C13","v":54980.000000000007},{"$f":"+D12+D13","v":53264},{"$f":"+E12+E13","v":79405},{"$f":"F12+F13","v":23986.999999999996},{"$f":"G12+G13","v":23138.000000000004},{"$f":"+H12+H13","v":14896},{"$f":"I12+I13","v":14598},{"$f":"J12+J13","v":1299},{"$f":"K12+K13","v":1243},{"$f":"+L12+L13","v":103},{"$f":"M12+M13","v":141},{"$f":"+N12+N13","v":28839.000000000004},{"$f":"+O12+O13","v":2936},{"$f":"+P12+P13","v":2817},{"$f":"+Q12+Q13","v":11759.000000000005},{"$f":"+R12+R13","v":11327}]
["MONTEVIDEO",{"$f":"+C12+D12","v":41202.000000000015},{"$f":"+F12+H12+J12+L12+O12+Q12","v":20997.000000000007},{"$f":"+G12+I12+K12+M12+P12+R12","v":20205.000000000004},{"$f":"+F12+G12+H12+I12+J12+K12+L12+M12","v":23693.000000000004},6077,5818.0000000000045,5422,5363,395,400,93,125,{"$f":"+O12+P12+Q12+R12","v":17509.000000000004},2048,1922,6962.0000000000055,6576.9999999999991]
["RESTO DEL PAÍS",{"$f":"SUM(B15:B32)","v":67042},{"$f":"SUM(C15:C32)","v":33983},{"$f":"SUM(D15:D32)","v":33059},{"$f":"SUM(E15:E32)","v":55712},17909.999999999996,17320,9474,9235,904,843,10,16,11330,{"$f":"SUM(O15:O32)","v":888},895,4797,4750]
[]
["Artigas",{"$f":"+C15+D15","v":2169.0000000000005},{"$f":"+F15+H15+J15+L15+O15+Q15","v":1138},{"$f":"+G15+I15+K15+M15+P15+R15","v":1031.0000000000005},{"$f":"+F15+G15+H15+I15+J15+K15+L15+M15","v":2074.0000000000005},945,885.00000000000034,136,108,null,null,0,0,{"$f":"+O15+P15+Q15+R15","v":95},0,0,57,38]
["Canelones",16733,8455.9999999999982,8277.0000000000018,12984,3501.9999999999991,3407.0000000000014,2932,2860,137,120,10,16,3749,309,303,1565.9999999999998,1570.9999999999998]
["Cerro Largo",2941,1474,1467,2666,804,790.99999999999989,432,426,98,115,0,0,275,39,37,101,98]
["Colonia",4135,2078,2056.9999999999995,3538.9999999999991,1263.9999999999998,1187.9999999999995,465,486,62,74,0,0,596,0,0,287,309]
["Durazno",1873,954,919,1647,481,485.99999999999994,301,281,57,41,0,0,226,0,0,115,111]
["Flores",821,402.00000000000006,418.99999999999994,648,212.00000000000006,194.99999999999994,120,121,0,0,0,0,173,0,0,70,103]
["Florida",1994,1052,942,1782,646.99999999999989,606,292,237,0,0,0,0,212,51,47,62,52]
["Lavalleja",2190,1110,1080,1848,421.99999999999989,423.00000000000006,459,433,53,58,0,0,342,0,0,176,166]
["Maldonado",5924,2969,2955,3877,1303.9999999999998,1238,622,713,0,0,0,0,2047.0000000000007,110,104,933.00000000000034,900.00000000000023]
["Paysandú",3931.0000000000005,1965,1966.0000000000005,3427.0000000000005,1248,1307.0000000000005,363,324,102,83,0,0,504,54,65,198,187]
["Río Negro",2256,1109,1147,1971,500.99999999999994,541,398,364,80,87,0,0,285,0,0,130,155]
["Rivera",4097,2086,2010.9999999999998,3647.9999999999995,1096.9999999999998,1033.9999999999998,669,658,93,97,0,0,449,0,0,227,222]
["Rocha",2401,1261,1140,2162,621,563,522,456,0,0,0,0,239,11,19,107,102]
["Salto",4784.0000000000009,2420.0000000000009,2364,3930.0000000000009,1572.0000000000007,1474.0000000000002,435,449,0,0,0,0,854,162,178,251,263]
["San José",3675,1905,1769.9999999999998,3225,1028,964.99999999999977,553,504,97,78,0,0,450,45,38,182,185]
["Soriano",2870.9999999999995,1470.9999999999995,1400,2606.9999999999995,986.99999999999943,943,335,342,0,0,0,0,264,22,20,127,95]
["Tacuarembó",3002.0000000000005,1488.0000000000005,1514,2516.0000000000005,798.00000000000057,805,440,473,0,0,0,0,486,42,43,208.00000000000003,193]
["Treinta y Tres",1245,645,600,1161,477.00000000000006,469.00000000000006,null,null,125,90,0,0,84,43,41,0,0]
["Fuente: Procesamiento propio en base a datos proporcionados por el D.E.E. — C.E.I.P."]
["Nota: Jardines de Infantes incluye Jardines de Tiempo Completo "]
["      Educación pública y privada no incluye educación Inicial Especial "]

{"sheet":"II-1.2.2","index":139,"n_rows":37,"n_cols":9,"rows_kept":37,"cut":false,"hidden":false,"merged":[[36,0,36,7],[0,8,2,9],[9,4,10,5],[9,6,10,7],[7,0,7,7],[8,0,12,0],[11,4,11,7],[8,4,8,7],[11,2,11,3],[9,1,10,3],[11,1,12,1]]}
["MINISTERIO DE EDUCACIÓN Y CULTURA",null,null,null,null,null,null,null,"Alumnos Matriculados "]
[]
["Dirección de Educación – Área de Educación en la Primera Infancia"]
["INAU-CAIF"]
[]
["Cuadro Nº II-1.2.2"]
[]
["ALUMNOS MATRICULADOS EN PRIMERA INFANCIA POR FORMA DE ADMINISTRACIÓN Y SEXO SEGÚN DEPARTAMENTO. AÑO 2011."]
["  DEPARTAMENTO",null,null,null,"FORMA DE ADMINISTRACIÓN"]
[null,"TOTAL",null,null,"CAIF Y CENTROS DIURNOS",null,"Centros Privados"]
[]
[null,"TOTAL","SEXO",null,"SEXO"]
[null,null,"M","F","M","F","M","F"]
["TOTAL",{"$f":"+B15+B16","v":47845},{"$f":"+E14+G14","v":24513},{"$f":"+F14+H14","v":23332},{"$f":"E15+E16","v":14179},{"$f":"F15+F16","v":13659},{"$f":"+G15+G16","v":10334},{"$f":"H15+H16","v":9673}]
["MONTEVIDEO",{"$f":"+C15+D15","v":19827},{"$f":"+E15+G15","v":10278},{"$f":"+F15+H15","v":9549},3785,3523,6493,6026]
["RESTO DEL PAÍS",{"$f":"SUM(B18:B35)","v":28018},14235,13783,{"$f":"SUM(E18:E35)","v":10394},{"$f":"SUM(F18:F35)","v":10136},3841,3647]
[]
["Artigas",{"$f":"+C18+D18","v":1303},{"$f":"+E18+G18","v":638},{"$f":"+F18+H18","v":665},559,593,79,72]
["Canelones",6222,3170,3052,1792,1717,1378,1335]
["Cerro Largo",1804,910,894,826,796,84,98]
["Colonia",1665,837,828,510,526,327,302]
["Durazno",1003,520,483,507,480,13,3]
["Flores",582,279,303,219,237,60,66]
["Florida",968,495,473,367,360,128,113]
["Lavalleja",641,322,319,195,207,127,112]
["Maldonado",1539,818,721,363,324,455,397]
["Paysandú",2315,1170,1145,961,929,209,216]
["Río Negro",1189,595,594,497,500,98,94]
["Rivera",1627,838,789,686,640,152,149]
["Rocha",913,465,448,414,388,51,60]
["Salto",2015,1022,993,783,752,239,241]
["San José",1155,615,540,387,354,228,186]
["Soriano",1082,545,537,401,393,144,144]
["Tacuarembó",1400,700,700,638,647,62,53]
["Treinta y Tres",595,296,299,289,293,7,6]
["Fuente: Procesamiento propio en base a datos proporcionados por:"]
["Nota: Los centros pertencientes al Proyecto  Nuestros Niños de la IMM, se encuentran incluidos en la matrícula de Centros Privados, por cuanto los mismos son supervisados por el MEC.  "]

{"sheet":"II-1.2.3 ","index":140,"n_rows":23,"n_cols":7,"rows_kept":23,"cut":false,"hidden":false,"merged":[[26,0,26,6],[27,0,27,6],[28,0,28,6],[24,0,24,7],[25,0,25,7],[0,8,1,9],[8,2,9,2],[8,6,9,6],[6,2,7,5],[0,6,1,7],[5,2,5,6],[1,0,1,5],[5,0,9,0],[7,1,9,1],[4,0,4,6],[8,3,9,3],[8,4,9,4],[8,5,9,5]]}
["MINISTERIO DE EDUCACIÓN Y CULTURA",null,null,null,null,null,"ALUMNOS MATRICULADOS"]
["Dirección de Educación – Área de Educación en la Primera Infancia"]
[]
["Cuadro Nº II-1.2.3"]
["ALUMNOS MATRICULADOS EN PRIMERA INFANCIA POR FORMA DE ADMINISTRACIÓN SEGÚN EDAD. AÑO 2011."]
["EDAD",null,"FORMA DE ADMINISTRACIÓN"]
[null,null,"Privados Subvencionados"]
[null,"TOTAL"]
[null,null,"CAIF  EXPERIENCIA OPORTUNA","DIURNO EXPERIENCIA OPORTUNA","CAIF INICAL","DIURNOS INICIAL","Privados"]
[]
[]
["TOTAL",{"$f":"SUM(C12:G12)","v":65244},{"$f":"C13+C14","v":17038},{"$f":"D13+D14","v":361},{"$f":"SUM(E15:E18)","v":26756},{"$f":"SUM(F15:F18)","v":1082},{"$f":"SUM(G13:G18)","v":20007}]
["0 a 11 meses",{"$f":"SUM(C13:G13)","v":6408},5623,77,null,null,708]
["1 año",{"$f":"SUM(C14:G14)","v":15061},11415,284,null,null,3362]
["2 años",{"$f":"SUM(E15:G15)","v":18411},null,null,12020,454,5937]
["3 años",{"$f":"SUM(E16:G16)","v":17338},null,null,11213,459,5666]
["4 años",{"$f":"SUM(E17:G17)","v":6262},null,null,3259,131,2872]
["5 años",{"$f":"SUM(E18:G18)","v":1764},null,null,264,38,1462]
[]
["Fuente: Procesamiento propio en base a datos proporcionados por:"]
["        Registro Nacional de Centros Educativos en la Primera Infancia. MEC"]
["        Para CAIF Y CENTROS DIURNOS: SIPI de INAU."]
["Programa Nuestros Niños: IMM. Se encuentran incluidos dentro de la matricula privada. "]

{"sheet":"II-1.2.4","index":141,"n_rows":33,"n_cols":4,"rows_kept":33,"cut":false,"hidden":false,"merged":[[33,6,33,7],[33,4,34,4],[33,5,34,5],[33,0,34,0],[33,1,34,1],[33,2,33,3],[0,2,1,3],[5,0,6,0],[31,0,31,3],[5,1,6,1],[4,0,4,3],[5,2,5,3]]}
["CONSEJO DE EDUCACIÓN PRIMARIA",null,"ALUMNOS MATRICULADOS"]
[]
["Cuadro Nº II-1.2.4"]
[]
["ALUMNOS MATRICULADOS EN EDUCACIÓN INICIAL PÚBLICA EN CLASE JARDINERA POR ÁREA DEMOGRÁFICA SEGÚN DEPARTAMENTO AÑO 2011"]
["DEPARTAMENTO","TOTAL","ÁREA DEMOGRÁFICA"]
[null,null,"URBANA","RURAL"]
["TOTAL ",{"$f":"SUM(C8+D8)","v":47125},{"$f":"SUM(C9:C10)","v":42766},{"$f":"SUM(D9:D10)","v":4359}]
["MONTEVIDEO",{"$f":"+C9+D9","v":11895},11895,0]
["RESTO DEL PAÍS",{"$f":"+C10+D10","v":35230},{"$f":"SUM(C12:C29)","v":30871},{"$f":"SUM(D12:D29)","v":4359}]
[]
["Artigas",1830,1631,199]
["Canelones",6909,6219,690]
["Cerro Largo",1595,1360,235]
["Colonia",2452,2141,311]
["Durazno",967,836,131]
["Flores",407,338,69]
["Florida",1253,1034,219]
["Lavalleja",845,730,115]
["Maldonado",2542,2354,188]
["Paysandú",2555,2300,255]
["Río Negro",1042,882,160]
["Rivera",2131,1844,287]
["Rocha",1184,1088,96]
["Salto",3046,2635,411]
["San José",1993,1630,363]
["Soriano",1930,1726,204]
["Tacuarembó",1603,1301,302]
["Treinta y Tres",946,822,124]
["Fuente: Procesamiento propio en base a datos proporcionados "]
["        por el D.E.E. — C.E.I.P."]
["Nota: No se presentan datos por Área Demográfica para las Modalidades Privadas, (Clases Jardineras y Jardines de Infantes en Colegios) porque no se registran establecimientos de dichas modalidades en áreas rurales."]
["        "]

{"sheet":"II-1.2.5","index":142,"n_rows":33,"n_cols":14,"rows_kept":33,"cut":false,"hidden":false,"merged":[[8,7,9,7],[8,11,9,11],[8,10,9,10],[8,9,9,9],[8,4,9,4],[7,9,7,13],[7,3,7,7],[8,6,9,6],[8,3,9,3],[0,11,1,13],[5,3,5,13],[4,0,4,13],[6,3,6,7],[6,9,6,13],[5,0,9,0],[8,8,9,8],[8,12,9,12],[8,13,9,13],[7,1,9,1],[8,2,9,2],[8,5,9,5]]}
["CONSEJO DE EDUCACIÓN PRIMARIA",null,null,null,null,null,null,null,null,null,null,"ALUMNOS MATRICULADOS"]
[]
["Cuadro Nº II-2.2.5"]
[]
["ALUMNOS MATRICULADOS EN EDUCACIÓN INICIAL PRIVADA POR MODALIDAD Y NIVEL SEGÚN DEPARTAMENTO AÑO 2011"]
["DEPARTAMENTO",null,null,"MODALIDAD"]
[null,null,null,"JARDINES DE INFANTES",null,null,null,null,null,"CLASES JARDINERAS"]
[null,"TOTAL",null,"NIVEL",null,null,null,null,null,"NIVEL"]
[null,null,"Total","Nursery","2 años","3 años","4 años","5 años","Total","Nursery","2 años","3 años","4 años","5 años"]
[]
["TOTAL",{"$f":"+B12+B13","v":28839},{"$f":"+C12+C13","v":5753},{"$f":"SUM(D12:D13)","v":713},{"$f":"SUM(E12:E13)","v":1470},{"$f":"SUM(F12:F13)","v":1488},{"$f":"SUM(G12:G13)","v":1231},{"$f":"SUM(H12:H13)","v":851},{"$f":"+I12+I13","v":23086},{"$f":"SUM(J12:J13)","v":1072},{"$f":"SUM(K12:K13)","v":3061.9999999999995},{"$f":"SUM(L12:L13)","v":4652.9999999999982},{"$f":"SUM(M12:M13)","v":6663.0000000000009},{"$f":"SUM(N12:N13)","v":7636}]
["MONTEVIDEO",{"$f":"+C12+I12","v":17509},{"$f":"SUM(D12:H12)","v":3970},567,1022,968,843,570,{"$f":"+J12+K12+L12+M12+N12","v":13539},640.99999999999989,1673.9999999999995,2574.9999999999986,3889.0000000000009,4760]
["RESTO DEL PAÍS",{"$f":"SUM(B15:B32)","v":11330},{"$f":"SUM(C15:C32)","v":1783},146,448,520,388,281,{"$f":"SUM(I15:I32)","v":9547},431,1388,2078,2774,2876]
[]
["Artigas",{"$f":"+C15+I15","v":95},{"$f":"SUM(D15:H15)","v":0},0,0,0,0,0,{"$f":"+J15+K15+L15+M15+N15","v":95},0,20,31,26,18]
["Canelones",3749,612,21,129,159,173,130,3137,133,414.99999999999994,661,927.00000000000023,1001]
["Cerro Largo",275,76,14,23,39,0,0,199,0,17,36,84,62]
["Colonia",596,0,0,0,0,0,0,596,79,108,126,146,137]
["Durazno",226,0,0,0,0,0,0,226,9,7,53,88,69]
["Flores",173,0,0,0,0,0,0,173,11,29,34,44,55]
["Florida",212,98,16,39,27,16,0,114,0,13,22,41,38]
["Lavalleja",342,0,0,0,0,0,0,342,18,66,78,85,95]
["Maldonado",2047,214,3,48,61,53,49,1833,68,272.00000000000006,459.99999999999994,510.00000000000006,523]
["Paysandú",504,119,14,20,29,32,24,385,1.0000000000000002,20,48,129,187]
["Río Negro",285,0,0,0,0,0,0,285,9,55,62,88,71]
["Rivera",449,0,0,0,0,0,0,449,28,76.999999999999986,107,118,119]
["Rocha",239,30,0,5,9,5,11,209,15,45,47,47,55]
["Salto",854,340,47,112,112,54,15,514,36,89,88.999999999999986,125,175]
["San José",450,83,16,19,27,13,8,367,12.999999999999998,71.000000000000014,75,107,101]
["Soriano",264,42,7,21,13,1,0,222,0,32,36,85,69]
["Tacuarembó",486,85,8,19,23,17,18,401,11,52.000000000000007,113.00000000000001,123.99999999999999,101]
["Treinta y Tres",84,84,0,13,21,24,26,0,0,0,0,0,0]
["Fuente: Procesamiento propio en base a datos proporcionados por el D.E.E. — C.E.I.P."]

{"sheet":"II-1.2.6","index":143,"n_rows":33,"n_cols":10,"rows_kept":33,"cut":false,"hidden":false,"merged":[[36,0,36,7],[0,9,1,10],[7,2,8,2],[7,1,8,1],[6,2,6,7],[7,3,8,3],[7,4,8,4],[7,5,8,5],[7,6,8,6],[7,7,8,7],[6,0,8,0],[10,9,11,11],[5,0,5,7]]}
["MINISTERIO DE EDUCACIÓN Y CULTURA",null,null,null,null,null,null,null,null,"ALUMNOS MATRICULADOS"]
["Dirección de Educación – Área de Educación en la Primera Infancia"]
[]
["Cuadro Nº II-1.2.6"]
[]
["ALUMNOS MATRICULADOS EN  PRIMERA INFANCIA POR EDAD SEGÚN DEPARTAMENTO. AÑO 2011."]
["DEPARTAMENTO",null,"E D A D"]
[null,"TOTAL","0 a 11 meses","1 año","2 años","3 años","4 años","5 años"]
[]
["TOTAL",{"$f":"+B11+B12","v":20007},708,3362,5937,5666,2872,1462]
["MONTEVIDEO",{"$f":"+C11+D11+E11+F11+G11+H11","v":12519},543,2078,3664,3415,1940,879]
["RESTO DEL PAÍS",{"$f":"SUM(B14:B31)","v":7488},165,1284,2273,2251,932,583]
[]
["Artigas",{"$f":"+C14+D14+E14+F14+G14+H14","v":151},1,27,40,48,16,19]
["Canelones",2713,59,364,791,853,411,235]
["Cerro Largo",182,0,15,42,55,39,31]
["Colonia",629,17,128,244,226,13,1]
["Durazno",16,0,1,3,10,2,0]
["Flores",126,6,15,39,27,19,20]
["Florida",241,0,80,83,47,29,2]
["Lavalleja",239,14,58,74,65,19,9]
["Maldonado",852,10,109,224,237,137,135]
["Paysandú",425,30,123,94,112,47,19]
["Río Negro",192,7,55,58,52,9,11]
["Rivera",301,6,72,102,73,35,13]
["Rocha",111,6,35,41,28,1,0]
["Salto",480,1,67,126,150,56,80]
["San José",414,4,69,161,146,31,3]
["Soriano",288,0,44,107,90,42,5]
["Tacuarembó",115,4,20,36,29,26,0]
["Treinta y Tres",13,0,2,8,3,0,0]
["Fuente: Procesamiento propio en base a datos proporcionados por:"]
["        Registro Nacional de Centros Educativos en la Primera Infancia. MEC"]

{"sheet":"II-1.3.1","index":144,"n_rows":33,"n_cols":4,"rows_kept":33,"cut":false,"hidden":false,"merged":[[5,0,6,0],[5,1,6,1],[30,0,30,1],[4,0,4,1],[0,3,1,4]]}
["CONSEJO DE EDUCACIÓN PRIMARIA",null,null,"PERSONAL DOCENTE"]
[]
["Cuadro Nº II-1.3.1"]
[]
["PERSONAL DOCENTE DE EDUCACIÓN INICIAL PÚBLICA SEGÚN DEPARTAMENTO. AÑO 2011."]
["DEPARTAMENTO","DOCENTES"]
[]
["TOTAL",{"$f":"SUM(B9:B10)","v":2946}]
["MONTEVIDEO",1015]
["RESTO DEL PAÍS",{"$f":"SUM(B12:B29)","v":1931}]
[]
["Artigas",83]
["Canelones",448]
["Cerro Largo",93]
["Colonia",104]
["Durazno",54]
["Flores",28]
["Florida",76]
["Lavalleja",66]
["Maldonado",155]
["Paysandú",99]
["Río Negro",67]
["Rivera",115]
["Rocha",77]
["Salto…",129]
["San José",94]
["Soriano",89]
["Tacuarembó",89]
["Treinta y Tres",65]
["Fuente: D.E.E. - C.E.P."]
["Nota: Listado de Cargos de la División Planeamiento Administrativo. Departamento de Cómputos. Julio de 2011. "]
["        "]
["        "]

{"sheet":"II-1.3.2","index":145,"n_rows":35,"n_cols":4,"rows_kept":35,"cut":false,"hidden":false,"merged":[[0,3,1,4],[5,2,6,3],[5,0,8,0],[32,0,32,3],[4,0,4,3],[7,2,8,2],[7,3,8,3],[7,1,8,1]]}
["CONSEJO DE EDUCACIÓN PRIMARIA",null,null,"PERSONAL DOCENTE"]
[]
["Cuadro Nº II-1.3..2."]
[]
["PERSONAL DOCENTE DE EDUCACIÓN INICIAL PRIVADA SEGÚN DEPARTAMENTO. AÑO 2011."]
["DEPARTAMENTO",null,"DOCENTES"]
[]
[null,"TOTAL","Colegios Habilitados","Colegios Autorizados"]
[]
["TOTAL",{"$f":"SUM(B11:B12)","v":1092},{"$f":"SUM(C11:C12)","v":1033},{"$f":"SUM(D11:D12)","v":59}]
["MONTEVIDEO",{"$f":"+C11+D11","v":611},561,50]
["RESTO DEL PAÍS",{"$f":"SUM(B14:B31)","v":481},{"$f":"SUM(C14:C31)","v":472},{"$f":"SUM(D14:D31)","v":9}]
[]
["Artigas",{"$f":"+C14+D14","v":4},4,0]
["Canelones",157,148,9]
["Cerro Largo",11,11,0]
["Colonia",18,18,0]
["Durazno",8,8,0]
["Flores",10,10,0]
["Florida",4,4,0]
["Lavalleja",16,16,0]
["Maldonado",100,100,0]
["Paysandú",25,25,0]
["Río Negro",22,22,0]
["Rivera",24,24,0]
["Rocha",15,15,0]
["Salto",26,26,0]
["San José",13,13,0]
["Soriano",13,13,0]
["Tacuarembó",15,15,0]
["Treinta y Tres",0,0,0]
["Fuente: D.E.E. — C.E.P.","C.E.I.P"]
[]
["        "]
["        "]

{"sheet":" PRIMARIA","index":146,"n_rows":0,"n_cols":0,"rows_kept":0,"cut":false,"hidden":false,"merged":[[20,0,20,4],[10,0,10,4],[12,0,12,4],[14,0,14,4],[16,0,16,4],[18,0,18,4],[34,0,34,4],[36,0,36,4],[22,0,22,4],[24,0,24,4],[26,0,26,4],[28,0,28,4],[30,0,30,4],[32,0,32,4]]}

{"sheet":"CONTROL ","index":147,"n_rows":17,"n_cols":11,"rows_kept":17,"cut":false,"hidden":true,"merged":[[0,0,0,5],[0,6,0,9]]}
["DENTRO DE PRIMARIA",null,null,null,null,null,"EN SINOPSIS"]
[null,"PRIMER CUADRO","SEGUNDO CUADRO","TERCER CUADRO",null,"Aclaración. ","PRIMER CUADRO","SEGUNDO CUADRO","TERCER CUADRO"]
["ESTABLEC.","II-2.1.1"," II-2.1.2 ",null,{"$f":"IF(SUM(' II-2.1.2 '!D11+' II-2.1.2 '!E11+' II-2.1.2 '!F11+' II-2.1.2 '!G11+' II-2.1.2 '!I11='II-2.1.1'!C10),\"OK\",\"INCONSISTENCIA\")","v":"OK"}]
["ESTABLEC.","II-2.1.1","II-2.1.5",null,{"$f":"IF('II-2.1.1'!E10='II-2.1.4'!C10,\"OK\",\"INCONSISTENCIA\")","v":"OK"}]
["ESTABLEC.","II-2.1.1","II-2.1.5",null,{"$f":"IF('II-2.1.1'!F10='II-2.1.4'!F10,\"OK\",\"INCONSISTENCIA\")","v":"OK"},{"$f":"IF(E5=\"INCONSISTENCIA\",\"Número de establecimiento de especial\",\"\")","v":""}]
["MATRÍCULA","II-2.2.1","II-2.2.2",null,{"$f":"IF('II-2.2.1'!E9='II-2.2.2'!E11,\"OK\",\"INCONSISTENCIA\")","v":"OK"},{"$f":"IF(E6=\"INCONSISTENCIA\",\"Matrícula de Primaria Pública\",\"\")","v":""},"I-1.2.12",null,null,{"$f":"IF(('II-2.2.1'!E9+'II-2.2.3'!H11)='I-1.2.12'!M20,\"OK\",\"INCONSISTENCIA\")","v":"OK"},{"$f":"IF(J6=\"INCONSISTENCIA\",\"Matrícula de Primaria Pública\",\"\")","v":""}]
["MATRÍCULA","II-2.2.2","II-2.2.3",null,{"$f":"IF('II-2.2.2'!E11=SUM('II-2.2.3'!B11-'II-2.2.3'!H11),\"OK\",\"INCONSISTENCIA\")","v":"OK"},null,null,null,null,{"$f":"IF(('II-2.2.1'!E19+'II-2.2.3'!H11)='I-1.2.13'!F8,\"OK\",\"INCONSISTENCIA\")","v":"INCONSISTENCIA"}]
["MATRÍCULA","II-2.2.2","II-2.2.6",null,{"$f":"IF('II-2.2.2'!E11='II-2.2.6'!B12,\"OK\",\"INCONSISTENCIA\")","v":"OK"}]
["MATRÍCULA","II-2.2.1","II-2.2.5",null,{"$f":"IF('II-2.2.1'!H9='II-2.2.5'!C10,\"OK\",\"INCONSISTENCIA\")","v":"OK"}]
["MATRÍCULA","II-2.2.2","II-2.2.6",null,{"$f":"IF('II-2.2.2'!E11='II-2.2.6'!B12,\"OK\",\"INCONSISTENCIA\")","v":"OK"}]
["MATRÍCULA","II-2.2.1","II-2.2.6",null,{"$f":"IF('II-2.2.1'!H9='II-2.2.6'!C12,\"OK\",\"INCONSISTENCIA\")","v":"OK"}]
["MATRÍCULA","II-2.2.2","II-2.2.7",null,{"$f":"IF('II-2.2.2'!E11='II-2.2.7'!B10,\"OK\",\"INCONSISTENCIA\")","v":"OK"}]
["MATRÍCULA","II-2.2.1","II-2.2.6",null,{"$f":"IF('II-2.2.1'!H9='II-2.2.8'!B9,\"OK\",\"INCONSISTENCIA\")","v":"OK"}]
["MATRÍCULA","II-2.2.2","II-2.2.9",null,{"$f":"IF('II-2.2.2'!E11='II-2.2.9'!B11,\"OK\",\"INCONSISTENCIA\")","v":"OK"}]
["MATRÍCULA","II-2.2.1","II-2.2.9",null,{"$f":"IF('II-2.2.1'!H9='II-2.2.9'!C11,\"OK\",\"INCONSISTENCIA\")","v":"OK"}]
["MATRÍCULA","II-2.2.10","II-2.2.11",null,{"$f":"IF('II-2.2.10'!B11='II-2.2.11'!B11,\"OK\",\"INCONSISTENCIA\")","v":"OK"}]
["MATRÍCULA","II-2.2.10","II-2.2.12",null,{"$f":"IF('II-2.2.10'!B11='II-2.2.12 '!B10,\"OK\",\"INCONSISTENCIA\")","v":"OK"}]

{"sheet":"II-2.1.1","index":148,"n_rows":31,"n_cols":6,"rows_kept":31,"cut":false,"hidden":false,"merged":[[7,4,8,4],[7,5,8,5],[30,0,30,7],[0,4,1,6],[3,0,3,5],[4,0,8,0],[4,2,4,5],[5,1,8,1],[5,2,5,5],[6,2,6,3],[6,4,6,5],[7,2,8,2],[7,3,8,3]]}
["CONSEJO DE EDUCACIÓN PRIMARIA",null,null,null,"ESTABLECIMIENTOS"]
[]
["Cuadro Nº II-2.1.1"]
["ESTABLECIMIENTOS DE EDUCACIÓN PRIMARIA POR FORMA DE ADMINISTRACIÓN Y TIPO DE EDUCACIÓN SEGÚN DEPARTAMENTO. AÑO 2011."]
["DEPARTAMENTO",null,"FORMA DE ADMINISTRACIÓN"]
[null,"TOTAL","TIPO DE EDUCACIÓN"]
[null,null,"PÚBLICA",null,"PRIVADA"]
[null,null,"Común","Especial","Común","Especial"]
[]
["TOTAL",{"$f":"+C10+D10+E10+F10","v":2541},{"$f":"SUM(C11:C12)","v":2060},{"$f":"SUM(D11:D12)","v":78},338,{"$f":"SUM(F11:F12)","v":65}]
["MONTEVIDEO",{"$f":"+C11+D11+E11+F11","v":485},249,25,168,43]
["RESTO DEL PAÍS.",2056,{"$f":"SUM(C13:C30)","v":1811},{"$f":"SUM(D13:D30)","v":53},{"$f":"SUM(E13:E30)","v":170},{"$f":"SUM(F13:F30)","v":22}]
["Artigas",80,75,2,1,2]
["Canelones",303,230,10,61,2]
["Cerro Largo.",127,118,3,6,0]
["Colonia",138,126,4,8,0]
["Durazno",86,80,2,4,0]
["Flores.",40,36,1,3,0]
["Florida",107,100,2,4,1]
["Lavalleja",99,91,2,6,0]
["Maldonado",110,78,4,25,3]
["Paysandú.",118,104,2,8,4]
["Río Negro.",71,62,2,6,1]
["Rivera",136,124,4,8,0]
["Rocha.",80,71,3,4,2]
["Salto",116,102,3,8,3]
["San José",115,105,3,7,0]
["Soriano",110,100,3,3,4]
["Tacuarembó.",143,135,2,6,0]
["Treinta y Tres.",77,74,1,2,0]
["Fuente: Procesamiento propio en base a datos proporcionados por el D.E.E. — C.E.I.P."]

{"sheet":" II-2.1.2 ","index":149,"n_rows":32,"n_cols":11,"rows_kept":32,"cut":false,"hidden":false,"merged":[[8,5,9,5],[8,7,9,7],[8,9,9,9],[8,10,9,10],[0,9,1,10],[4,0,4,10],[5,0,9,0],[5,1,9,1],[5,2,5,10],[6,3,6,7],[6,9,6,10],[7,2,9,2],[7,3,7,7],[7,8,9,8],[7,9,7,10],[8,3,9,3],[8,4,9,4]]}
["CONSEJO DE EDUCACIÓN PRIMARIA",null,null,null,null,null,null,null,null,"ESTABLECIMIENTOS"]
[]
["Cuadro Nº II-2.1.2"]
[]
["ESTABLECIMIENTOS DE EDUCACIÓN PRIMARIA PÚBLICA COMÚN POR ÁREA DEMOGRÁFICA Y CATEGORÍA SEGÚN DEPARTAMENTO AÑO 2011"]
["DEPARTAMENTO","TOTAL","ÁREA DEMOGRÁFICA"]
[null,null,null,"URBANA",null,null,null,null,null,"RURAL"]
[null,null,"Total Urbana","CATEGORÍA",null,null,null,null,"Total Rural","CATEGORÍA"]
[null,null,null,"Común","De Práctica","Tiempo Completo",null,"JICI",null,"Común","Internado Rural"]
[null,null,null,null,null,null,"Aprender"]
["TOTAL",{"$f":"+C11+I11","v":2074},{"$f":"+D11+E11+F11+G11+H11","v":943},{"$f":"SUM(D12:D13)","v":384},{"$f":"SUM(E12:E13)","v":117},157,271,14,{"$f":"SUM(I12:I13)","v":1131},1125,6]
["MONTEVIDEO",{"$f":"+C12+I12","v":252},{"$f":"+D12+E12+F12+G12+H12","v":252},101,22,38,88,3,0,0,0]
["RESTO DEL PAÍS",1822,691,{"$f":"SUM(D14:D31)","v":283},95,119,183,11,{"$f":"SUM(I14:I31)","v":1131},1125,6]
["Artigas",75,29,7,4,7,11,0,{"$f":"+J14+K14","v":46},45,1]
["Canelones",232,135,49,16,20,48,2,{"$f":"+J15+K15","v":97},97,0]
["Cerro Largo",119,30,8,5,5,11,1,89,89,0]
["Colonia",127,44,24,6,5,8,1,83,83,0]
["Durazno",81,25,10,4,5,5,1,56,56,0]
["Flores",36,10,4,2,2,2,0,26,25,1]
["Florida",100,31,17,5,6,3,0,69,69,0]
["Lavalleja",92,26,11,4,6,4,1,66,66,0]
["Maldonado",78,40,21,4,10,5,0,38,37,1]
["Paysandú",105,48,19,7,7,14,1,57,55,2]
["Río Negro",63,23,12,4,4,2,1,40,39,1]
["Rivera",125,40,12,5,5,17,1,85,85,0]
["Rocha",71,32,15,4,7,6,0,39,39,0]
["Salto",102,40,12,5,11,12,0,62,62,0]
["San José",106,37,20,6,5,5,1,69,69,0]
["Soriano",100,36,19,4,5,8,0,64,64,0]
["Tacuarembó",135,42,14,5,6,17,0,93,93,0]
["Treinta y Tres",75,23,9,5,3,5,1,52,52,0]
["Fuente: Procesamiento propio en base a datos proporcionados por el DEE — CEIP",null,null,null,null,"D.E.E.-C.E.I.P."]

{"sheet":"II-2.1.3","index":150,"n_rows":36,"n_cols":5,"rows_kept":36,"cut":false,"hidden":false,"merged":[[31,0,31,4],[0,3,1,4],[4,0,4,4],[5,0,7,0],[5,1,7,1],[5,2,5,4],[6,2,7,2],[6,3,7,3],[6,4,7,4]]}
["CONSEJO DE EDUCACIÓN PRIMARIA",null,null,"Establecimientos"]
[]
["Cuadro Nº II-2.1.3"]
[]
["ESTABLECIMIENTOS DE EDUCACIÓN PRIMARIA PÚBLICA ESPECIAL POR TIPO DE DISCAPACIDAD SEGÚN DEPARTAMENTO AÑO 2011"]
["DEPARTAMENTO","TOTAL","DISCAPACIDAD"]
[null,null,"Intelectual","Auditiva","Visual"]
[]
["TOTAL",{"$f":"+B10+B11","v":82},{"$f":"SUM(C10:C11)","v":74},{"$f":"SUM(D10:D11)","v":4},{"$f":"SUM(E10:E11)","v":4}]
["MONTEVIDEO",{"$f":"+C10+D10+E10","v":27},22,1,4]
["RESTO DEL PAÍS",{"$f":"SUM(B13:B30)","v":55},{"$f":"SUM(C13:C30)","v":52},{"$f":"SUM(D13:D30)","v":3},{"$f":"SUM(E13:E30)","v":0}]
[]
["Artigas",{"$f":"+C13+D13+E13","v":2},2,0,0]
["Canelones",10,10,0,0]
["Cerro Largo",3,3,0,0]
["Colonia",4,4,0,0]
["Durazno",2,2,0,0]
["Flores",1,1,0,0]
["Florida",2,2,0,0]
["Lavalleja",2,2,0,0]
["Maldonado",4,3,1,0]
["Paysandú",2,2,0,0]
["Río Negro",2,2,0,0]
["Rivera",4,3,1,0]
["Rocha",3,3,0,0]
["Salto",3,2,1,0]
["San José",5,5,0,0]
["Soriano",3,3,0,0]
["Tacuarembó",2,2,0,0]
["Treinta y Tres",1,1,0,0]
["Fuente: DEE — CEIP"]
["Nota: Los establecimientos que atienden discapacidades intelectuales, además de atender niños con disfunciones clásicamente tipificadas como “Intelectuales”, atienden a los niños con discapacidades de orden motriz o de carácter, lo que implica que la matrícula correspondiente los agrupa"]
["        "]
["        "]
["       "]
["        "]

{"sheet":"II-2.1.4","index":151,"n_rows":31,"n_cols":6,"rows_kept":31,"cut":false,"hidden":false,"merged":[[6,8,6,15],[7,3,8,3],[7,4,8,4],[7,8,7,15],[11,8,12,9],[11,10,12,10],[11,11,11,13],[0,4,1,5],[4,0,4,5],[5,0,8,0],[5,1,8,1],[5,3,5,5],[6,2,8,2],[6,3,6,4],[6,5,8,5]]}
["CONSEJO DE EDUCACIÓN PRIMARIA",null,null,null,"ESTABLECIMIENTOS"]
[]
["Cuadro Nº II-2.1.4"]
[]
["ESTABLECIMIENTOS DE EDUCACIÓN PRIMARIA PRIVADA POR TIPO DE EDUCACIÓN SEGÚN DEPARTAMENTO AÑO 2011"]
["DEPARTAMENTO","TOTAL",null,"TIPO DE EDUCACIÓN"]
[null,null,"Total","EDUCACIÓN COMÚN",null,"EDUCACIÓN ESPECIAL"]
[null,null,null,"Habilitados","Autorizados"]
[]
["TOTAL DEL PAÍS",{"$f":"+C10+F10","v":403},{"$f":"+D10+E10","v":338},{"$f":"SUM(D11:D12)","v":320},{"$f":"SUM(E11:E12)","v":18},{"$f":"SUM(F11:F12)","v":65}]
["MONTEVIDEO",{"$f":"+C11+F11","v":212},{"$f":"+D11+E11","v":169},158,11,43]
["RESTO DEL PAÍS",191,169,{"$f":"SUM(D13:D30)","v":162},{"$f":"SUM(E13:E30)","v":7},{"$f":"SUM(F13:F30)","v":22}]
["Artigas",3,1,1,0,2]
["Canelones",63,61,57,4,2]
["Cerro Largo",6,6,6,0,0]
["Colonia",8,8,8,0,0]
["Durazno",3,3,3,0,0]
["Flores",3,3,3,0,0]
["Florida",5,4,4,0,1]
["Lavalleja",6,6,6,0,0]
["Maldonado",28,25,25,0,3]
["Paysandú",12,8,8,0,4]
["Río Negro",7,6,4,2,1]
["Rivera",8,8,8,0,0]
["Rocha",6,4,4,0,2]
["Salto",11,8,8,0,3]
["San José",7,7,6,1,0]
["Soriano",7,3,3,0,4]
["Tacuarembó",6,6,6,0,0]
["Treinta y Tres",2,2,2,0,0]
["Fuente: Procesamiento propio en base a datos proporcionados por el D.E.E. — C.E.I.P."]

{"sheet":"II-2.2.1","index":152,"n_rows":31,"n_cols":10,"rows_kept":31,"cut":false,"hidden":false,"merged":[[6,7,7,7],[6,8,6,9],[30,0,30,9],[0,7,1,9],[3,0,3,9],[4,0,7,0],[4,1,7,1],[4,2,4,9],[5,2,6,3],[5,4,5,6],[5,7,5,9],[6,4,7,4],[6,5,6,6]]}
["CONSEJO DE EDUCACIÓN PRIMARIA",null,null,null,null,null,null,"ALUMNOS MATRICULADOS"]
[]
["Cuadro Nº II-2.2.1"]
["ALUMNOS MATRICULADOS EN EDUCACIÓN PRIMARIA COMÚN POR FORMA DE ADMINISTRACIÓN Y SEXO SEGÚN DEPARTAMENTO AÑO 2011"]
["DEPARTAMENTO","TOTAL","FORMA DE ADMINISTRACIÓN"]
[null,null,"TOTAL",null,"PÚBLICA",null,null,"PRIVADA"]
[null,null,null,null,"TOTAL","SEXO",null,"TOTAL","SEXO"]
[null,null,"M","F",null,"M","F",null,"M","F"]
["TOTAL",{"$f":"E9+H9","v":324726},{"$f":"+F9+I9","v":167236},{"$f":"+G9+J9","v":157490},272657,140970,131687,{"$f":"+I9+J9","v":52069},{"$f":"SUM(I10:I11)","v":26266},{"$f":"SUM(J10:J11)","v":25803}]
["MONTEVIDEO",{"$f":"E10+H10","v":115074},{"$f":"+F10+I10","v":58924.000000000007},56149.999999999993,82886,42703.000000000007,40182.999999999993,{"$f":"+I10+J10","v":32188},16221,15967]
["RESTO DEL PAÍS",209652,108312,101340,189771,98267,91504,19881,{"$f":"SUM(I12:I29)","v":10045},{"$f":"SUM(J12:J29)","v":9836}]
["Artigas",8901,4612,4289,8809,4567,4242,92,45,47]
["Canelones",52128.999999999993,26991,25137.999999999993,45115.999999999993,23420,21695.999999999993,7013,3571,3442]
["Cerro Largo",9827.9999999999964,5042.9999999999973,4784.9999999999982,9212.9999999999964,4730.9999999999973,4481.9999999999982,615,312,303]
["Colonia",11316.999999999996,5804.9999999999945,5512.0000000000018,10592.999999999996,5459.9999999999945,5133.0000000000018,724,345,379]
["Durazno",6420.0000000000009,3302.0000000000018,3117.9999999999991,5786.0000000000009,3010.0000000000018,2775.9999999999991,634,292,342]
["Flores",2594,1281,1312.9999999999998,2233,1092,1140.9999999999998,361,189,172]
["Florida",6684.0000000000009,3428.0000000000009,3256,6388.0000000000009,3282.0000000000009,3106,296,146,150]
["Lavalleja",5685.9999999999991,2929.9999999999995,2755.9999999999995,5070.9999999999991,2627.9999999999995,2442.9999999999995,615,302,313]
["Maldonado",17549.000000000004,9046.0000000000018,8503,13670.000000000004,7065.0000000000018,6605.0000000000009,3879,1981,1898]
["Paysandú",13188,6885,6303,12013,6296,5717,1175,589,586]
["Río Negro",6282,3277,3005.0000000000005,5821,3042,2779.0000000000005,461,235,226]
["Rivera",11968.000000000004,6269,5699.0000000000045,11295.000000000004,5909,5386.0000000000045,673,360,313]
["Rocha",7254.0000000000018,3761,3493.0000000000014,6841.0000000000018,3545,3296.0000000000014,413,216,197]
["Salto",14745.000000000002,7653.0000000000018,7092,13656.000000000002,7109.0000000000018,6547,1089,544,545]
["San José",10564.999999999998,5458.9999999999991,5105.9999999999991,9988.9999999999982,5176.9999999999991,4811.9999999999991,576,282,294]
["Soriano",9030,4604.9999999999991,4425,8595,4393.9999999999991,4201,435,211,224]
["Tacuarembó",10370.999999999998,5321.9999999999991,5048.9999999999991,9727.9999999999982,5003.9999999999991,4723.9999999999991,643,318,325]
["Treinta y Tres",5140.9999999999991,2642.9999999999991,2498,4953.9999999999991,2535.9999999999991,2418,187,107,80]
["Fuente: Procesamiento propio en base a datos proporcionados por el DEE — CEIP"]
["Nota: No incluye JICI"]

{"sheet":"II-2.2.2","index":153,"n_rows":32,"n_cols":149,"rows_kept":32,"cut":false,"hidden":false,"merged":[[9,145,9,146],[9,147,9,148],[32,0,32,9],[34,0,34,9],[8,5,8,6],[8,8,8,9],[8,10,8,11],[9,139,9,140],[9,141,9,142],[9,143,9,144],[0,7,1,9],[4,0,4,9],[5,0,9,0],[5,1,9,1],[5,2,8,3],[5,4,5,11],[6,5,7,6],[6,8,6,11],[7,8,7,9],[7,10,7,11]]}
["CONSEJO DE EDUCACIÓN PRIMARIA",null,null,null,null,null,null,"ALUMNOS MATRICULADOS"]
[]
["Cuadro Nº II-2.2.2"]
[]
["ALUMNOS MATRICULADOS EN EDUCACIÓN PRIMARIA PÚBLICA POR TIPO DE EDUCACIÓN Y SEXO SEGÚN DEPARTAMENTO. AÑO 2011."]
["DEPARTAMENTO","TOTAL","TOTAL SEXO",null,"TIPO DE EDUCACIÓN "]
[null,null,null,null,null,"COMÚN ",null,null,"ESPECIAL "]
[null,null,null,null,null,null,null,null,"ESCUELAS ESPECIALES",null,"CLASES ESPECIALES"]
[null,null,null,null,null,"SEXO",null,null,"SEXO",null,"SEXO"]
[null,null,"M","F","Total","M","F","Total","M","F","M","F",null,null,null,null,null,null,null,null,null,null,null,null,null,null,null,null,null,null,null,null,null,null,null,null,null,null,null,null,null,null,null,null,null,null,null,null,null,null,null,null,null,null,null,null,null,null,null,null,null,null,null,null,null,null,null,null,null,null,null,null,null,null,null,null,null,null,null,null,null,null,null,null,null,null,null,null,null,null,null,null,null,null,null,null,null,null,null,null,null,null,null,null,null,null,null,null,null,null,null,null,null,null,null,null,null,null,null,null,null,null,null,null,null,null,null,null,null,null,null,null,null,null,null,null,null,null,null,"COMPARABLE CON ANTERIOR",null,"BASE DE ESPECIAL 1 a 6",null,"Clases Especiales ",null,"TOTAL 1a6 esc y clases",null,"TOTAL inic; 1a6 esc y clases"]
["TOTAL",{"$f":"+C11+D11","v":279943},{"$f":"+F11+I11+K11","v":145464},{"$f":"+G11+J11+L11","v":134479},{"$f":"+F11+G11","v":272657},140970,{"$f":"SUM(G12:G13)","v":131687},{"$f":"+I11+J11+K11+L11","v":7286},{"$f":"SUM(I12:I13)","v":4366},{"$f":"SUM(J12:J13)","v":2727},128.00000000000003,65.000000000000014,null,null,null,null,null,null,null,null,null,null,null,null,null,null,null,null,null,null,null,null,null,null,null,null,null,null,null,null,null,null,null,null,null,null,null,null,null,null,null,null,null,null,null,null,null,null,null,null,null,null,null,null,null,null,null,null,null,null,null,null,null,null,null,null,null,null,null,null,null,null,null,null,null,null,null,null,null,null,null,null,null,null,null,null,null,null,null,null,null,null,null,null,null,null,null,null,null,null,null,null,null,null,null,null,null,null,null,null,null,null,null,null,null,null,null,null,null,null,null,null,null,null,null,null,null,null,"Montveo",1825,1155,1169,729,0,0,{"$f":"EL11+EN11","v":1169},{"$f":"EM11+EO11","v":729},{"$f":"EJ11+EN11","v":1825},{"$f":"EK11+EO11","v":1155}]
["MONTEVIDEO",{"$f":"+C12+D12","v":85771},{"$f":"+F12+I12+K12","v":44490.000000000007},41280.999999999993,{"$f":"+F12+G12","v":82886},42703.000000000007,40182.999999999993,{"$f":"+I12+J12+K12+L12","v":2885},1787,1098,0,0]
["RESTO DEL PAÍS",194172,100974,93198,{"$f":"+F13+G13","v":189771},{"$f":"SUM(F14:F31)","v":98267},{"$f":"SUM(G14:G31)","v":91504},{"$f":"SUM(H14:H31)","v":4401},{"$f":"SUM(I14:I31)","v":2579},{"$f":"SUM(J14:J31)","v":1629},128.00000000000003,65.000000000000014]
["Artigas",9009,4688,4321,{"$f":"+F14+G14","v":8809},4567,4242,200,112,75,9.0000000000000036,4.0000000000000027,null,null,null,null,null,null,null,null,null,null,null,null,null,null,null,null,null,null,null,null,null,null,null,null,null,null,null,null,null,null,null,null,null,null,null,null,null,null,null,null,null,null,null,null,null,null,null,null,null,null,null,null,null,null,null,null,null,null,null,null,null,null,null,null,null,null,null,null,null,null,null,null,null,null,null,null,null,null,null,null,null,null,null,null,null,null,null,null,null,null,null,null,null,null,null,null,null,null,null,null,null,null,null,null,null,null,null,null,null,null,null,null,null,null,null,null,null,null,null,null,null,null,null,null,null,null,null,119,87,81,52,11,4,{"$f":"EL14+EN14","v":92},{"$f":"EM14+EO14","v":56},{"$f":"EJ14+EN14","v":130},{"$f":"EK14+EO14","v":91}]
["Canelones",45874.999999999993,23895,21979.999999999993,45115.999999999993,23420,21695.999999999993,759,446,272,29.000000000000011,12.000000000000004,null,null,null,null,null,null,null,null,null,null,null,null,null,null,null,null,null,null,null,null,null,null,null,null,null,null,null,null,null,null,null,null,null,null,null,null,null,null,null,null,null,null,null,null,null,null,null,null,null,null,null,null,null,null,null,null,null,null,null,null,null,null,null,null,null,null,null,null,null,null,null,null,null,null,null,null,null,null,null,null,null,null,null,null,null,null,null,null,null,null,null,null,null,null,null,null,null,null,null,null,null,null,null,null,null,null,null,null,null,null,null,null,null,null,null,null,null,null,null,null,null,null,null,null,null,null,null,449,275,377,206,35,14,{"$f":"EL15+EN15","v":412},220,{"$f":"EJ15+EN15","v":484},289]
["Cerro Largo",9474.9999999999964,4902.9999999999973,4571.9999999999982,9212.9999999999964,4730.9999999999973,4481.9999999999982,262,156,84,15.999999999999998,6.0000000000000027,null,null,null,null,null,null,null,null,null,null,null,null,null,null,null,null,null,null,null,null,null,null,null,null,null,null,null,null,null,null,null,null,null,null,null,null,null,null,null,null,null,null,null,null,null,null,null,null,null,null,null,null,null,null,null,null,null,null,null,null,null,null,null,null,null,null,null,null,null,null,null,null,null,null,null,null,null,null,null,null,null,null,null,null,null,null,null,null,null,null,null,null,null,null,null,null,null,null,null,null,null,null,null,null,null,null,null,null,null,null,null,null,null,null,null,null,null,null,null,null,null,null,null,null,null,null,null,149,91,120,78,9,5,129,83,158,96]
["Colonia",10847.999999999996,5623.9999999999945,5224.0000000000018,10592.999999999996,5459.9999999999945,5133.0000000000018,255,156,87,8.0000000000000089,4.0000000000000044,null,null,null,null,null,null,null,null,null,null,null,null,null,null,null,null,null,null,null,null,null,null,null,null,null,null,null,null,null,null,null,null,null,null,null,null,null,null,null,null,null,null,null,null,null,null,null,null,null,null,null,null,null,null,null,null,null,null,null,null,null,null,null,null,null,null,null,null,null,null,null,null,null,null,null,null,null,null,null,null,null,null,null,null,null,null,null,null,null,null,null,null,null,null,null,null,null,null,null,null,null,null,null,null,null,null,null,null,null,null,null,null,null,null,null,null,null,null,null,null,null,null,null,null,null,null,null,155,90,104,67,10,2,114,69,165,92]
["Durazno",6015.0000000000009,3149.0000000000018,2865.9999999999991,5786.0000000000009,3010.0000000000018,2775.9999999999991,229,125,82,14.000000000000005,8.0000000000000018,null,null,null,null,null,null,null,null,null,null,null,null,null,null,null,null,null,null,null,null,null,null,null,null,null,null,null,null,null,null,null,null,null,null,null,null,null,null,null,null,null,null,null,null,null,null,null,null,null,null,null,null,null,null,null,null,null,null,null,null,null,null,null,null,null,null,null,null,null,null,null,null,null,null,null,null,null,null,null,null,null,null,null,null,null,null,null,null,null,null,null,null,null,null,null,null,null,null,null,null,null,null,null,null,null,null,null,null,null,null,null,null,null,null,null,null,null,null,null,null,null,null,null,null,null,null,null,118,82,77,53,16,10,93,63,134,92]
["Flores",2281,1121,1159.9999999999998,2233,1092,1140.9999999999998,48,29,19,0,0,null,null,null,null,null,null,null,null,null,null,null,null,null,null,null,null,null,null,null,null,null,null,null,null,null,null,null,null,null,null,null,null,null,null,null,null,null,null,null,null,null,null,null,null,null,null,null,null,null,null,null,null,null,null,null,null,null,null,null,null,null,null,null,null,null,null,null,null,null,null,null,null,null,null,null,null,null,null,null,null,null,null,null,null,null,null,null,null,null,null,null,null,null,null,null,null,null,null,null,null,null,null,null,null,null,null,null,null,null,null,null,null,null,null,null,null,null,null,null,null,null,null,null,null,null,null,null,36,25,31,16,0,0,31,16,36,25]
["Florida",6555.0000000000009,3386.0000000000009,3169,6388.0000000000009,3282.0000000000009,3106,167,101,59,3.0000000000000013,4.0000000000000036,null,null,null,null,null,null,null,null,null,null,null,null,null,null,null,null,null,null,null,null,null,null,null,null,null,null,null,null,null,null,null,null,null,null,null,null,null,null,null,null,null,null,null,null,null,null,null,null,null,null,null,null,null,null,null,null,null,null,null,null,null,null,null,null,null,null,null,null,null,null,null,null,null,null,null,null,null,null,null,null,null,null,null,null,null,null,null,null,null,null,null,null,null,null,null,null,null,null,null,null,null,null,null,null,null,null,null,null,null,null,null,null,null,null,null,null,null,null,null,null,null,null,null,null,null,null,null,103,55,80,44,3,3,83,47,106,58]
["Lavalleja",5235.9999999999991,2728.9999999999995,2506.9999999999995,5070.9999999999991,2627.9999999999995,2442.9999999999995,165,96,63,4.9999999999999982,1.0000000000000009,null,null,null,null,null,null,null,null,null,null,null,null,null,null,null,null,null,null,null,null,null,null,null,null,null,null,null,null,null,null,null,null,null,null,null,null,null,null,null,null,null,null,null,null,null,null,null,null,null,null,null,null,null,null,null,null,null,null,null,null,null,null,null,null,null,null,null,null,null,null,null,null,null,null,null,null,null,null,null,null,null,null,null,null,null,null,null,null,null,null,null,null,null,null,null,null,null,null,null,null,null,null,null,null,null,null,null,null,null,null,null,null,null,null,null,null,null,null,null,null,null,null,null,null,null,null,null,88,54,47,26,6,1,53,27,94,55]
["Maldonado",13961.000000000004,7233.0000000000018,6728.0000000000009,13670.000000000004,7065.0000000000018,6605.0000000000009,291,168,123,0,0,null,null,null,null,null,null,null,null,null,null,null,null,null,null,null,null,null,null,null,null,null,null,null,null,null,null,null,null,null,null,null,null,null,null,null,null,null,null,null,null,null,null,null,null,null,null,null,null,null,null,null,null,null,null,null,null,null,null,null,null,null,null,null,null,null,null,null,null,null,null,null,null,null,null,null,null,null,null,null,null,null,null,null,null,null,null,null,null,null,null,null,null,null,null,null,null,null,null,null,null,null,null,null,null,null,null,null,null,null,null,null,null,null,null,null,null,null,null,null,null,null,null,null,null,null,null,null,169,119,129,83,0,0,129,83,169,119]
["Paysandú",12227,6430,5797,12013,6296,5717,214,121,74,12.999999999999996,5.9999999999999991,null,null,null,null,null,null,null,null,null,null,null,null,null,null,null,null,null,null,null,null,null,null,null,null,null,null,null,null,null,null,null,null,null,null,null,null,null,null,null,null,null,null,null,null,null,null,null,null,null,null,null,null,null,null,null,null,null,null,null,null,null,null,null,null,null,null,null,null,null,null,null,null,null,null,null,null,null,null,null,null,null,null,null,null,null,null,null,null,null,null,null,null,null,null,null,null,null,null,null,null,null,null,null,null,null,null,null,null,null,null,null,null,null,null,null,null,null,null,null,null,null,null,null,null,null,null,null,117,74,96,57,14,6,110,63,131,80]
["Río Negro",5994,3128,2866.0000000000005,5821,3042,2779.0000000000005,173,84,85,2,2,null,null,null,null,null,null,null,null,null,null,null,null,null,null,null,null,null,null,null,null,null,null,null,null,null,null,null,null,null,null,null,null,null,null,null,null,null,null,null,null,null,null,null,null,null,null,null,null,null,null,null,null,null,null,null,null,null,null,null,null,null,null,null,null,null,null,null,null,null,null,null,null,null,null,null,null,null,null,null,null,null,null,null,null,null,null,null,null,null,null,null,null,null,null,null,null,null,null,null,null,null,null,null,null,null,null,null,null,null,null,null,null,null,null,null,null,null,null,null,null,null,null,null,null,null,null,null,89,85,60,60,1,3,61,63,90,88]
["Rivera",11551.000000000004,6072,5479.0000000000045,11295.000000000004,5909,5386.0000000000045,256,163,93,0,0,null,null,null,null,null,null,null,null,null,null,null,null,null,null,null,null,null,null,null,null,null,null,null,null,null,null,null,null,null,null,null,null,null,null,null,null,null,null,null,null,null,null,null,null,null,null,null,null,null,null,null,null,null,null,null,null,null,null,null,null,null,null,null,null,null,null,null,null,null,null,null,null,null,null,null,null,null,null,null,null,null,null,null,null,null,null,null,null,null,null,null,null,null,null,null,null,null,null,null,null,null,null,null,null,null,null,null,null,null,null,null,null,null,null,null,null,null,null,null,null,null,null,null,null,null,null,null,168,90,134,79,0,0,134,79,168,90]
["Rocha",7093.0000000000018,3700,3393.0000000000014,6841.0000000000018,3545,3296.0000000000014,252,151,92,4.0000000000000018,5,null,null,null,null,null,null,null,null,null,null,null,null,null,null,null,null,null,null,null,null,null,null,null,null,null,null,null,null,null,null,null,null,null,null,null,null,null,null,null,null,null,null,null,null,null,null,null,null,null,null,null,null,null,null,null,null,null,null,null,null,null,null,null,null,null,null,null,null,null,null,null,null,null,null,null,null,null,null,null,null,null,null,null,null,null,null,null,null,null,null,null,null,null,null,null,null,null,null,null,null,null,null,null,null,null,null,null,null,null,null,null,null,null,null,null,null,null,null,null,null,null,null,null,null,null,null,null,151,88,126,64,2,8,128,72,153,96]
["Salto",14003.000000000002,7320.0000000000018,6683,13656.000000000002,7109.0000000000018,6547,347,205,134,6.0000000000000027,2.0000000000000018,null,null,null,null,null,null,null,null,null,null,null,null,null,null,null,null,null,null,null,null,null,null,null,null,null,null,null,null,null,null,null,null,null,null,null,null,null,null,null,null,null,null,null,null,null,null,null,null,null,null,null,null,null,null,null,null,null,null,null,null,null,null,null,null,null,null,null,null,null,null,null,null,null,null,null,null,null,null,null,null,null,null,null,null,null,null,null,null,null,null,null,null,null,null,null,null,null,null,null,null,null,null,null,null,null,null,null,null,null,null,null,null,null,null,null,null,null,null,null,null,null,null,null,null,null,null,null,212,122,119,72,5,3,124,75,217,125]
["San José",10226.999999999998,5326.9999999999991,4899.9999999999991,9988.9999999999982,5176.9999999999991,4811.9999999999991,238,145,88,4.9999999999999982,0,null,null,null,null,null,null,null,null,null,null,null,null,null,null,null,null,null,null,null,null,null,null,null,null,null,null,null,null,null,null,null,null,null,null,null,null,null,null,null,null,null,null,null,null,null,null,null,null,null,null,null,null,null,null,null,null,null,null,null,null,null,null,null,null,null,null,null,null,null,null,null,null,null,null,null,null,null,null,null,null,null,null,null,null,null,null,null,null,null,null,null,null,null,null,null,null,null,null,null,null,null,null,null,null,null,null,null,null,null,null,null,null,null,null,null,null,null,null,null,null,null,null,null,null,null,null,null,164,88,132,74,5,1,137,75,169,89]
["Soriano",8816,4530.9999999999991,4285,8595,4393.9999999999991,4201,221,135,84,2.0000000000000018,0,null,null,null,null,null,null,null,null,null,null,null,null,null,null,null,null,null,null,null,null,null,null,null,null,null,null,null,null,null,null,null,null,null,null,null,null,null,null,null,null,null,null,null,null,null,null,null,null,null,null,null,null,null,null,null,null,null,null,null,null,null,null,null,null,null,null,null,null,null,null,null,null,null,null,null,null,null,null,null,null,null,null,null,null,null,null,null,null,null,null,null,null,null,null,null,null,null,null,null,null,null,null,null,null,null,null,null,null,null,null,null,null,null,null,null,null,null,null,null,null,null,null,null,null,null,null,null,139,83,105,61,3,1,108,62,142,84]
["Tacuarembó",9928.9999999999982,5125.9999999999991,4802.9999999999991,9727.9999999999982,5003.9999999999991,4723.9999999999991,201,114,70,8.0000000000000018,9.0000000000000018,null,null,null,null,null,null,null,null,null,null,null,null,null,null,null,null,null,null,null,null,null,null,null,null,null,null,null,null,null,null,null,null,null,null,null,null,null,null,null,null,null,null,null,null,null,null,null,null,null,null,null,null,null,null,null,null,null,null,null,null,null,null,null,null,null,null,null,null,null,null,null,null,null,null,null,null,null,null,null,null,null,null,null,null,null,null,null,null,null,null,null,null,null,null,null,null,null,null,null,null,null,null,null,null,null,null,null,null,null,null,null,null,null,null,null,null,null,null,null,null,null,null,null,null,null,null,null,115,63,90,48,8,9,98,57,123,72]
["Treinta y Tres",5076.9999999999991,2611.9999999999991,2465,4953.9999999999991,2535.9999999999991,2418,123,72,45,4.0000000000000027,2.0000000000000013,null,null,null,null,null,null,null,null,null,null,null,null,null,null,null,null,null,null,null,null,null,null,null,null,null,null,null,null,null,null,null,null,null,null,null,null,null,null,null,null,null,null,null,null,null,null,null,null,null,null,null,null,null,null,null,null,null,null,null,null,null,null,null,null,null,null,null,null,null,null,null,null,null,null,null,null,null,null,null,null,null,null,null,null,null,null,null,null,null,null,null,null,null,null,null,null,null,null,null,null,null,null,null,null,null,null,null,null,null,null,null,null,null,null,null,null,null,null,null,null,null,null,null,null,null,null,null,78,43,72,38,3,2,75,40,81,45]
["Fuente: Procesamiento propio en base a datos proporcionados por el D.E.E. — C.E.I.P."]

{"sheet":"II-2.2.3","index":154,"n_rows":32,"n_cols":13,"rows_kept":32,"cut":false,"hidden":false,"merged":[[0,8,1,10],[4,0,4,10],[5,0,9,0],[5,1,9,1],[5,2,5,10],[6,2,6,7],[6,9,6,10],[7,2,9,2],[7,3,7,7],[7,8,9,8],[7,9,7,10],[8,3,9,3],[8,4,9,4],[8,5,9,5],[8,6,9,6],[8,7,9,7],[8,9,9,9],[8,10,9,10]]}
["CONSEJO DE EDUCACIÓN PRIMARIA",null,null,null,null,null,null,null,"ALUMNOS MATRICULADOS"]
[]
["Cuadro Nº II-2.2.3"]
[]
["ALUMNOS MATRICULADOS EN EDUCACIÓN PRIMARIA PÚBLICA COMÚN POR ÁREA DEMOGRÁFICA Y CATEGORÍA SEGÚN DEPARTAMENTO AÑO 2011",null,null,null,null,null,null,null,null,null,null,null,"VOLVER"]
["DEPARTAMENTO","TOTAL","ÁREA DEMOGRÁFICA"]
[null,null,"URBANA",null,null,null,null,null,null,"RURAL"]
[null,null,"Total Urbana","CATEGORÍA",null,null,null,null,"Total Rural","CATEGORÍA"]
[null,null,null,"Común","De Práctica","APRENDER","Tiempo Completo","JICI",null,"Común","Internado Rural"]
[]
["TOTAL",{"$f":"+C11+I11","v":273440},{"$f":"+D11+E11+F11+G11+H11","v":256775},{"$f":"SUM(D12:D13)","v":104956},{"$f":"SUM(E12:E13)","v":39518},{"$f":"SUM(F12:F13)","v":82740},{"$f":"SUM(G12:G13)","v":28778},{"$f":"SUM(H12:H13)","v":783},{"$f":"+J11+K11","v":16665},16540,125]
["MONTEVIDEO",{"$f":"+C12+I12","v":83116},{"$f":"+D12+E12+F12+G12+H12","v":83116},33797,6583,33835,8671,230,{"$f":"+J12+K12","v":0},0,0]
["RESTO DEL PAÍS",{"$f":"+C13+I13","v":190324},173659,{"$f":"SUM(D14:D31)","v":71159},{"$f":"SUM(E14:E31)","v":32935},{"$f":"SUM(F14:F31)","v":48905},{"$f":"SUM(G14:G31)","v":20107},{"$f":"SUM(H14:H31)","v":553},16665,{"$f":"SUM(J14:J31)","v":16540},{"$f":"SUM(K14:K31)","v":125}]
["Artigas",8809,8003,2301,1609,2828,1265,0,806,766,40]
["Canelones",45215,42630,16178,6003,16527,3823,99,2585,2585,0]
["Cerro Largo",9263,8284,2771,1783,2854,826,50,979,979,0]
["Colonia",10621,9479,6218,1843,589,801,28,1142,1142,0]
["Durazno",5835,5327,1938,1475,1116,749,49,508,508,0]
["Flores",2233,1973,903,549,254,267,0,260,237,23]
["Florida",6388,5583,2625,1577,618,763,0,805,805,0]
["Lavalleja",5090,4628,1673,1369,740,827,19,462,462,0]
["Maldonado",13670,13016,7523,1930,2336,1227,0,654,640,14]
["Paysandú",12031,10918,3519,2251,3622,1508,18,1113,1079,34]
["Río Negro",5864,5242,3256,1218,239,486,43,622,608,14]
["Rivera",11381,10205,3313,1400,4452,954,86,1176,1176,0]
["Rocha",6841,6553,3362,1114,1203,874,0,288,288,0]
["Salto",13656,12170,3622,2288,3884,2376,0,1486,1486,0]
["San José",10103,8861,4003,1746,1795,1203,114,1242,1242,0]
["Soriano",8595,7881,3675,1738,1734,734,0,714,714,0]
["Tacuarembó",9728,8333,2432,1410,3467,1024,0,1395,1395,0]
["Treinta y Tres",5001,4573,1847,1632,647,400,47,428,428,0]
["Fuente: Procesamiento propio en base a datos proporcionados por el D.E.E .— C.E.I.P."]

{"sheet":"II-2.2.4","index":155,"n_rows":33,"n_cols":6,"rows_kept":33,"cut":false,"hidden":false,"merged":[[32,0,32,5],[0,4,1,5],[4,0,4,5],[5,0,7,1],[5,2,7,2],[5,3,5,5],[6,3,7,3],[6,4,7,4],[6,5,7,5]]}
["CONSEJO DE EDUCACIÓN PRIMARIA",null,null,null,"Alumnos matriculados"]
[]
["Cuadro Nº II-2.2.4"]
[]
["ALUMNOS MATRICULADOS EN EDUCACIÓN PRIMARIA PÚBLICA ESPECIAL POR TIPO DE DISCAPACIDAD SEGÚN DEPARTAMENTO. AÑO 2011."]
["DEPARTAMENTO",null,"TOTAL","DISCAPACIDAD"]
[null,null,null,"Intelectual","Auditiva","Visual"]
[]
["TOTAL",null,{"$f":"+C11+C12","v":7286},{"$f":"SUM(D11:D12)","v":6878},{"$f":"SUM(E11:E12)","v":308},{"$f":"SUM(F11:F12)","v":100}]
[]
["MONTEVIDEO",null,{"$f":"+D11+E11+F11","v":2885},2714,93,78]
["RESTO DEL PAÍS",null,{"$f":"SUM(C13:C30)","v":4401},{"$f":"SUM(D13:D30)","v":4164},{"$f":"SUM(E13:E30)","v":215},{"$f":"SUM(F13:F30)","v":22}]
["Artigas",null,{"$f":"+D13+E13+F13","v":200},187,13,0]
["Canelones",null,759,734,25,0]
["Cerro Largo",null,262,249,13,0]
["Colonia",null,255,243,12,0]
["Durazno",null,229,216,11,2]
["Flores",null,48,48,0,0]
["Florida",null,167,160,7,0]
["Lavalleja",null,165,159,6,0]
["Maldonado",null,291,273,18,0]
["Paysandú",null,214,195,13,6]
["Río Negro",null,173,169,4,0]
["Rivera",null,256,240,16,0]
["Rocha",null,252,243,9,0]
["Salto",null,347,295,44,8]
["San José",null,238,233,5,0]
["Soriano",null,221,219,2,0]
["Tacuarembó",null,201,184,11,6]
["Treinta y Tres",null,123,117,6,0]
["Fuente: D.E.E. — C.E.P."]
["Nota:  Incluyen Escuelas Especiales y Clases Especiales en Escuelas Comunes."]
["Para el Interior del país las clases orientadas a discapacitados visuales y    fonoaudiología se realizan en  Escuelas Comunes,  excepto en Maldonado, Rivera y Salto donde funcionan Escuelas de Fonoaudiología."]

{"sheet":"II-2.2.5","index":156,"n_rows":126,"n_cols":46,"rows_kept":126,"cut":false,"hidden":false,"merged":[[0,4,1,5],[4,0,4,5],[5,0,8,0],[5,1,5,5],[6,1,8,1],[6,2,6,4],[6,5,8,5],[7,2,8,2],[7,3,8,3],[7,4,8,4]]}
["CONSEJO DE EDUCACIÓN PRIMARIA",null,null,null,"ALUMNOS MATRICULADOS"]
[]
["Cuadro Nº II-2.2.5"]
[]
["ALUMNOS MATRICULADOS EN EDUCACIÓN PRIMARIA PRIVADA POR TIPO DE EDUCACIÓN SEGÚN DEPARTAMENTO AÑO 2011"]
["DEPARTAMENTO","TIPO DE EDUCACIÓN"]
[null,"TOTAL","EDUCACIÓN COMÚN",null,null,"EDUCACIÓN ESPECIAL"]
[null,null,"Total","Habilitados","Autorizados"]
[]
["TOTAL DEL PAÍS",{"$f":"SUM(B11:B12)","v":56036},{"$f":"+D10+E10","v":52069},49509,2560,3967]
["MONTEVIDEO",{"$f":"+C11+F11","v":34397},32188,30025,2163,2209,null,null,null,null,null,null,null,null,null,null,null,null,null,null,null,null,null,null,null,null,null,null,null,null,null,null,null,null,null,null,null,null,null,null,null,null,null,null,null,"MONTEVIDEO"]
["RESTO DEL PAÍS",{"$f":"+C12+F12","v":21639},{"$f":"+D12+E12","v":19881},19484,397,1758,null,null,null,null,null,null,null,null,null,null,null,null,null,null,null,null,null,null,null,null,null,null,null,null,null,null,null,null,null,null,null,null,null,null,null,null,null,null,null,"RESTO DEL PAÍS"]
["Artigas",{"$f":"+C13+F13","v":254},{"$f":"+D13+E13","v":92},92,0,162,null,null,null,null,null,null,null,null,null,null,null,null,null,null,null,null,null,null,null,null,null,null,null,null,null,null,null,null,null,null,null,null,null,null,null,null,null,null,null,"Artigas"]
["Canelones",7013,{"$f":"+D14+E14","v":7013},6669,344,0,null,null,null,null,null,null,null,null,null,null,null,null,null,null,null,null,null,null,null,null,null,null,null,null,null,null,null,null,null,null,null,null,null,null,null,null,null,null,null,"Canelones"]
["Cerro Largo",615,615,615,0,0,null,null,null,null,null,null,null,null,null,null,null,null,null,null,null,null,null,null,null,null,null,null,null,null,null,null,null,null,null,null,null,null,null,null,null,null,null,null,null,"Cerro Largo"]
["Colonia",724,724,724,0,0,null,null,null,null,null,null,null,null,null,null,null,null,null,null,null,null,null,null,null,null,null,null,null,null,null,null,null,null,null,null,null,null,null,null,null,null,null,null,null,"Colonia"]
["Durazno",634,634,634,0,0,null,null,null,null,null,null,null,null,null,null,null,null,null,null,null,null,null,null,null,null,null,null,null,null,null,null,null,null,null,null,null,null,null,null,null,null,null,null,null,"Durazno"]
["Flores",368,361,361,0,7,null,null,null,null,null,null,null,null,null,null,null,null,null,null,null,null,null,null,null,null,null,null,null,null,null,null,null,null,null,null,null,null,null,null,null,null,null,null,null,"Flores"]
["Florida",358,296,296,0,62,null,null,null,null,null,null,null,null,null,null,null,null,null,null,null,null,null,null,null,null,null,null,null,null,null,null,null,null,null,null,null,null,null,null,null,null,null,null,null,"Florida"]
["Lavalleja",615,615,615,0,0,null,null,null,null,null,null,null,null,null,null,null,null,null,null,null,null,null,null,null,null,null,null,null,null,null,null,null,null,null,null,null,null,null,null,null,null,null,null,null,"Lavalleja"]
["Maldonado",4020,3879,3879,0,141,null,null,null,null,null,null,null,null,null,null,null,null,null,null,null,null,null,null,null,null,null,null,null,null,null,null,null,null,null,null,null,null,null,null,null,null,null,null,null,"Maldonado"]
["Paysandú",1451,1175,1175,0,276,null,null,null,null,null,null,null,null,null,null,null,null,null,null,null,null,null,null,null,null,null,null,null,null,null,null,null,null,null,null,null,null,null,null,null,null,null,null,null,"Paysandú"]
["Río Negro",610,461,428,33,149,null,null,null,null,null,null,null,null,null,null,null,null,null,null,null,null,null,null,null,null,null,null,null,null,null,null,null,null,null,null,null,null,null,null,null,null,null,null,null,"Río Negro"]
["Rivera",680,673,673,0,7,null,null,null,null,null,null,null,null,null,null,null,null,null,null,null,null,null,null,null,null,null,null,null,null,null,null,null,null,null,null,null,null,null,null,null,null,null,null,null,"Rivera"]
["Rocha",500,413,413,0,87,null,null,null,null,null,null,null,null,null,null,null,null,null,null,null,null,null,null,null,null,null,null,null,null,null,null,null,null,null,null,null,null,null,null,null,null,null,null,null,"Rocha"]
["Salto",1297,1089,1089,0,208,null,null,null,null,null,null,null,null,null,null,null,null,null,null,null,null,null,null,null,null,null,null,null,null,null,null,null,null,null,null,null,null,null,null,null,null,null,null,null,"Salto"]
["San José",576,576,556,20,0,null,null,null,null,null,null,null,null,null,null,null,null,null,null,null,null,null,null,null,null,null,null,null,null,null,null,null,null,null,null,null,null,null,null,null,null,null,null,null,"San José"]
["Soriano",1094,435,435,0,659,null,null,null,null,null,null,null,null,null,null,null,null,null,null,null,null,null,null,null,null,null,null,null,null,null,null,null,null,null,null,null,null,null,null,null,null,null,null,null,"Soriano"]
["Tacuarembó",643,643,643,0,0,null,null,null,null,null,null,null,null,null,null,null,null,null,null,null,null,null,null,null,null,null,null,null,null,null,null,null,null,null,null,null,null,null,null,null,null,null,null,null,"Tacuarembó"]
["Treinta y Tres",187,187,187,0,0,null,null,null,null,null,null,null,null,null,null,null,null,null,null,null,null,null,null,null,null,null,null,null,null,null,null,null,null,null,null,null,null,null,null,null,null,null,null,null,"Treinta y Tres"]
["Fuente: Procesamiento propio en base a datos proporcionados por el D.E.E. — C.E.I.P."]
["Nota: Especial incluye la matrícula de clases especiales en escuelas comunes, "]
["      Instrucción Temprana, Educación Inicial, Preparatorio y Talleres"]
[]
[]
[]
[]
[]
[]
[]
[]
[]
[]
[]
[]
[]
[]
[]
[]
[]
[]
[]
[]
[]
[]
[]
[]
[]
[]
[]
[]
[]
[]
[]
[]
[]
[]
[]
[]
[]
[]
[]
[]
[]
[]
[]
[]
[]
[]
[]
[]
[]
[]
[]
[]
[]
[]
[]
[]
[]
[]
[]
[]
[]
[]
[]
[]
[]
[]
[]
[]
[]
[]
[]
[]
[]
["30025 "," 2163",2209]
[19484,397,1758]
[92,0,162]
[6669,344,0]
[615,0,0]
[724,0,0]
[634,0,0]
[361,0,7]
[296,0,62]
[615,0,0]
[3879,0,141]
[1175,0,276]
[428,33,149]
[673,0,7]
[413,0,87]
[1089,0,208]
[556,20,0]
[435,0,659]
[643,0,0]
[187,0,0]

{"sheet":"II-2.2.6","index":157,"n_rows":23,"n_cols":15,"rows_kept":23,"cut":false,"hidden":false,"merged":[[9,4,10,4],[9,5,10,5],[9,6,10,6],[9,7,10,7],[9,14,10,14],[9,8,10,8],[9,9,10,9],[9,10,10,10],[9,11,10,11],[9,12,10,12],[9,13,10,13],[0,12,1,14],[2,0,3,1],[4,0,4,14],[5,0,10,0],[5,3,5,14],[6,1,8,2],[6,3,7,4],[6,5,7,6],[6,7,7,8],[6,9,7,10],[6,11,7,12],[6,13,7,14],[8,3,8,14],[9,1,10,1],[9,2,10,2],[9,3,10,3]]}
["CONSEJO DE EDUCACIÓN PRIMARIA",null,null,null,null,null,null,null,null,null,null,null,"ALUMNOS MATRICULADOS"]
[]
["Cuadro Nº II-2.2.6"]
[]
["ALUMNOS MATRICULADOS EN EDUCACIÓN PRIMARIA COMÚN POR GRADO Y FORMA DE ADMINISTRACIÓN SEGÚN EDAD AÑO 2011"]
["EDAD",null,null,"GRADO"]
[null,"TOTAL",null,"Primero",null,"Segundo",null,"Tercero",null,"Cuarto",null,"Quinto",null,"Sexto"]
[]
[null,null,null,"FORMA DE ADMINISTRACIÓN"]
[null,"Pública","Privada","Pública","Privada","Pública","Privada","Pública","Privada","Pública","Privada","Pública","Privada","Pública","Privada"]
[]
["TOTAL",{"$f":"SUM(B13:B21)","v":272657},{"$f":"SUM(C13:C21)","v":52069},{"$f":"SUM(D13:D21)","v":46719},{"$f":"SUM(E13:E21)","v":9347},{"$f":" SUM(F13:F21)","v":44446},{"$f":"SUM(G13:G21)","v":9044},45257,8675,45627,8425,44986,8340,45622,8238]
["6  años",{"$f":"+D13","v":35834},{"$f":"+E13","v":7930},35834,7930,0,0,0,0,0,0,0,0,0,0]
["7  años",{"$f":"+D14+F14","v":40452},{"$f":"+E14+G14","v":8940},9857,1365,30595,7575,0,0,0,0,0,0,0,0]
["8  años",{"$f":"+D15+F15+H15","v":41880},{"$f":"+E15+G15+I15","v":8687},950,40,11305,1388,29625,7259,0,0,0,0,0,0]
["9  años",{"$f":"+D16+F16+H16+J16","v":42689},{"$f":"+E16+G16+I16+K16","v":8206},71,5,2217,67,12095,1331,28306,6803,0,0,0,0]
["10 años",{"$f":"+D17+F17+H17+J17+L17","v":43107},{"$f":"+E17+G17+I17+K17+M17","v":8408},5,4,295,8,2915,71,12771,1503,27121,6822,0,0]
["11 años",{"$f":"+D18+F18+H18+J18+L18+N18","v":43292},8066,1,2,25,3,538,10,3683,99,12514,1398,26531,6554]
["12 años",17918,1607,1,1,5,2,70,3,747,12,4171,108,12924,1481]
["13 años",5991,183,0,0,4,0,12,0,94,5,1044,12,4837,166]
["14 años y más",1494,42,0,0,0,1,2,1,26,3,136,0,1330,37]
["Fuente: Procesamiento propio en base a datos proporcionados por el D.E.E .— C.E.I.P."]
["Nota:   Primaria Pública no incluye la matrícula correspondiente a JICI "]

{"sheet":"II-2.2.7","index":158,"n_rows":21,"n_cols":16,"rows_kept":21,"cut":false,"hidden":false,"merged":[[5,14,6,15],[7,4,7,15],[0,13,1,15],[3,0,3,15],[4,0,8,0],[4,4,4,15],[5,1,7,3],[5,4,6,5],[5,6,6,7],[5,8,6,9],[5,10,6,11],[5,12,6,13]]}
["CONSEJO DE EDUCACIÓN PRIMARIA",null,null,null,null,null,null,null,null,null,null,null,null,"ALUMNOS MATRICULADOS"]
[]
["Cuadro Nº II-2.2.7"]
["ALUMNOS MATRICULADOS EN EDUCACIÓN PRIMARIA COMÚN PÚBLICA POR GRADO Y SEXO SEGÚN EDAD. AÑO 2011."]
["EDAD",null,null,null,"GRADO"]
[null,"TOTAL SEXO",null,null,"Primero",null,"Segundo",null,"Tercero",null,"Cuarto",null,"Quinto",null,"Sexto"]
[]
[null,null,null,null,"SEXO"]
[null,"TOTAL","M","F","M","F","M","F","M","F","M","F","M","F","M","F"]
["TOTAL",{"$f":"+C10+D10","v":272657},{"$f":"SUM(E10+G10+I10+K10+M10+O10)","v":140970},{"$f":"+F10+H10+J10+L10+N10+P10","v":131686.99999999997},{"$f":"SUM(E11:E19)","v":24695.000000000033},22023.999999999985,22919.999999999993,21525.999999999996,23315.999999999985,21941.000000000007,23720.000000000018,21907.000000000015,23126.999999999978,21858.999999999971,23191.999999999993,22430]
["6  años",{"$f":"+C11+D11","v":35834.000000000015},{"$f":"SUM(E11+G11+I11+K11+M11+O11)","v":18425.000000000029},{"$f":"+F11+H11+J11+L11+N11+P11","v":17408.999999999989},18425.000000000029,17408.999999999989,0,0,0,0,0,0,0,0,0,0]
["7  años",{"$f":"+C12+D12","v":40452},20626.000000000004,{"$f":"+F12+H12+J12+L12+N12+P12","v":19825.999999999993},5647.0000000000036,4209.9999999999964,14979,15615.999999999996,0,0,0,0,0,0,0,0]
["8  años",41879.999999999985,21338.999999999975,20541.000000000007,580.00000000000057,370.00000000000051,6341.9999999999918,4963.0000000000009,14416.999999999982,15208.000000000005,0,0,0,0,0,0]
["9  años",42689.000000000022,21975.000000000007,20714.000000000015,39,32.000000000000014,1383.9999999999991,833.00000000000091,6703.0000000000018,5392.0000000000055,13849.000000000007,14457.000000000009,0,0,0,0]
["10 años",43106.999999999971,21965.999999999993,21140.999999999978,4.0000000000000133,1.0000000000000029,188.00000000000009,107,1793.0000000000005,1121.9999999999977,6980.00000000001,5791.0000000000036,13000.999999999982,14119.999999999978,0,0]
["11 años",43291.999999999985,22070.999999999993,{"$f":"+F16+H16+J16+L16+N16+P16","v":21220.999999999993},0,0.99999999999999989,18.999999999999986,6.0000000000000053,349.00000000000028,189,2305,1378,6854.9999999999973,5658.9999999999927,12542.999999999993,13988.000000000002]
["12 años",17918,{"$f":"SUM(E17+G17+I17+K17+M17+O17)","v":10028},7890,0,1,5.0000000000000009,0,47.000000000000021,23.00000000000006,498.99999999999926,248.00000000000026,2535.0000000000009,1635.9999999999998,6941.9999999999991,5982]
["13 años",5990.9999999999991,3594.0000000000009,2396.9999999999982,0,0,2.9999999999999978,1.0000000000000056,6.0000000000000062,6.0000000000000115,67.000000000000114,27.000000000000018,635.99999999999966,408.00000000000017,2882.0000000000009,1954.9999999999982]
["14 años y más",1493.9999999999998,946.00000000000034,547.99999999999943,0,0,0,0,1.0000000000000029,1.0000000000000027,20.000000000000021,6.0000000000000044,100.0000000000001,36.000000000000028,825.00000000000023,504.99999999999943]
["Fuente: Procesamiento propio en base a datos proporcionados por el D.E.E. — C.E.I.P."]
["Nota:   Primaria Pública no incluye la matrícula correspondiente a JICI "]

{"sheet":"II-2.2.8","index":159,"n_rows":19,"n_cols":16,"rows_kept":19,"cut":false,"hidden":false,"merged":[[5,12,5,13],[5,14,5,15],[6,4,6,15],[0,12,1,15],[2,0,2,2],[3,0,3,15],[4,0,7,0],[4,4,4,15],[5,1,6,3],[5,4,5,5],[5,6,5,7],[5,8,5,9],[5,10,5,11]]}
["CONSEJO DE EDUCACIÓN PRIMARIA",null,null,null,null,null,null,null,null,null,null,null,"ALUMNOS MATRICULADOS"]
[]
["Cuadro Nº II-2.2.8"]
["ALUMNOS MATRICULADOS EN EDUCACIÓN PRIMARIA COMÚN PRIVADA POR GRADO Y SEXO SEGÚN EDAD AÑO 2011"]
["EDAD",null,null,null,"GRADO"]
[null,"TOTAL SEXO",null,null,"Primero",null,"Segundo",null,"Tercero",null,"Cuarto",null,"Quinto",null,"Sexto"]
[null,null,null,null,"SEXO"]
[null,"TOTAL","M","F","M","F","M","F","M","F","M","F","M","F","M","F"]
["TOTAL",{"$f":"C9+D9","v":52069},{"$f":"SUM(C10:C18)","v":26265.999999999996},25803.000000000007,4713.0000000000009,4633.9999999999964,4575.0000000000036,4469.0000000000018,4349.0000000000018,4326.0000000000018,4286.9999999999964,4137.9999999999991,4199,4141,4142.9999999999973,4095.0000000000009]
["6  años",{"$f":"C10+D10","v":7930},3957,3973,3957.0000000000014,3972.9999999999964,0,0,0,0,0,0,0,0,0,0]
["7  años",8940.0000000000036,{"$f":"+E11+G11","v":4538.0000000000027},{"$f":"+F11+H11","v":4402.0000000000018},722.99999999999943,641.99999999999977,3815.0000000000036,3760.0000000000018,0,0,0,0,0,0,0,0]
["8  años",8687.0000000000036,{"$f":"+E12+G12+I12","v":4317.0000000000018},{"$f":"SUM(F12+H12+J12)","v":4370.0000000000018},24.999999999999986,15.000000000000007,715.00000000000011,673.00000000000023,3577.0000000000014,3682.0000000000014,0,0,0,0,0,0]
["9  años",8205.9999999999964,{"$f":"+E13+G13+I13+K13","v":4175.9999999999964},{"$f":"+F13+H13+J13+L13","v":4029.9999999999991},2.9999999999999982,1.9999999999999984,37.999999999999986,29.000000000000004,719,612.00000000000023,3415.9999999999959,3386.9999999999991,0,0,0,0]
["10 años",8408,{"$f":"+E14+G14+I14+K14+M14","v":4247},{"$f":"+F14+H14+J14+L14+N14","v":4161},3.0000000000000004,0.99999999999999967,2.9999999999999991,4.9999999999999964,47.000000000000007,24.000000000000004,797.00000000000034,705.99999999999977,3396.9999999999995,3425,0,0]
["11 años",8065.9999999999991,{"$f":"+E15+G15+I15+K15+M15+O15","v":4012.9999999999973},4053.0000000000018,0.99999999999999922,0.99999999999999967,1.9999999999999989,0.99999999999999944,5,4.9999999999999991,65.000000000000028,34.000000000000014,726,672.00000000000045,3213.9999999999973,3340.0000000000014]
["12 años",1606.9999999999995,881,725.99999999999943,0.99999999999999967,0,1.9999999999999991,0,0.99999999999999922,1.9999999999999991,5.9999999999999991,5.9999999999999982,67.000000000000057,40.999999999999993,803.99999999999989,676.99999999999943]
["13 años",183,113.00000000000003,69.999999999999972,0,0,0,0,0,0,1.9999999999999984,2.9999999999999982,9.0000000000000071,2.9999999999999982,102.00000000000003,63.999999999999979]
["14 años y más",42.000000000000021,24.000000000000025,17.999999999999996,0,0,0,0.99999999999999967,0,0.99999999999999967,0.99999999999999922,1.9999999999999993,0,0,23.000000000000025,13.999999999999998]
["Fuente: Procesamiento propio en base a datos proporcionados por el D.E.E. — C.E.I.P."]

{"sheet":"II-2.2.9","index":160,"n_rows":33,"n_cols":15,"rows_kept":33,"cut":false,"hidden":false,"merged":[[8,9,9,9],[8,10,9,10],[8,11,9,11],[8,12,9,12],[8,13,9,13],[8,4,9,4],[8,5,9,5],[8,6,9,6],[8,7,9,7],[8,8,9,8],[0,12,1,14],[4,0,4,14],[5,0,9,0],[5,1,5,14],[6,1,7,2],[6,3,6,4],[6,5,6,6],[6,7,6,8],[6,9,6,10],[6,11,6,12],[8,14,9,14],[6,13,6,14],[7,3,7,14],[8,1,9,1],[8,2,9,2],[8,3,9,3]]}
["CONSEJO DE EDUCACIÓN PRIMARIA",null,null,null,null,null,null,null,null,null,null,null,"ALUMNOS MATRICULADOS"]
[]
["Cuadro Nº II-2.2.9"]
[]
["ALUMNOS MATRICULADOS EN EDUCACIÓN PRIMARIA COMÚN POR GRADO Y FORMA DE ADMINISTRACIÓN SEGÚN DEPARTAMENTO AÑO 2011"]
["DEPARTAMENTO","GRADO"]
[null,"TOTAL",null,"Primero",null,"Segundo",null,"Tercero",null,"Cuarto",null,"Quinto",null,"Sexto"]
[null,null,null,"FORMA DE ADMINISTRACIÓN"]
[null,"Pública","Privada","Pública","Privada","Pública","Privada","Pública","Privada","Pública","Privada","Pública","Privada","Pública","Privada"]
[]
["TOTAL",{"$f":"SUM(B12:B13)","v":272657},52069,46719,9347,44446,9044,{"$f":"SUM(H12:H13)","v":45257},8675,45627,8425,44986,8340,45622,8238]
["MONTEVIDEO",{"$f":"+D12+F12+H12+J12+L12+N12","v":82886},{"$f":"+E12+G12+I12+K12+M12+O12","v":32188},14649,5797,13849,5671,13891,5362,13893,5176,13248,5095,13356,5087]
["RESTO DEL PAÍS",{"$f":"SUM(B14:B31)","v":189771},19881,32070,3550,30597,3373,31366,3313,31734,3249,31738,3245,32266,3151]
["Artigas",{"$f":"+D14+F14+H14+J14+L14+N14","v":8809},{"$f":"+E14+G14+I14+K14+M14+O14","v":92},1423,17,1376,20,1413,13,1560,12,1472,18,1565,12]
["Canelones",{"$f":"+D15+F15+H15+J15+L15+N15","v":45116},{"$f":"+E15+G15+I15+K15+M15+O15","v":7013},7659,1269,7345,1230,7568,1170,7456,1160,7568,1161,7520,1023]
["Cerro Largo",{"$f":"+D16+F16+H16+J16+L16+N16","v":9213},615,1592,117,1546,101,1489,85,1498,115,1505,103,1583,94]
["Colonia",{"$f":"+D17+F17+H17+J17+L17+N17","v":10593},724,1835,118,1807,130,1726,126,1749,124,1751,103,1725,123]
["Durazno",5786,634,966,121,868,120,1019,107,981,96,969,100,983,90]
["Flores",2233,361,373,58,390,58,389,62,363,57,343,60,375,66]
["Florida",6388,296,1165,52,1005,42,1073,57,1065,40,1049,66,1031,39]
["Lavalleja",5071,615,846,108,847,93,817,108,820,96,851,100,890,110]
["Maldonado",13670,3879,2247,702,2223,586,2318,661,2234,655,2286,627,2362,648]
["Paysandú",12013,1175,2070,208,1891,217,1948,188,2042,205,2065,182,1997,175]
["Río Negro",5821,461,994,99,928,89,926,70,977,65,1008,77,988,61]
["Rivera",11295,673,1889,121,1767,107,1869,113,1880,99,1909,116,1981,117]
["Rocha",6841,413,1143,81,1122,74,1074,68,1176,50,1119,60,1207,80]
["Salto",13656,1089,2363,185,2091,161,2257,192,2284,172,2266,178,2395,201]
["San José",9989,576,1634,92,1710,101,1691,101,1630,91,1688,95,1636,96]
["Soriano",8595,435,1470,72,1408,87,1380,62,1496,74,1416,72,1425,68]
["Tacuarembó",9728,643,1592,104,1509,128,1581,99,1700,103,1635,98,1711,111]
["Treinta y Tres",4954,187,809,26,764,29,828,31,823,35,838,29,892,37]
["Fuente: Procesamiento propio en base a datos proporcionados por el DEE — CEIP"]
["Nota:   Primaria Pública no incluye la matrícula correspondiente a JICI "]

{"sheet":"II-2.2.10","index":161,"n_rows":21,"n_cols":7,"rows_kept":21,"cut":false,"hidden":false,"merged":[[20,0,20,6],[0,5,1,6],[4,0,4,6],[5,0,9,0],[5,1,5,6],[6,1,6,3],[6,4,6,6],[7,1,9,1],[7,2,7,3],[7,4,9,4],[7,5,7,6],[8,2,9,2],[8,3,9,3],[8,5,9,5],[8,6,9,6],[19,0,19,6]]}
["CONSEJO DE EDUCACIÓN PRIMARIA",null,null,null,null,"ALUMNOS MATRICULADOS"]
[]
["Cuadro Nº II-2.2.10"]
[]
["ALUMNOS MATRICULADOS EN EDUCACIÓN PRIMARIA COMÚN PÚBLICA POR RENDIMIENTO ESCOLAR Y ÁREA DEMOGRÁFICA SEGÚN GRADO AÑO 2011"]
["GRADO","RENDIMIENTO ESCOLAR"]
[null,"PROMOVIDOS",null,null,"NO PROMOVIDOS"]
[null,"TOTAL","ÁREA DEMOGRÁFICA",null,"TOTAL","ÁREA DEMOGRÁFICA"]
[null,null,"Urbana","Rural",null,"Urbana","Rural"]
[]
["TOTAL",{"$f":"+C11+D11","v":256034},{"$f":"SUM(C12:C17)","v":240151},{"$f":"SUM(D12:D17)","v":15883},{"$f":"+F11+G11","v":16623},{"$f":"SUM(F12:F17)","v":15841},{"$f":"SUM(G12:G17)","v":782}]
["Primero",{"$f":"+C12+D12","v":40136},37642,2494,{"$f":"+F12+G12","v":6583},6260,323]
["Segundo",40936,38375,2561,3510,3348,162]
["Tercero",42768,40089,2679,2489,2386,103]
["Cuarto",43707,40994,2713,1920,1837,83]
["Quinto",43582,40853,2729,1404,1340,64]
["Sexto",44905,42198,2707,717,670,47]
[]
["Fuente: Procesamiento propio en base a datos proporcionados por el D.E.E .— C.E.I.P."]
["Nota: No se presenta información para la Educación Primaria Privada porque no existen establecimientos privados en el área demográfica rural"]
["No incluye datos correspondientes a JICI"]

{"sheet":"II-2.2.11","index":162,"n_rows":33,"n_cols":7,"rows_kept":33,"cut":false,"hidden":false,"merged":[[32,0,32,6],[0,5,1,6],[4,0,4,6],[5,0,9,0],[5,1,5,6],[6,1,6,3],[6,5,6,6],[7,1,9,1],[7,2,7,3],[7,4,9,4],[7,5,7,6],[8,2,9,2],[8,3,9,3],[8,5,9,5],[8,6,9,6]]}
["CONSEJO DE EDUCACIÓN PRIMARIA",null,null,null,null,"ALUMNOS MATRICULADOS"]
[]
["Cuadro Nº II-2.2.11"]
[]
["ALUMNOS MATRICULADOS EN EDUCACIÓN PRIMARIA COMÚN PÚBLICA POR RENDIMIENTO ESCOLAR Y ÁREA DEMOGRÁFICA SEGÚN DEPARTAMENTO AÑO 2011"]
["DEPARTAMENTO","RENDIMIENTO ESCOLAR"]
[null,"PROMOVIDOS",null,null,null,"NO PROMOVIDOS"]
[null,"TOTAL","ÁREA DEMOGRÁFICA",null,"TOTAL","ÁREA DEMOGRÁFICA"]
[null,null,"Urbana","Rural",null,"Urbana","Rural"]
[]
["TOTAL",{"$f":"+C11+D11","v":256034},{"$f":"SUM(C12:C13)","v":240151},15883,{"$f":"+F11+G11","v":16623},15841,782]
["MONTEVIDEO",{"$f":"+C12+D12","v":75282},75282,0,{"$f":"+F12+G12","v":7604},7604,0]
["RESTO DEL PAÍS",180752,{"$f":"SUM(C14:C31)","v":164869},{"$f":"SUM(D14:D31)","v":15883},{"$f":"+F13+G13","v":9019},{"$f":"SUM(F14:F31)","v":8237},{"$f":"SUM(G14:G31)","v":782}]
["Artigas",8517,7739,778,{"$f":"+F14+G14","v":292},264,28]
["Canelones",42151,39716,2435,2965,2815,150]
["Cerro Largo",8628,7716,912,585,518,67]
["Colonia",10269,9157,1112,324,294,30]
["Durazno",5596,5102,494,190,176,14]
["Flores",2193,1942,251,40,31,9]
["Florida",6079,5317,762,309,266,43]
["Lavalleja",4832,4391,441,239,218,21]
["Maldonado",13085,12475,610,585,541,44]
["Paysandú",11389,10334,1055,624,566,58]
["Río Negro",5546,4955,591,275,244,31]
["Rivera",10910,9781,1129,385,338,47]
["Rocha",6622,6350,272,219,203,16]
["Salto",12860,11463,1397,796,707,89]
["San José",9484,8297,1187,505,450,55]
["Soriano",8241,7564,677,354,317,37]
["Tacuarembó",9528,8163,1365,200,170,30]
["Treinta y Tres",4822,4407,415,132,119,13]
["Fuente: Procesamiento propio en base a datos proporcionados por el D.E.E .— C.E.I.P."]
["Nota:  No incluye datos correspondientes a JICI"]

{"sheet":"II-2.2.12 ","index":163,"n_rows":32,"n_cols":7,"rows_kept":32,"cut":false,"hidden":false,"merged":[[31,0,31,6],[0,5,1,6],[4,0,4,6],[5,0,7,0],[5,1,5,6],[6,1,6,3],[6,4,6,6],[7,2,7,3],[7,5,7,6]]}
["CONSEJO DE EDUCACIÓN PRIMARIA",null,null,null,null,"ALUMNOS MATRICULADOS"]
[]
["Cuadro Nº II-2.2.12"]
[]
["ALUMNOS MATRICULADOS EN EDUCACIÓN PRIMARIA COMÚN PÚBLICA POR RENDIMIENTO ESCOLAR Y SEXO SEGÚN DEPARTAMENTO. AÑO 2011."]
["DEPARTAMENTO","RENDIMIENTO ESCOLAR"]
[null,"PROMOVIDOS",null,null,"NO PROMOVIDOS"]
[null,"TOTAL","SEXO",null,"TOTAL","SEXO"]
[null,null,"M","F",null,"M","F"]
["TOTAL",{"$f":"+C10+D10","v":256034},{"$f":"SUM(C11:C12)","v":130859},{"$f":"SUM(D11:D12)","v":125175},{"$f":"+F10+G10","v":16623},{"$f":"SUM(F11:F12)","v":10111},{"$f":"SUM(G11:G12)","v":6512}]
["MONTEVIDEO",{"$f":"+C11+D11","v":75282},38084,37198,{"$f":"+F11+G11","v":7604},4619,2985]
["RESTO DEL PAÍS",180752,{"$f":"SUM(C13:C30)","v":92775},{"$f":"SUM(D13:D30)","v":87977},9019,{"$f":"SUM(F13:F30)","v":5492},{"$f":"SUM(G13:G30)","v":3527}]
["Artigas",8517,4386,4131,292,181,111]
["Canelones",42151,21641,20510,2965,1779,1186]
["Cerro Largo",8628,4373,4255,585,358,227]
["Colonia",10269,5264,5005,324,196,128]
["Durazno",5596,2906,2690,190,104,86]
["Flores",2193,1071,1122,40,21,19]
["Florida",6079,3090,2989,309,192,117]
["Lavalleja",4832,2479,2353,239,149,90]
["Maldonado",13085,6724,6361,585,341,244]
["Paysandú",11389,5913,5476,624,383,241]
["Río Negro",5546,2872,2674,275,170,105]
["Rivera",10910,5658,5252,385,251,134]
["Rocha",6622,3408,3214,219,137,82]
["Salto",12860,6608,6252,796,501,295]
["San José",9484,4879,4605,505,298,207]
["Soriano",8241,4169,4072,354,225,129]
["Tacuarembó",9528,4875,4653,200,129,71]
["Treinta y Tres",4822,2459,2363,132,77,55]
["Fuente: Procesamiento propio en base a datos proporcionados por el D.E.E. — C.E.I.P."]
["Nota: No incluye datos correspondientes a JICI ."]

{"sheet":"II-2.2.13","index":164,"n_rows":31,"n_cols":7,"rows_kept":31,"cut":false,"hidden":false,"merged":[[0,5,1,6],[4,0,4,6],[5,0,8,0],[5,1,5,6],[6,1,6,3],[6,4,6,6],[7,1,8,1],[7,2,7,3],[7,4,8,4],[7,5,7,6]]}
["CONSEJO DE EDUCACIÓN PRIMARIA",null,null,null,null,"ALUMNOS MATRICULADOS"]
[]
["Cuadro Nº II-2.2.13"]
[]
["ALUMNOS MATRICULADOS EN EDUCACIÓN PRIMARIA COMÚN PRIVADA POR RENDIMIENTO ESCOLAR Y SEXO SEGÚN DEPARTAMENTO AÑO 2011"]
["DEPARTAMENTO","RENDIMIENTO ESCOLAR"]
[null,"PROMOVIDOS",null,null,"NO PROMOVIDOS"]
[null,"TOTAL","SEXO",null,"TOTAL","SEXO"]
[null,null,"M","F",null,"M","F"]
["TOTAL",{"$f":"+C10+D10","v":51321},{"$f":"SUM(C11:C12)","v":25789},{"$f":"SUM(D11:D12)","v":25532},{"$f":"+F10+G10","v":748},{"$f":"SUM(F11:F12)","v":271},{"$f":"SUM(G11:G12)","v":477}]
["MONTEVIDEO",{"$f":"+C11+D11","v":31687},15902,15785,{"$f":"+F11+G11","v":501},182,319]
["RESTO DEL PAÍS",19634,{"$f":"SUM(C13:C30)","v":9887},{"$f":"SUM(D13:D30)","v":9747},247,{"$f":"SUM(F13:F30)","v":89},{"$f":"SUM(G13:G30)","v":158}]
["Artigas",91,45,46,1,1,0]
["Canelones",6913,3510,3403,100,39,61]
["Cerro Largo",609,309,300,6,3,3]
["Colonia",719,340,379,5,0,5]
["Durazno",628,287,341,6,1,5]
["Flores",355,185,170,6,2,4]
["Florida",295,146,149,1,1,0]
["Lavalleja",597,291,306,18,7,11]
["Maldonado",3835,1956,1879,44,19,25]
["Paysandú",1161,578,583,14,3,11]
["Río Negro",459,234,225,2,1,1]
["Rivera",656,347,309,17,4,13]
["Rocha",413,216,197,0,0,0]
["Salto",1076,533,543,13,2,11]
["San José",566,277,289,10,5,5]
["Soriano",435,211,224,0,0,0]
["Tacuarembó",643,318,325,0,0,0]
["Treinta y Tres",183,104,79,4,1,3]
["Fuente: Procesamiento propio en base a datos proporcionados por el D.E.E. — C.E.I.P."]

{"sheet":"II-2.2.14 ","index":165,"n_rows":34,"n_cols":5,"rows_kept":34,"cut":false,"hidden":false,"merged":[[31,0,31,3],[0,4,1,5],[4,0,4,3],[5,0,8,0],[5,2,6,3],[6,1,8,1],[7,2,8,2],[7,3,8,3]]}
["CONSEJO DE EDUCACIÓN PRIMARIA",null,null,null,"ALUMNOS MATRICULADOS"]
[]
["Cuadro Nº II-2.2.14"]
[]
["ALUMNOS MATRICULADOS EGRESADOS DE EDUCACIÓN PRIMARIA COMÚN PÚBLICA POR ÁREA DEMOGRÁFICA SEGÚN DEPARTAMENTO AÑO 2011"]
["DEPARTAMENTO",null,"ÁREA DEMOGRÁFICA"]
[null,"TOTAL"]
[null,null,"Urbana","Rural"]
[]
["TOTAL",{"$f":"+C10+D10","v":44905},{"$f":"SUM(C11:C12)","v":42198},{"$f":"SUM(D11:D12)","v":2707}]
["MONTEVIDEO",13081,13081,0]
["RESTO DEL PAÍS",{"$f":"+C12+D12","v":31824},{"$f":"SUM(C13:C30)","v":29117},{"$f":"SUM(D13:D30)","v":2707}]
["Artigas",1547,1411,136]
["Canelones",7399,6991,408]
["Cerro Largo",1561,1397,164]
["Colonia",1715,1545,170]
["Durazno",973,887,86]
["Flores",371,333,38]
["Florida",1019,906,113]
["Lavalleja",869,787,82]
["Maldonado",2338,2224,114]
["Paysandú",1968,1785,183]
["Río Negro",986,884,102]
["Rivera",1958,1761,197]
["Rocha",1195,1156,39]
["Salto",2323,2081,242]
["San José",1615,1394,221]
["Soriano",1403,1305,98]
["Tacuarembó",1699,1456,243]
["Treinta y Tres",885,814,71]
["Fuente: Procesamiento propio en base a datos proporcionados por el D.E.E .— C.E.I.P."]
["Nota: No se presenta información para Montevideo Rural por que no existen establecimientos en  el área demográfica rural."]
["        "]
["        "]

{"sheet":"II-2.2.15 ","index":166,"n_rows":30,"n_cols":9,"rows_kept":30,"cut":false,"hidden":false,"merged":[[0,6,1,8],[4,0,4,8],[5,0,7,0],[5,1,7,1],[5,2,5,5],[5,6,5,8],[6,2,7,2],[6,3,6,5],[6,6,7,6],[6,7,6,8]]}
["CONSEJO DE EDUCACIÓN PRIMARIA",null,null,null,null,null,"ALUMNOS MATRICULADOS"]
[]
["Cuadro Nº II-2.2.15"]
[]
["ALUMNOS MATRICULADOS Y EGRESADOS DE EDUCACIÓN PRIMARIA COMÚN POR FORMA DE ADMINISTRACIÓN SEGÚN DEPARTAMENTO AÑO 2011"]
["DEPARTAMENTO","TOTAL","PÚBLICA",null,null,null,"PRIVADA"]
[null,null,"TOTAL","SEXO",null,null,"TOTAL","SEXO"]
[null,null,null,"M","M","F",null,"M","F"]
["TOTAL",{"$f":"+C9+G9","v":53105},{"$f":"+E9+F9","v":44905},null,{"$f":"SUM(E10:E11)","v":22744},{"$f":"SUM(F10:F11)","v":22161},{"$f":"+H9+I9","v":8200},{"$f":"SUM(H10,H11)","v":4123},{"$f":"SUM(I10,I11)","v":4077}]
["MONTEVIDEO",{"$f":"+C10+G10","v":18147},{"$f":"+E10+F10","v":13081},6560,6560,6521,{"$f":"+H10+I10","v":5066},2542,2524]
["RESTO DEL PAÍS",34958,31824,null,{"$f":"SUM(E12:E29)","v":16184},{"$f":"SUM(F12:F29)","v":15640},3134,{"$f":"SUM(H12:H29)","v":1581},{"$f":"SUM(I12:I29)","v":1553}]
["Artigas",1559,1547,765,765,782,12,8,4]
["Canelones",8418,7399,3826,3826,3573,1019,534,485]
["Cerro Largo",1655,1561,802,802,759,94,46,48]
["Colonia",1837,1715,891,891,824,122,55,67]
["Durazno",1063,973,502,502,471,90,42,48]
["Flores",437,371,192,192,179,66,35,31]
["Florida",1058,1019,502,502,517,39,23,16]
["Lavalleja",976,869,426,426,443,107,46,61]
["Maldonado",2985,2338,1183,1183,1155,647,328,319]
["Paysandú",2142,1968,976,976,992,174,85,89]
["Río Negro",1047,986,501,501,485,61,30,31]
["Rivera",2070,1958,995,995,963,112,54,58]
["Rocha",1275,1195,603,603,592,80,50,30]
["Salto",2524,2323,1191,1191,1132,201,96,105]
["San José",1709,1615,824,824,791,94,51,43]
["Soriano",1471,1403,717,717,686,68,35,33]
["Tacuarembó",1810,1699,845,845,854,111,47,64]
["Treinta y Tres",922,885,443,443,442,37,16,21]
["Fuente: Procesamiento propio en base a datos proporcionados por el D.E.E. — C.E.I.P."]

{"sheet":"II-2.2.16 ","index":167,"n_rows":36,"n_cols":6,"rows_kept":36,"cut":false,"hidden":false,"merged":[[31,0,31,5],[32,0,32,5],[0,4,1,5],[4,0,4,5],[5,0,8,0],[5,1,8,1],[6,2,6,3],[6,4,6,5],[7,2,8,2],[7,3,8,3],[7,4,8,4],[7,5,8,5]]}
["CONSEJO DE EDUCACIÓN PRIMARIA",null,null,null,"ALUMNOS MATRICULADOS"]
[]
["Cuadro Nº II-2.2.16"]
[]
["ASISTENCIA INSUFICIENTE Y ABANDONO INTERMITENTE DE 1º GRADO Y 1º A 6º GRADO EN EDUCACIÓN COMÚN PÚBLICA SEGÚN DEPARTAMENTO. AÑO 2011"]
["DEPARTAMENTO","Matrícula a diciembre   (1º a 6º años)"]
[null,null,"ASISTENCIA INSUFICIENTE",null,"ABANDONO INTERMITENTE"]
[null,null,"Sólo 1° año","1º a 6º  años","Sólo 1° año","1º a 6º años"]
[]
["TOTAL",{"$f":"SUM(B11:B12)","v":272657},{"$f":"SUM(C11:C12)","v":4309},{"$f":"SUM(D11:D12)","v":16668},{"$f":"SUM(E11:E12)","v":692.00000000000023},{"$f":"SUM(F11:F12)","v":3055}]
["MONTEVIDEO",82886,1823.0000000000002,6718.0000000000009,307.00000000000006,1277.9999999999998]
["RESTO DEL PAÍS",{"$f":"SUM(B13:B30)","v":189771},{"$f":"SUM(C13:C30)","v":2486},{"$f":"SUM(D13:D30)","v":9950},{"$f":"SUM(E13:E30)","v":385.00000000000011},{"$f":"SUM(F13:F30)","v":1777.0000000000005}]
["Artigas",8809,113.00000000000006,498.00000000000011,16,76.999999999999986]
["Canelones",45116,746.99999999999977,2805.9999999999991,122.00000000000011,520.00000000000045]
["Cerro Largo",9213,111.00000000000003,454,18,69.000000000000014]
["Colonia",10593,101.00000000000001,339.00000000000011,21,80.000000000000057]
["Durazno",5786,85.000000000000014,382.99999999999989,13,94.000000000000043]
["Flores",2233,20.999999999999996,94,3,12.999999999999996]
["Florida",6388,90.999999999999986,318.00000000000017,6.9999999999999991,37.999999999999986]
["Lavalleja",5071,61.000000000000028,261,18.999999999999989,104]
["Maldonado",13670,204.99999999999997,929.00000000000034,33.000000000000014,117.99999999999999]
["Paysandú",12013,136.99999999999997,642.00000000000011,32.999999999999993,163]
["Río Negro",5821,50.000000000000007,191,7.0000000000000009,35]
["Rivera",11295,128.00000000000003,490.99999999999989,10.000000000000002,72]
["Rocha",6841,85.999999999999986,407.99999999999989,15.000000000000004,68]
["Salto",13656,230.00000000000009,847.00000000000011,26.999999999999982,108]
["San José",9989,120.00000000000006,467.99999999999994,13.999999999999996,74.999999999999986]
["Soriano",8595,81,295.00000000000011,4.0000000000000009,32.000000000000014]
["Tacuarembó",9728,73.000000000000014,337.00000000000006,9,49]
["Treinta y Tres",4954,46,188.99999999999991,14.000000000000005,62.000000000000014]
["Fuente: Procesamiento propio en base a datos proporcionados por el D.E.E. — C.E.I.P."]
["No incluye datos correspondientes a JICI ."]
[]
[]
[]
["       "]

{"sheet":"II-2.3.1","index":168,"n_rows":96,"n_cols":9,"rows_kept":96,"cut":false,"hidden":false,"merged":[[6,7,7,7],[6,8,7,8],[31,0,31,8],[32,0,32,8],[0,6,1,7],[4,0,4,8],[5,0,7,0],[5,2,5,8],[6,1,7,1],[6,2,7,2],[6,3,7,3],[6,4,7,4],[6,5,7,5],[6,6,7,6]]}
["CONSEJO DE EDUCACIÓN PRIMARIA",null,null,null,null,null,"PERSONAL DOCENTE"]
[]
["Cuadro Nº II-2.3.1"]
[]
["PERSONAL DOCENTE DE EDUCACIÓN PRIMARIA PÚBLICA POR TIPO DE DESEMPEÑO DOCENTE SEGÚN DEPARTAMENTO AÑO 2011"]
["DEPARTAMENTO",null,"TIPO DE DESEMPEÑO DOCENTE"]
[null,"TOTAL","Inspección","Educación Común","Educación en Colonias","Educación Especial","Servicios Docentes Especiales","Profesores Especiales","Coordinación Apoyo"]
[]
["TOTAL",{"$f":"SUM(B11:B12)","v":18577},261,14748,38,961,147,2330,92]
[]
["MONTEVIDEO",{"$f":"SUM(C11:I11)","v":5569},92,4130,14,409,92,819,13]
["RESTO DEL PAÍS",{"$f":"SUM(B14:B31)","v":13008},169,10618,24,552,55,1511,79]
[]
["Artigas",{"$f":"SUM(C14:I14)","v":626},7,503,0,23,0,89,4]
["Canelones",2653,32,2234,0,108,14,253,12]
["Cerro Largo",641,9,528,0,31,4,65,4]
["Colonia",763,9,612,0,36,3,99,4]
["Durazno",449,7,367,0,22,0,49,4]
["Flores",194,3,152,0,9,0,27,3]
["Florida",502,7,396,0,23,5,67,4]
["Lavalleja",419,6,335,0,20,4,50,4]
["Maldonado",804,11,627,15,37,7,103,4]
["Paysandú",780,10,640,0,37,5,84,4]
["Río Negro",426,5,345,0,21,0,51,4]
["Rivera",846,11,688,0,31,1,111,4]
["Rocha",511,7,398,0,27,3,72,4]
["Salto",927,11,743,9,32,2,125,5]
["San José",677,9,576,0,29,0,59,4]
["Soriano",630,9,511,0,29,2,75,4]
["Tacuarembó",768,10,643,0,22,5,85,3]
["Treinta y Tres",392,6,320,0,15,0,47,4]
["Fuente: DEE — CEP Listado de cargos de la División Hacienda a Julio 2011"]
["Nota: Personal docente refiere a cargos de dos tipos: vacantes y ocupados"]
["        "]
["        "]
[]
[]
[]
[]
[]
[]
[]
[]
[]
[]
[]
[]
[]
[]
[]
[]
[]
[]
[]
[]
[]
[]
[]
[]
[]
[]
[]
[]
[]
[]
[]
[]
[]
[]
[]
[]
[]
[]
[{"$f":"SUM(A76:A77)","v":147}]
[]
[92]
[{"$f":"SUM(A79:A96)","v":55}]
[]
[0]
[14]
[4]
[3]
[0]
[0]
[5]
[4]
[7]
[5]
[0]
[1]
[3]
[2]
[0]
[2]
[5]
[0]

{"sheet":"II-2.3.2","index":169,"n_rows":32,"n_cols":11,"rows_kept":32,"cut":false,"hidden":false,"merged":[[52,20,53,20],[52,21,53,21],[52,22,53,22],[49,17,49,22],[50,11,53,12],[50,13,50,22],[51,13,51,15],[51,17,53,17],[51,18,51,22],[52,13,52,14],[52,15,53,15],[52,18,53,18],[52,19,53,19],[48,20,48,22],[6,11,8,12],[6,13,6,22],[7,5,8,5],[7,6,8,6],[7,7,8,7],[7,8,8,8],[7,9,8,9],[7,10,8,10],[7,13,7,16],[7,17,8,17],[7,18,7,22],[8,13,8,14],[30,0,30,10],[42,11,42,22],[45,11,45,22],[0,9,1,10],[4,0,4,10],[5,0,8,1],[5,2,8,2],[5,3,8,3],[5,4,8,4],[5,5,5,10],[6,5,6,7],[6,8,6,10]]}
["CONSEJO DE EDUCACIÓN PRIMARIA",null,null,null,null,null,null,null,null,"PERSONAL DOCENTE"]
[]
["Cuadro Nº II-2.3.2"]
[]
["PERSONAL DOCENTE DE EDUCACIÓN PRIMARIA PRIVADA POR TIPO DE ESTABLECIMIENTO Y TIPO DE DESEMPEÑO DOCENTE SEGÚN DEPARTAMENTO AÑO 2011"]
["  DEPARTAMENTO",null,"TOTAL","MAESTROS","PROFESORES","ESTABLECIMIENTOS"]
[null,null,null,null,null,"HABILITADOS",null,null,"AUTORIZADOS"]
[null,null,null,null,null,"Total","Maestros","Profesores","Total","Maestros","Profesores"]
[]
["TOTAL",null,{"$f":"+F10+I10","v":6998},{"$f":"+G10+J10","v":2705},{"$f":"+H10+K10","v":4293},{"$f":"+G10+H10","v":6547},{"$f":"SUM(G11:G12)","v":2570},{"$f":"SUM(H11:H12)","v":3977},{"$f":"+J10+K10","v":451},{"$f":"SUM(J11:J12)","v":135},{"$f":"SUM(K11:K12)","v":316}]
["MONTEVIDEO",null,{"$f":"+F11+I11","v":4094},1550,2544,{"$f":"+G11+H11","v":3711},1447,2264,{"$f":"+J11+K11","v":383},103,280]
["RESTO DEL PAÍS",null,2904,1155,1749,2836,{"$f":"SUM(G13:G30)","v":1123},{"$f":"SUM(H13:H30)","v":1713},68,{"$f":"SUM(J13:J30)","v":32},{"$f":"SUM(K13:K30)","v":36}]
["Artigas",null,10,6,4,10,6,4,0,0,0]
["Canelones",null,1062,432,630,1001,405,596,61,27,34]
["Cerro Largo",null,82,35,47,82,35,47,0,0,0]
["Colonia",null,139,64,75,139,64,75,0,0,0]
["Durazno",null,52,29,23,52,29,23,0,0,0]
["Flores",null,54,19,35,54,19,35,0,0,0]
["Florida",null,45,15,30,45,15,30,0,0,0]
["Lavalleja",null,94,36,58,94,36,58,0,0,0]
["Maldonado",null,484,187,297,484,187,297,0,0,0]
["Paysandú",null,129,56,73,129,56,73,0,0,0]
["Río Negro",null,94,29,65,91,27,64,3,2,1]
["Rivera",null,111,47,64,111,47,64,0,0,0]
["Rocha",null,69,25,44,69,25,44,0,0,0]
["Salto",null,151,49,102,151,49,102,0,0,0]
["San José",null,98,41,57,94,38,56,4,3,1]
["Soriano",null,75,23,52,75,23,52,0,0,0]
["Tacuarembó",null,136,53,83,136,53,83,0,0,0]
["Treinta y Tres",null,19,9,10,19,9,10,0,0,0]
["Fuente: DEE — CEP Planillas enviadas por las Inspecciones Departamentales a abril de 2011."]
["NOTA: El personal docente incluye exclusivamente docencia directa "]

{"sheet":"MEDIA BASICA","index":170,"n_rows":0,"n_cols":0,"rows_kept":0,"cut":false,"hidden":false,"merged":[[20,0,20,4],[10,0,10,4],[12,0,12,4],[14,0,14,4],[16,0,16,4],[18,0,18,4],[34,0,34,4],[36,0,36,4],[22,0,22,4],[24,0,24,4],[26,0,26,4],[28,0,28,4],[30,0,30,4],[32,0,32,4]]}

{"sheet":"II-3.1.1","index":171,"n_rows":39,"n_cols":13,"rows_kept":39,"cut":false,"hidden":false,"merged":[[0,12,1,13],[4,0,4,10],[5,0,12,0],[5,3,5,10],[7,3,7,10],[10,3,12,4],[10,5,12,6],[6,1,13,1],[8,9,13,9],[8,10,13,10],[6,3,6,8],[8,3,9,6],[8,7,12,8]]}
["CONSEJO DE EDUCACIÓN SECUNDARIA Y CONSEJO DE EDUCACIÓN TÉCNICO PROFESIONAL (UTU)",null,null,null,null,null,null,null,null,null,null,null,"ESTABLECIMIENTOS"]
[]
["Cuadro Nº II-3.1.1"]
[]
["ESTABLECIMIENTOS DE EDUCACIÓN MEDIA BÁSICA POR MODALIDAD Y FORMA DE ADMINISTRACIÓN SEGÚN DEPARTAMENTO. AÑO 2011."]
["DEPARTAMENTO",null,null,"MODALIDAD"]
[null,"TOTAL GENERAL",null,"CES",null,null,null,null,null,"CEIP","CETP"]
[null,null,null,"FORMA DE ADMINISTRACIÓN"]
[null,null,null,"LICEOS PÚBLICOS",null,null,null,"Liceos Privados",null,"Escuelas con Ciclo Básico Rural","Escuelas de CBT y Técnica."]
[]
[null,null,null,"Diurnos Oficiales",null,"Extra Edad Oficiales (Nocturno Y Diurno)"]
[]
[]
[null,null,"TOTAL CES","Ciclo Básico","C.Básico y Bachillerato","Ciclo Básico","C.Básico y Bachillerato","Ciclo Básico","C.Básico y Bachillerato"]
["TOTAL",{"$f":"B16+B17","v":582},{"$f":"D15+E15+F15+G15+H15+I15","v":487},{"$f":"D16+D17","v":105},{"$f":"E16+E17","v":140},4,62,{"$f":"H16+H17","v":16},{"$f":"I16+I17","v":160},{"$f":"J16+J17","v":58},{"$f":"K16+K17","v":95}]
["MONTEVIDEO",{"$f":"D16+E16+F16+G16+H16+I16+K16","v":182},{"$f":"D16+E16+F16+G16+H16+I16","v":168},48,5,1,14,6,94,1,14]
["RESTO DEL PAÍS",{"$f":"D17+E17+F17+G17+H17+I17+K17","v":400},{"$f":"D17+E17+F17+G17+H17+I17","v":319},{"$f":"SUM(D18:D35)","v":57},135,3,48,10,66,{"$f":"SUM(J18:J35)","v":57},{"$f":"SUM(K18:K35)","v":81}]
["Artigas",14,11,4,5,0,1,1,0,3,3]
["Canelones",97,81,13,28,2,13,5,20,0,16]
["Cerro Largo",16,11,2,5,0,2,0,2,4,5," "]
["Colonia",29,20,3,9,0,6,0,2,6,9]
["Durazno",13,10,2,5,0,1,0,2,1,3]
["Flores",8,6,1,2,0,1,0,2,1,2]
["Florida",15,13,1,9,0,1,0,2,2,2]
["Lavalleja",12,11,2,6,0,1,1,1,2,1]
["Maldonado",30,25,4,6,0,4,0,11,2,5]
["Paysandú",22,17,5,7,0,1,0,4,10,5]
["Río Negro",14,11,3,4,0,2,0,2,5,3]
["Rivera",23,19,3,8,1,1,2,4,4,4]
["Rocha",19,15,3,7,0,3,0,2,2,4]
["Salto",19,16,1,9,0,1,0,5,1,3]
["San José",20,15,3,5,0,5,0,2,7,5]
["Soriano",18,12,3,5,0,3,0,1,1,6]
["Tacuarembó",19,16,3,9,0,1,1,2,4,3]
["Treinta y Tres",12,10,1,6,0,1,0,2,2,2]
[]
["Fuente: D.E.- C.E.S ."]
["Nota: 1- Los establecimientos considerados en el Tipo de Educación Escuelas con Ciclo Básico Rural” ya fueron considerados en los totales de establecimientos de Educación Primaria por lo cual, si bien se presentan en la columna  correspondiente, no participan en el “Total” del presente cuadro."]
["2- En un mismo establecimiento del CETP, coexisten  ofertas educativas de diferentes niveles Los establecimientos fueron contabilizados por el nivel educativo, por lo tanto cada dependencia física será contada tantas veces como niveles educativos contenga Por ello el presente cuadro computa los establecimientos con cursos de Educación Media Básica, independientemente que en el mismo espacio locativo se dicten ofertas de otros niveles."]

{"sheet":"II-3.2.1","index":172,"n_rows":27,"n_cols":5,"rows_kept":27,"cut":false,"hidden":false,"merged":[[24,0,24,4],[0,3,1,5],[4,0,4,4],[5,0,7,0],[5,2,6,4],[6,1,7,1]]}
["CONSEJO DE EDUCACIÓN SECUNDARIA",null,null,"ALUMNOS MATRICULADOS"]
[]
["Cuadro Nº II-3.2.1"]
[]
["ALUMNOS MATRICULADOS EN EDUCACION MEDIA BÁSICA GENERAL POR GRADO SEGÚN GRANDES ÁREAS Y FORMA DE ADMINISTRACIÓN. AÑO 2011."]
["GRANDES ÁREAS Y FORMA DE ADMINISTRACIÓN",null,"GRADO"]
[null,"TOTAL"]
[null,null,"PRIMERO","SEGUNDO","TERCERO"]
["TOTAL DEL PAÍS",{"$f":"+C9+D9+E9","v":156418},{"$f":"+C10+C13","v":57808},{"$f":"+D10+D13","v":50023},48587]
["MEDIA BÁSICA PÚBLICA",{"$f":"+C10+D10+E10","v":130978},{"$f":"+C11+C12","v":49161},{"$f":"+D11+D12","v":41565},40252]
["  Diurna",116634,45610,37301,33723]
["  Cuarto Turno",14344,3551,4264,6529]
["MEDIA BÁSICA PRIVADA",25440,8647,8458,8335]
["TOTAL MONTEVIDEO",57922,{"$f":"+C15+C18","v":21661},{"$f":"+D15+D18","v":18368},17893]
["MEDIA BÁSICA PÚBLICA",{"$f":"+C15+D15+E15","v":41523},{"$f":"+C16+C17","v":16120},{"$f":"+D16+D17","v":12870},12533]
["  Diurna",36454,14973,11364,10117]
["  Cuarto Turno",5069,1147,1506,2416]
["MEDIA BÁSICA PRIVADA",16399,5541,5498,5360]
["TOTAL RESTO DEL PAÍS",98496,36147,31655,30694]
["MEDIA  BÁSICA PÚBLICA",89455,33041,28695,27719]
["  Diurna",80180,30637,25937,23606]
["Cuarto Turno",9275,2404,2758,4113]
["MEDIA BÁSICA PRIVADA",9041,3106,2960,2975]
["Fuente: D.E. — C.E.S."]
["Nota: La referencia \"Privada\", (incluye los Habilitados \"Liceo Naval\" y \"Liceo Militar\"), se corresponde con la de \"Liceos Habilitados\" presente en ediciones anteriores del Anuario Estadístico del MEC."]
[]
["        "]

{"sheet":"II-3.2.2","index":173,"n_rows":35,"n_cols":14,"rows_kept":35,"cut":false,"hidden":false,"merged":[[0,7,1,9],[5,0,6,8],[8,0,12,0],[8,1,12,1],[8,3,8,13],[9,2,12,2],[9,3,9,4],[9,5,12,5],[9,6,9,7],[9,8,12,8],[9,9,9,10],[9,11,12,11],[9,12,9,13],[10,3,10,4],[10,6,10,7],[10,9,10,10],[10,12,10,13],[11,3,12,3],[11,4,12,4],[11,6,12,6],[11,7,12,7],[11,9,12,9],[11,10,12,10],[11,12,12,12],[11,13,12,13]]}
[null,null,null,null,null,null,null,"ALUMNOS MATRICULADOS"]
[]
[]
[]
["Cuadro II-3.2.2."]
["ALUMNOS MATRICULADOS EN EL CETP EN EDUCACIÓN MEDIA BÁSICA TECNOLÓGICA POR TIPO DE CURSO SEGÚN  GRANDES ÁREAS, DEPARTAMENTO Y SEXO .AÑO 2011."]
[]
[]
["GRANDES ÁREAS,DEPARTAMENTO  Y SEXO ","TOTAL ",null,"EDUCACIÓN MEDIA BÁSICA TECNOLÓGICA "]
[null,null,"TOTAL ","Articulación Ed.Media Básica",null,"TOTAL","C. B. T. Agrario",null,"TOTAL","Ciclo Básico Tecnológico",null,"TOTAL ","Formación Profesional Básica 2007"]
[null,null,null,"Sexo",null,null,"Sexo",null,null,"Sexo",null,null,"Sexo"]
[null,null,null,"M","F",null,"M","F",null,"M","F",null,"M","F"]
[]
["TOTAL ",{"$f":"SUM(B15:B16)","v":23791},{"$f":"SUM(C15:C16)","v":156},{"$f":"SUM(D15:D16)","v":96},{"$f":"SUM(E15:E16)","v":60},{"$f":"SUM(F15:F16)","v":1001},{"$f":"SUM(G15:G16)","v":703},298,16125,9620,6505,6509,{"$f":"SUM(M15:M34)","v":7113},{"$f":"SUM(N15:N16)","v":2392}]
["Montevideo",{"$f":"+C15+F15+I15+L15","v":4259},{"$f":"+D15+E15","v":68},37,31,{"$f":"+G15+H15","v":0},0,0,{"$f":"+J15+K15","v":2462},1470,992,{"$f":"+M15+N15","v":1729},1121,608]
["Resto del País ",{"$f":"+C16+F16+I16+L16","v":19532},{"$f":"+D16+E16","v":88},{"$f":"SUM(D17:D34)","v":59},29,1001,703,298,13663,8150,5513,4780,2996,1784]
["Artigas",{"$f":"+C17+F17+I17+L17","v":1124},25,14,11,{"$f":"+G17+H17","v":0},0,0,{"$f":"+J17+K17","v":897},556,341,{"$f":"+M17+N17","v":202},100,102]
["Canelones",{"$f":"+C18+F18+I18+L18","v":3662},41,28,13,84,54,30,2297,1355,942,1240,743,497]
["Cerro Largo",1092,0,0,0,97,70,27,749,447,302,246,185,61]
["Colonia",1551,11,8,3,114,77,37,1192,713,479,234,148,86]
["Durazno",812,0,0,0,120,71,49,567,342,225,125,72,53]
["Flores",298,0,0,0,0,0,0,206,122,84,92,62,30]
["Florida",534,0,0,0,0,0,0,295,178,117,239,140,99]
["Lavalleja",520,0,0,0,0,0,0,378,231,147,142,90,52]
["Maldonado",1418,0,0,0,0,0,0,1133,662,471,285,163,122]
["Paysandú",1173,0,0,0,209,149,60,632,384,248,332,207,125]
["Rio Negro",595,0,0,0,0,0,0,453,289,164,142,110,32]
["Rivera",656,0,0,0,75,58,17,371,231,140,210,165,45]
["Rocha",578,0,0,0,17,15,2,525,322,203,36,6,30]
["Salto",1113,0,0,0,0,0,0,817,461,356,296,197,99]
["San José",1399,0,0,0,63,55,8,1136,647,489,200,110,90]
["Soriano",1577,11,9,2,151,111,40,1121,649,472,294,188,106]
["Tacuarembó",937,0,0,0,0,0,0,501,328,173,436,296,140]
["Treinta y Tres",493,0,0,0,71,43,28,393,233,160,29,14,15]
["Fuente: Procesamiento propio en base a datos proporcionados por el D.E. - CETP  (U.T.U) ."]

{"sheet":"II-3.2.3","index":174,"n_rows":34,"n_cols":13,"rows_kept":34,"cut":false,"hidden":false,"merged":[[0,8,1,13],[5,0,5,12],[6,0,11,0],[6,1,9,3],[6,4,6,12],[7,4,7,12],[8,4,8,6],[8,7,8,9],[8,10,8,12],[9,4,9,6],[10,1,11,1],[10,2,11,2],[10,3,11,3],[10,12,11,12],[9,7,9,9],[9,10,9,12],[10,4,11,4],[10,5,11,5],[10,9,11,9],[10,10,11,10],[10,11,11,11],[10,6,11,6],[10,7,11,7],[10,8,11,8]]}
["CONSEJO DE EDUCACIÓN PRIMARIA",null,null,null,null,null,null,null,"ALUMNOS MATRICULADOS"]
[]
["Cuadro Nº II-3.2.3"]
[]
[]
["ALUMNOS MATRICULADOS EN SÉPTIMO, OCTAVO Y NOVENO GRADO DE CICLO BÁSICO RURAL POR SEXO SEGÚN DEPARTAMENTO AÑO 2011"]
["DEPARTAMENTO","TOTAL",null,null,"CICLO BÁSICO RURAL"]
[null,null,null,null,"GRADO"]
[null,null,null,null,"SÉPTIMO",null,null,"OCTAVO",null,null,"NOVENO"]
[null,null,null,null,"SEXO",null,null,"SEXO",null,null,"SEXO"]
[null,"T","M","F","T","M","F","T","M","F","T","M","F"]
[]
["TOTAL",1966,1020,946,748,389,359,639,339,300,579,292,287]
["MONTEVIDEO",84,35,49,21,7,14,23,10,13,40,18,22]
["RESTO DEL PAÍS",1882,985,897,727,382,345,616,329,287,539,274,265]
["Artigas",127,78,49,39,23,16,48,29,19,40,26,14]
["Canelones",0,0,0,0,0,0,0,0,0,0,0,0]
["Cerro Largo",176,83,93,65,30,35,63,30,33,48,23,25]
["Colonia",220,116,104,81,45,36,71,43,28,68,28,40]
["Durazno",32,16,16,12,7,5,10,5,5,10,4,6]
["Flores",17,12,5,8,6,2,6,5,1,3,1,2]
["Florida",55,31,24,22,13,9,18,8,10,15,10,5]
["Lavalleja",62,34,28,28,17,11,22,11,11,12,6,6]
["Maldonado",111,64,47,46,31,15,43,20,23,22,13,9]
["Paysandú",333,170,163,135,64,71,94,51,43,104,55,49]
["Río Negro",105,56,49,43,24,19,37,20,17,25,12,13]
["Rivera",122,57,65,43,17,26,43,19,24,36,21,15]
["Rocha",90,47,43,30,15,15,26,14,12,34,18,16]
["Salto",25,13,12,13,7,6,7,4,3,5,2,3]
["San José",161,87,74,65,32,33,48,31,17,48,24,24]
["Soriano",35,15,20,14,6,8,11,6,5,10,3,7]
["Tacuarembó",143,75,68,59,33,26,44,22,22,40,20,20]
["Treinta y Tres",68,31,37,24,12,12,25,11,14,19,8,11]
["Fuente: DE — CES"]

{"sheet":"II-3.2.4","index":175,"n_rows":32,"n_cols":7,"rows_kept":32,"cut":false,"hidden":false,"merged":[[0,4,1,6],[4,0,4,6],[6,0,9,0],[6,1,6,6],[7,1,7,2],[7,3,7,4],[7,5,7,6],[8,1,8,6]]}
["CONSEJO DE EDUCACIÓN SECUNDARIA",null,null,null,"ALUMNOS MATRICULADOS"]
[]
["Cuadro Nº II-3.2.4"]
[]
["ALUMNOS MATRICULADOS DE EDUCACIÓN MEDIA BÁSICA GENERAL  POR GRADO Y FORMA DE ADMINISTRACIÓN SEGÚN DEPARTAMENTO AÑO 2011"]
[]
["DEPARTAMENTO","GRADO"]
[null,"PRIMERO",null,"SEGUNDO",null,"TERCERO"]
[null,"FORMA DE ADMINISTRACIÓN"]
[null,"Públicos","Privados","Públicos","Privados","Públicos","Privados"]
["TOTAL",49161,8647,41565,8458,40252,8335]
["MONTEVIDEO",16120,5541,12870,5498,12533,5360]
["RESTO DEL PAÍS",33041,3106,28695,2960,27719,2975]
["Artigas",1385,15,1254,22,1218,16]
["Canelones",8509,1093,7414,1066,6856,1000]
["Cerro Largo",1392,87,1287,69,1336,93]
["Colonia",1646,7,1582,19,1581,8]
["Durazno",967,76,845,91,731,78]
["Flores",377,53,313,60,345,56]
["Florida",954,45,901,47,926,70]
["Lavalleja",1042,61,799,50,848,63]
["Maldonado",2252,468,2025,393,2077,471]
["Paysandú",1773,219,1515,225,1489,239]
["Río Negro",952,66,914,53,774,49]
["Rivera",2494,195,1749,174,1765,142]
["Rocha",1247,76,1123,77,1120,76]
["Salto ",2279,218,2073,190,1923,216]
["San José",1546,108,1412,125,1279,115]
["Soriano",1291,86,1059,73,1161,79]
["Tacuarembó",1905,150,1581,141,1515,118]
["Treinta y Tres",1030,83,849,85,775,86]
["Fuente: DE — CES"]

{"sheet":"II-3.2.5 ","index":176,"n_rows":22,"n_cols":6,"rows_kept":22,"cut":false,"hidden":false,"merged":[[21,0,21,4],[0,4,1,5],[4,0,4,3],[6,0,7,0],[6,1,7,1],[6,2,6,5]]}
["CONSEJO DE EDUCACIÓN TÉCNICO PROFESIONAL (U.T.U.)",null,null,null,"ALUMNOS MATRICULADOS"]
[]
["Cuadro Nº II-3.2.5"]
[]
["ALUMNOS MATRICULADOS EN EDUCACIÓN TÉCNICA MEDIA BÁSICA POR TIPO DE CURSO SEGÚN EDAD. AÑO 2011"]
[]
["EDAD","TOTAL","TIPO DE CURSO"]
[null,null,"C.T.B Agrario","Ciclo Básico Tecnológico","Formación Profesional Básica\nPlan 2007","Articulación Educación Media Básica"]
["TOTAL",{"$f":"+C9+D9+E9+F9","v":23791},{"$f":"+C10+C11+C12++C13+C14+C15+C16+C17+C18+C19+C20+C21","v":1001},{"$f":"+D10+D11+D12++D13+D14+D15+D16+D17+D18+D19+D20+D21","v":16125},{"$f":"+E10+E11+E12++E13+E14+E15+E16+E17+E18+E19+E20+E21","v":6509},156]
["11 y 12 años ",{"$f":"+C10+D10+E10+F10","v":3186},256,2928,2,0]
["13 años ",4933,306,4604,22,1]
["14 años ",5531,301,4843,387,0]
["15 años ",3820,104,2236,1478,2]
["16 años ",2981,20,1040,1916,5]
["17 años ",1779,8,371,1388,12]
["18 años ",634,2,40,571,21]
["19 años ",217,0,14,191,12]
["20 a 24 años ",298,2,22,241,33]
["25 a 29 años ",145,0,6,119,20]
["30 años y más ",263,0,21,192,50]
["Edad desc ",4,2,0,2,0]
["Fuente : Procesamiento propio en base a datos proprocionados por el D.E.-CETP (U.T.U.) "]

{"sheet":"II-3.2.6 ","index":177,"n_rows":25,"n_cols":6,"rows_kept":25,"cut":false,"hidden":false,"merged":[[24,0,24,3],[0,2,1,3],[4,0,4,3],[6,0,7,0],[6,1,7,1],[6,2,6,4]]}
["CONSEJO DE EDUCACIÓN TÉCNICO PROFESIONAL (U.T.U.)",null,"ALUMNOS MATRICULADOS"]
[]
["Cuadro Nº II-3.2.6."]
[]
["ALUMNOS MATRICULADOS EN EL CETP EN EDUCACIÓN MEDIA BÁSICA POR TIPO DE CURSO SEGÚN SECTORES DE ESTUDIO. AÑO 2011."]
[]
["SECTORES DE ESTUDIO","TOTAL","TIPO DE CURSO"]
[null,null,"Ciclo Básico Tecnológico","Formación Profesional Básica Plan 2007","CTB AGRARIO ","Articulación Eduación Media"]
["TOTAL ",{"$f":"+C9+D9+E9+F9","v":23791},16125,6509,1001,156]
["Prog. Ciclo Básico. Educación Media",{"$f":"+C10+E10","v":17126},16125,0,1001,0]
["Agropecuario",{"$f":"+C11+D11+E11+F11","v":129},0,129,0,0]
["Hortifruticultura y Jardinería",53,0,53,0,0]
["Metal - Mecánica",467,0,467,0,0]
["Electricidad y Electrónica",754,0,754,0,0]
["Textil y Confección de Vestimenta",284,0,284,0,0]
["Madera y Muebles",890,0,880,0,10]
["Mant. y Reparación de Vehículos",796,0,796,0,0]
["Gastronomía",857,0,857,0,0]
["Servicios personales",1043,0,1043,0,0]
["Servicios de seguridad",103,0,103,0,0]
["Informática",779,0,779,0,0]
["Construcción y Arquitectura",150,0,150,0,0]
["Deportes ",214,0,214,0,0]
["Prog. Articulación entre Niveles",146,0,0,0,146]
["Fuente: proecesamiento propio deen base a datos proporcionados por el D.E.- CETP . (UTU)"]

{"sheet":"II-3.3.1","index":178,"n_rows":48,"n_cols":7,"rows_kept":48,"cut":false,"hidden":false,"merged":[[0,5,1,6],[4,0,4,6],[6,0,7,0],[6,1,7,1],[6,2,6,3],[6,4,7,4],[6,5,6,6]]}
["CONSEJO DE EDUCACIÓN SECUNDARIA",null,null,null,null,"PERSONAL DOCENTE"]
[]
["Cuadro Nº II-3.3.1."]
[]
["PERSONAL DOCENTE Y HORAS DOCENTES DEL CES EN EDUACIÓN MEDIA BÁSICA GENERAL POR TITULACIÓN SEGÚN ASIGNATURAS. AÑO 2011."]
[]
["ASIGNATURAS","TOTAL DOCENTES","PERSONAL DOCENTE",null,"TOTAL HORAS ","HORAS DOCENTES"]
[null,null,"Titulados","No Titulados",null,"Titulados","No Titulados"]
["TOTAL",{"$f":"SUM(C9:D9)","v":16109},{"$f":"SUM(C10:C46)","v":8603},{"$f":"SUM(D10:D46)","v":7506},{"$f":"SUM(F9:G9)","v":226687},{"$f":"SUM(F10:F46)","v":126366},{"$f":"SUM(G10:G46)","v":100321}]
["ASTRONOMIA",{"$f":"C10+D10","v":156},35,121,{"$f":"F10+G10","v":2040},441,1599]
["BIOLOGIA",{"$f":"C11+D11","v":1241},988,253,{"$f":"F11+G11","v":16038},13787,2251]
["CONTABILIDAD",3,1,2,17,9,8]
["DIBUJO",741,322,419,11638,5473,6165]
["EDUCACION FISICA",948,822,126,14913,13403,1510]
["EDUCACION MUSICAL",542,95,447,8281,1511,6770]
["ED Y CIVICA -DERECHO-",472,384,88,4139,3666,473]
["FILOSOFIA",381,251,130,4388,3216,1172]
["FISICA",615,262,353,7399,3552,3847]
["FRANCES",64,12,52,1071,245,826]
["GEOGRAFIA",822,623,199,12324,10175,2149]
["HISTORIA",1399,1158,241,17841,15930,1911]
["IDIOMA ESPAÑOL",1106,797,309,18010,14054,3956]
["INGLES",1309,404,905,22294,7455,14839]
["ITALIANO",69,22,47,1242,438,804]
["LITERATURA",795,609,186,9706,8032,1674]
["FISICO - QUIMICA",799,402,397,9390,5137,4253]
["MATEMATICA",1479,481,998,26574,9633,16941]
["QUIMICA",695,443,252,7428,5129,2299]
["REC.NATUR Y PAISAJE AGRARIA",0,0,0,0,0,0]
["GEOLOGIA",1,1,0,11,11,0]
["DIRECTOR DE COROS",142,49,93,1565,560,1005]
["PIANISTA ACOMPAÑANTE",106,15,91,1079,146,933]
["INFORMATICA",886,139,747,15255,2131,13124]
["LENGCOMUY MEDIOS AUDIOVISUAL",0,0,0,0,0,0]
["ESTUDIOS ECONOMICOS Y SOCIALES",0,0,0,0,0,0]
["LABORATORIO INFORMATICA EDUCAT",318,40,278,6691,868,5823]
["MANUALIDADES",1,0,1,20,0,20]
["LENGUA ALEMAN",5,0,5,77,0,77]
["TEATRO",0,0,0,0,0,0]
["LENGUAS PORTUGUES",69,3,66,1195,40,1155]
["EXPRESION CORPORAL Y TEATRO",3,1,2,6,2,4]
["EXPRESION CORPORAL Y DANZA",1,0,1,4,0,4]
["ACTADAPTADAS AL MEDIO AMBIENT",57,2,55,543,9,534]
["ECONOMIA",0,0,0,0,0,0]
["ESPACIO CURRICULAR ABIERTO",880,242,638,5445,1313,4132]
["LENGUA DE SEÑAS",4,0,4,63,0,63]
["Fuente: Departamento de Computación - División Hacienda — C.E.S."]
["Nota: Los docentes que dictan más de una asignatura son considerados como personas distintas en cada asignatura."]

{"sheet":"II-3.3.2","index":179,"n_rows":14,"n_cols":5,"rows_kept":14,"cut":false,"hidden":false,"merged":[[0,4,1,5],[4,0,4,3],[5,0,6,0],[5,1,6,1]]}
["CONSEJO DE EDUCACIÓN TÉCNICO PROFESIONAL (U.T.U.)",null,null,null,"PERSONAL DOCENTE"]
[]
["Cuadro Nº II-3.3.2."]
[]
["PERSONAL DOCENTE DEL CETP EN EDUCACIÓN MEDIA BÁSICA TECNOLÓGICA POR TIPO DE CURSO. AÑO 2011."]
["EDUCACIÓN MEDIA BÁSICA","TOTAL"]
[]
[]
["TOTAL",{"$f":"SUM(B10:B13)","v":4580}]
["Ciclo Básico Tecnológico",2507]
["Ciclo Básico Tecnológico Agrario",188]
["Formación Profesional Básica Plan 2007",1784]
["Articulación Educ.Media Básica",101]
["Fuente: U.T.U. División Informática."]

{"sheet":"II-3.4.1","index":180,"n_rows":26,"n_cols":4,"rows_kept":26,"cut":false,"hidden":false,"merged":[[26,0,26,2],[0,3,1,4],[4,0,4,2],[5,0,8,0],[5,1,6,2],[7,1,8,1],[7,2,8,2]]}
["CONSEJO DE EDUCACIÓN SECUNDARIA",null,null,"GRUPOS"]
[]
["Cuadro Nº II-3.4.1."]
[]
["GRUPOS DEL CES EN EDUCACIÓN MEDIA BÁSICA GENERAL  COMPARADOS CON EL TOTAL DE GRUPOS EN EDUCACIÓN MEDIA GENERAL SEGÚN GRANDES ÁREAS Y FORMA DE ADMINISTRACIÓN. AÑO 2011."]
["GRANDES ÁREAS Y FORMA DE ADMINISTRACIÓN","FORMA DE ADMINISTRACIÓN"]
[]
[null,"Grupos en Eduacación Media Básica General ","Total de grupos en Eduacioón Media General"]
[]
["TOTAL DEL PAÍS",5302,9532]
["MEDIA BÁSICA PÚBLICA",4265,7332]
["  Diurna",3894,6345]
["  Cuarto Turno",371,987]
["MEDIA BÁSICA PRIVADA",1037,2200]
["TOTAL MONTEVIDEO",1942,3624]
["MEDIA BÁSICA PÚBLICA",1295,2164]
["  Diurna",1165,1799]
["  Cuarto Turno",130,365]
["MEDIA BÁSICA  PRIVADA",647,1460]
["TOTAL RESTO DEL PAÍS",3360,5908]
["MEDIA BÁSICA PÚBLICA",2970,5168]
["  Diurna",2729,4546]
["Cuarto Turno",241,622]
["MEDIA  BÁSICA PRIVADA",390,740]
[]
["Fuente: D.E. — C.E.S."]

{"sheet":"MEDIA SUPERIOR","index":181,"n_rows":0,"n_cols":0,"rows_kept":0,"cut":false,"hidden":false,"merged":[[20,0,20,4],[10,0,10,4],[12,0,12,4],[14,0,14,4],[16,0,16,4],[18,0,18,4],[34,0,34,4],[36,0,36,4],[22,0,22,4],[24,0,24,4],[26,0,26,4],[28,0,28,4],[30,0,30,4],[32,0,32,4]]}

{"sheet":"II-4.1.1","index":182,"n_rows":39,"n_cols":10,"rows_kept":39,"cut":false,"hidden":false,"merged":[[4,0,4,9],[5,0,12,0],[5,3,5,9],[6,1,13,1],[7,3,7,9],[8,9,13,9],[8,3,9,6],[8,7,12,8],[10,3,12,4],[10,5,12,6],[6,3,6,8]]}
["CONSEJO DE EDUCACIÓN SECUNDARIA Y CONSEJO DE EDUCACIÓN TÉCNICO PROFESIONAL (UTU)"]
[]
["Cuadro Nº II-4.1.1"]
[]
["ESTABLECIMIENTOS DE EDUCACIÓN MEDIA SUPERIOR POR MODALIDAD Y FORMA DE ADMINISTRACIÓN SEGÚN DEPARTAMENTO. AÑO 2011."]
["DEPARTAMENTO",null,null,"MODALIDAD"]
[null,"TOTAL GENERAL",null,"CES",null,null,null,null,null,"CETP"]
[null,null,null,"FORMA DE ADMINISTRACIÓN"]
[null,null,null,"LICEOS PÚBLICOS",null,null,null,"Liceos Privados",null,"Escuelas de CBT y Técnica."]
[]
[null,null,null,"Diurnos Oficiales",null,"Extra Edad Oficiales (Nocturno Y Diurno)"]
[]
[]
[null,null,"TOTAL CES","Bachillerato","C.Básico y Bachillerato","Bachillerato","C.Básico y Bachillerato","Bachillerato","C.Básico y Bachillerato"]
["TOTAL",{"$f":"B16+B17","v":561},{"$f":"D15+E15+F15+G15+H15+I15","v":443},{"$f":"D16+D17","v":42},{"$f":"E16+E17","v":140},33,62,6,160,{"$f":"J16+J17","v":118}]
["MONTEVIDEO",{"$f":"D16+E16+F16+G16+H16+I16+J16","v":174},{"$f":"D16+E16+F16+G16+H16+I16","v":149},17,5,15,14,4,94,25]
["RESTO DEL PAÍS",387,{"$f":"D17+E17+F17+G17+H17+I17","v":294},{"$f":"SUM(D18:D35)","v":25},135,18,48,2,66,93]
["Artigas",14,{"$f":"D18+E18+F18+G18+H18+I18","v":9},2,5,1,1,0,0,5]
["Canelones",91,76,8,28,6,13,1,20,15]
["Cerro Largo",14,9,0,5,0,2,0,2,5]
["Colonia",31,21,2,9,2,6,0,2,10]
["Durazno",14,11,1,5,2,1,0,2,3]
["Flores",8,6,0,2,1,1,0,2,2]
["Florida",18,15,2,9,1,1,0,2,3]
["Lavalleja",12,8,0,6,0,1,0,1,4]
["Maldonado",28,23,1,6,0,4,1,11,5]
["Paysandú",21,15,2,7,1,1,0,4,6]
["Río Negro",13,10,1,4,1,2,0,2,3]
["Rivera",19,14,1,8,0,1,0,4,5]
["Rocha",19,14,1,7,1,3,0,2,5]
["Salto",21,17,1,9,1,1,0,5,4]
["San José",20,13,1,5,0,5,0,2,7]
["Soriano",16,11,1,5,1,3,0,1,5]
["Tacuarembó",16,13,1,9,0,1,0,2,3]
["Treinta y Tres",12,9,0,6,0,1,0,2,3]
[]
["Fuente: D.E.- C.E.S ."]
["Nota: 1- Los establecimientos considerados en el Tipo de Educación Escuelas con Ciclo Básico Rural” ya fueron considerados en los totales de establecimientos de Educación Primaria por lo cual, si bien se presentan en la columna  correspondiente, no participan en el “Total” del presente cuadro."]
["2- En un mismo establecimiento del CETP, coexisten  ofertas educativas de diferentes niveles Los establecimientos fueron contabilizados por el nivel educativo, por lo tanto cada dependencia física será contada tantas veces como niveles educativos contenga Por ello el presente cuadro computa los establecimientos con cursos de Educación Media Básica, independientemente que en el mismo espacio locativo se dicten ofertas de otros niveles."]

{"sheet":"II-4.2.1","index":183,"n_rows":29,"n_cols":5,"rows_kept":29,"cut":false,"hidden":false,"merged":[[24,0,24,4],[0,2,1,4],[0,7,1,7],[4,0,4,4],[5,0,7,0],[5,1,7,1],[5,2,6,4]]}
["CONSEJO DE EDUCACIÓN SECUNDARIA",null,"ALUMNOS MATRICULADOS"]
[]
["Cuadro Nº II-4.2.1"]
[]
["ALUMNOS MATRICULADOS  DEL CES  EN EDUCACIÓN MEDIA SUPERIOR  GENERAL POR GRADO SEGÚN GRANDES ÁREAS Y FORMA DE ADMINISTRACIÓN AÑO 2011"]
["GRANDES ÁREAS Y FORMA DE ADMINISTRACIÓN","TOTAL","GRADO"]
[]
[null,null,"CUARTO","QUINTO","SEXTO"]
["TOTAL DEL PAÍS",116117,41407,41395,33315]
["MEDIA SUPERIOR PÚBLICA ",99175,34570,36001,28604]
["  Diurna",64956,25949,21988,17019]
["  Cuarto Turno",34219,8621,14013,11585]
["MEDIA SUPERIOR PRIVADA",16942,6837,5394,4711]
["TOTAL MONTEVIDEO",47543,15225,17457,14861]
["MEDIA SUPERIOR PÚBLICA ",35008,10585,13343,11080]
["  Diurna",18887,7213,6488,5186]
["  Cuarto Turno",16121,3372,6855,5894]
["MEDIA SUPERIOR PRIVADA ",12535,4640,4114,3781]
["TOTAL RESTO DEL PAÍS",68574,26182,23938,18454]
["MEDIA SUPERIOR PÚBLICA ",64167,23985,22658,17524]
["  Diurna",46069,18736,15500,11833]
["Cuarto Turno",18098,5249,7158,5691]
["MEDIA SUPERIOR PRIVADA ",4407,2197,1280,930]
["Fuente: DE — CES"]
["Nota: La referencia \"Privada\" (incluye los Habilitados \"Liceo Naval\" y \"Liceo Militar\"), se corresponde con la de \"Liceos Habilitados\" presente en ediciones anteriores del Anuario Estadístico del MEC"]
["       "]
["        "]
["        "]
["        "]

{"sheet":"II-4.2.2 ","index":184,"n_rows":84,"n_cols":22,"rows_kept":84,"cut":false,"hidden":false,"merged":[[0,7,1,7],[0,10,0,13],[4,0,4,12],[6,0,14,0],[6,1,14,1],[6,2,11,3],[6,4,7,21],[8,4,8,21],[10,4,14,4],[10,5,10,6],[12,17,14,17],[12,18,14,18],[12,20,14,20],[12,21,14,21],[10,16,14,16],[10,17,10,18],[37,0,37,13],[12,2,14,2],[12,3,14,3],[12,5,14,5],[12,6,14,6],[12,8,14,8],[12,9,14,9],[10,7,14,7],[10,8,10,9],[10,10,14,10],[10,11,10,12],[10,13,14,13],[12,11,14,11],[12,12,14,12],[36,0,36,12],[10,19,14,19],[10,20,10,21],[11,5,11,6],[11,8,11,9],[11,11,11,12],[11,14,11,15],[11,17,11,18],[11,20,11,21],[10,14,10,15],[12,14,14,14],[12,15,14,15]]}
["CONSEJO DE EDUCACIÓN TÉCNICO PROFESIONAL (U.T.U.)",null,null,null,null,null,null,null,null,null,"ALUMNOS MATRICULADOS"]
[]
["Cuadro Nº II-4.2.2"]
[]
["ALUMNOS MATRICULADOS EN EL CETP EN EDUCACIÓN MEDIA SUPERIOR TECNOLÓGICA POR TIPO DE CURSO SEGÚN GRANDES ÁREAS, DEPARTAMENTO Y SEXO. AÑO 2011."]
[]
["GRANDES ÁREAS,DEPARTAMENTO Y SEXO ","TOTAL","TOTAL ",null,"Tipo de curso"]
[]
[null,null,null,null,"EDUACIÓN MEDIA SUPERIOR TECONOLOGICA "]
[]
[null,null,null,null,"TOTAL ","Bachillerato Figari",null,"TOTAL ","Bachillerato Profesional",null,"TOTAL ","Curso Técnico",null,"TOTAL ","Educación Media Profesional",null,"TOTAL","Educación Media Tecnológica",null,"TOTAL ","Articulación"]
[null,null,null,null,null,"Sexo",null,null,"Sexo",null,null,"Sexo",null,null,"Sexo",null,null,"Sexo",null,null,"Sexo"]
[null,null,"F","M",null,"F","M",null,"F","M",null,"F","M",null,"F","M",null,"F","M",null,"F","M"]
[null,null,null,null,null,null,null,null,"Count","Count",null,"Count","Count",null,"Count","Count",null,"Count","Count"]
[]
["TOTAL ",{"$f":"+C16+D16","v":33367},{"$f":"SUM(C17:C18)","v":14896},{"$f":"SUM(D17:D18)","v":18471},{"$f":"+F16+G16","v":135},{"$f":"SUM(F17:F18)","v":71},{"$f":"SUM(G17:G18)","v":64},{"$f":"I16+J16","v":526},{"$f":"SUM(I17:I18)","v":61},{"$f":"SUM(J17:J18)","v":465},{"$f":"+L17+M17","v":334},{"$f":"SUM(L17:L18)","v":326},8,12023,5721,6302,20020,8611,11409,329,106,223]
["Montevideo",{"$f":"+C17+D17","v":15042},{"$f":"+F17+I17+L17+O17+R17+U17","v":6296},{"$f":"+G17+J17+M17+P17+S17+V17","v":8746},{"$f":"+F17+G17","v":118},61,57,{"$f":"I17+J17","v":272},32,240,{"$f":"+L17+M17","v":334},326,8,{"$f":"+O17+P17","v":5476},2683,2793,{"$f":"+R17+S17","v":8605},3121,5484,{"$f":"+U17+V17","v":237},73,164]
["RESTO DEL PAÍS",{"$f":"+C18+D18","v":18325},{"$f":"+F18+I18+L18+O18+R18+U18","v":8600},{"$f":"+G18+J18+M18+P18+S18+V18","v":9725},{"$f":"+F18+G18","v":17},{"$f":"SUM(F19:F36)","v":10},{"$f":"SUM(G19:G36)","v":7},254,{"$f":"SUM(I19:I36)","v":29},{"$f":"SUM(J19:J36)","v":225},{"$f":"+L19+M19","v":0},{"$f":"SUM(L19:L36)","v":0},0,{"$f":"+O18+P18","v":6547},{"$f":"SUM(O19:O36)","v":3038},{"$f":"SUM(P19:P36)","v":3509},{"$f":"+R18+S18","v":11415},{"$f":"SUM(R19:R36)","v":5490},{"$f":"SUM(S19:S36)","v":5925},{"$f":"+U18+V18","v":92},{"$f":"SUM(U19:U36)","v":33},{"$f":"SUM(V19:V36)","v":59}]
["Artigas",{"$f":"+C19+D19","v":1070},{"$f":"+F19+I19+L19+O19+R19+U19","v":514},556,{"$f":"+F19+G19","v":17},10,7,33,0,33,0,0,0,429,143,286,591,361,230,0,0,0]
["Canelones",3261,1734,1527,0,0,0,37,9,28,0,0,0,1406,772,634,1818,953,865,0,0,0]
["Cerro Largo",734,432,302,0,0,0,0,0,0,0,0,0,410,244,166,324,188,136,0,0,0]
["Colonia",1306,644,662,0,0,0,9,0,9,0,0,0,487,242,245,810,402,408,0,0,0]
["Durazno",541,262,279,0,0,0,10,6,4,0,0,0,95,44,51,436,212,224,0,0,0]
["Flores",264,119,145,0,0,0,0,0,0,0,0,0,91,46,45,173,73,100,0,0,0]
["Florida",692,302,390,0,0,0,9,1,8,0,0,0,166,79,87,517,222,295,0,0,0]
["Lavalleja",418,174,244,0,0,0,15,1,14,0,0,0,265,93,172,138,80,58,0,0,0]
["Maldonado",1147,500,647,0,0,0,0,0,0,0,0,0,385,137,248,762,363,399,0,0,0]
["Paysandú",1626,623,1003,0,0,0,11,0,11,0,0,0,266,112,154,1303,486,817,46,25,21]
["Rio Negro",539,236,303,0,0,0,9,2,7,0,0,0,115,42,73,415,192,223,0,0,0]
["Rivera",825,389,436,0,0,0,13,4,9,0,0,0,191,109,82,610,272,338,11,4,7]
["Rocha",363,216,147,0,0,0,18,0,18,0,0,0,168,103,65,177,113,64,0,0,0]
["Salto",1865,806,1059,0,0,0,23,2,21,0,0,0,654,296,358,1163,504,659,25,4,21]
["San José",807,400,407,0,0,0,31,2,29,0,0,0,376,153,223,400,245,155,0,0,0]
["Soriano",1327,572,755,0,0,0,3,0,3,0,0,0,465,208,257,849,364,485,10,0,10]
["Tacuarembó",1014,456,558,0,0,0,10,1,9,0,0,0,281,95,186,723,360,363,0,0,0]
["Treinta y Tres",526,221,305,0,0,0,23,1,22,0,0,0,297,120,177,206,100,106,0,0,0]
["Fuente : Procesamiento propio en base a datos proporcionados por el D.E. _ CETP (U.T.U. ) "]
["Nota: Los matriculados en Formación Profesional Superior ,potencialmente son estudiantes de Eduacación Media Superior, ya que con el curso de Articulación correspondiente adquieren continuidad educativa a  nivel tericiario. "]
[]
[]
[]
[]
[]
[]
[]
[]
[]
[]
[]
[]
[]
[]
[]
[]
[]
[]
[]
[]
[]
[]
[]
[]
[]
[]
[]
[]
[]
[]
[]
[]
[]
[]
[]
[]
[]
[]
[]
[]
[]
[]
[]
["Fuente: Procesamiento propio en base a datos proporcionados por el D.E. - CETP (U.T.U)"]
["Nota:  Los matriculados en Formación Profesional Superior, potencialmente son estudiantes de Educación Media Superior, ya que con el curso de Articulación correspondiente adquieren continuidad educativa al nivel terciario. "]
["Sin embargo no adquieren esta condición hasta haber transitado por Articulación. "]

{"sheet":"II-4.2.3 ","index":185,"n_rows":27,"n_cols":9,"rows_kept":27,"cut":false,"hidden":false,"merged":[[0,7,1,7],[0,8,1,9],[4,0,4,8],[6,0,9,0],[6,1,9,1],[6,2,7,7],[8,2,8,7]]}
["CONSEJO DE EDUCACIÓN TÉCNICO PROFESIONAL (U.T.U.)",null,null,null,null,null,null,null,"ALUMNOS MATRICULADOS"]
[]
["Cuadro Nº II-4.2.3"]
[]
["ALUMNOS MATRICULADOS EN EL CETP EN EDUCACIÓN MEDIA SUPERIOR POR TIPO DE CURSO SEGÚN EDAD. AÑO 2011."]
[]
["EDAD ","TOTAL ","TIPO DE CURSO "]
[]
[null,null,"EDUCACION MEDIA SUPERIOR TECNOLÓGICA "]
[null,null,"Bachillerato Figari","Bachillerato Profesional","Curso Técnico","Educación Media Profesional","Educación Media Tecnológica","Articulación"]
["TOTAL ",{"$f":"SUM(B12:B21)","v":33367},135,526,334,12023,20020,329]
["14 años",{"$f":"+C12+D12+E12+F12+G12+H12","v":60},0,0,0,8,52,0]
["15 años",{"$f":"+C13+D13+E13+F13+G13+H13","v":3113},3,0,6,675,2429,0]
["16 años",4863,11,2,33,1366,3451,0]
["17 años",5273,6,53,35,1486,3690,3]
["18años",3933,10,72,39,1304,2466,42]
["19años",2978,4,57,43,1198,1643,33]
["20 a 24 años",7821,34,163,134,3313,4046,131]
["25 a 29 años",2694,19,73,23,1272,1241,66]
["30 años y más",2612,48,106,20,1392,994,52]
["Edad desc",20,0,0,1,9,8,2]
[]
["Fuente: Procesamiento propio en base a datos proporcionados por el D.E. - CETP (U.T.U)"]
["Nota: Los cursos de Articulación no corresponden estrictamente a Educación Media Superior. El curso de Articulación brinda"]
["la posibilidad de adquirir el nivel educativo para ingresar a cursos terciarios dentro de la oferta educativa del CEPT. "]
["De esta manera se entiende que su inclusión en Educación Media Superior parece más apropiada que su inclusión en nivel "]
["Terciario. "]

{"sheet":"II-4.2.4 ","index":186,"n_rows":44,"n_cols":8,"rows_kept":44,"cut":false,"hidden":false,"merged":[[4,0,4,8],[6,0,7,0],[6,1,7,1],[6,2,6,7]]}
["CONSEJO DE EDUCACIÓN TÉCNICO PROFESIONAL (U.T.U.)",null,null,null,null,null,null,"ALUMNOS MATRICULADOS"]
[]
["Cuadro Nº II-4.2.4."]
[]
["ALUMNOS MATRICULADOS EN EL CETP EN EDUCACIÓN MEDIA SUPERIOR TECNOLÓGICA POR TIPO DE CURSO SEGÚN SECTORES DE ESTUDIO. AÑO 2011."]
[]
["SECTORES DE ESTUDIO ","TOTAL","EDUCACIÓN MEDIA SUPERIOR TECNOLÓGICA"]
[null,null,{"$f":"'[1]II 4.2.4'!C4","v":"Bachillerato Figari"},{"$f":"'[1]II 4.2.4'!D4","v":"Bachillerato Profesional"},{"$f":"'[1]II 4.2.4'!E4","v":"Curso Técnico"},{"$f":"'[1]II 4.2.4'!F4","v":"Educación Media Profesional"},{"$f":"'[1]II 4.2.4'!G4","v":"Educación Media Tecnológica"},{"$f":"'[1]II 4.2.4'!H4","v":"Articulación"}]
["TOTAL",{"$f":"+C9+D9+E9+F9+G9+H9","v":33367},{"$f":"SUM(C10:C39)","v":135},526,334,12023,20020,329]
[{"$f":"'[1]II 4.2.4'!B5","v":"Agropecuario"},{"$f":"+C10+D10+E10+F10+G10+H10","v":1946},{"$f":"'[1]II 4.2.4'!C5","v":0},{"$f":"'[1]II 4.2.4'!D5","v":35},{"$f":"'[1]II 4.2.4'!E5","v":0},{"$f":"'[1]II 4.2.4'!F5","v":262},{"$f":"'[1]II 4.2.4'!G5","v":1649},{"$f":"'[1]II 4.2.4'!H5","v":0}]
[{"$f":"'[1]II 4.2.4'!B6","v":"Artes"},67,{"$f":"'[1]II 4.2.4'!C6","v":67},{"$f":"'[1]II 4.2.4'!D6","v":0},{"$f":"'[1]II 4.2.4'!E6","v":0},{"$f":"'[1]II 4.2.4'!F6","v":0},{"$f":"'[1]II 4.2.4'!G6","v":0},{"$f":"'[1]II 4.2.4'!H6","v":0}]
[{"$f":"'[1]II 4.2.4'!B7","v":"Artesanías"},50,{"$f":"'[1]II 4.2.4'!C7","v":50},{"$f":"'[1]II 4.2.4'!D7","v":0},{"$f":"'[1]II 4.2.4'!E7","v":0},{"$f":"'[1]II 4.2.4'!F7","v":0},{"$f":"'[1]II 4.2.4'!G7","v":0},{"$f":"'[1]II 4.2.4'!H7","v":0}]
[{"$f":"'[1]II 4.2.4'!B8","v":"Cerámica"},18,{"$f":"'[1]II 4.2.4'!C8","v":18},{"$f":"'[1]II 4.2.4'!D8","v":0},{"$f":"'[1]II 4.2.4'!E8","v":0},{"$f":"'[1]II 4.2.4'!F8","v":0},{"$f":"'[1]II 4.2.4'!G8","v":0},{"$f":"'[1]II 4.2.4'!H8","v":0}]
[{"$f":"'[1]II 4.2.4'!B9","v":"Comercio y Administración"},11480,{"$f":"'[1]II 4.2.4'!C9","v":0},{"$f":"'[1]II 4.2.4'!D9","v":0},{"$f":"'[1]II 4.2.4'!E9","v":0},{"$f":"'[1]II 4.2.4'!F9","v":4148},{"$f":"'[1]II 4.2.4'!G9","v":7332},{"$f":"'[1]II 4.2.4'!H9","v":0}]
[{"$f":"'[1]II 4.2.4'!B10","v":"Comunicación"},0,{"$f":"'[1]II 4.2.4'!C10","v":0},{"$f":"'[1]II 4.2.4'!D10","v":0},{"$f":"'[1]II 4.2.4'!E10","v":0},{"$f":"'[1]II 4.2.4'!F10","v":0},{"$f":"'[1]II 4.2.4'!G10","v":0},{"$f":"'[1]II 4.2.4'!H10","v":0}]
[{"$f":"'[1]II 4.2.4'!B11","v":"Construcción y Arquitectura"},2613,{"$f":"'[1]II 4.2.4'!C11","v":0},{"$f":"'[1]II 4.2.4'!D11","v":239},{"$f":"'[1]II 4.2.4'!E11","v":0},{"$f":"'[1]II 4.2.4'!F11","v":865},{"$f":"'[1]II 4.2.4'!G11","v":1509},{"$f":"'[1]II 4.2.4'!H11","v":0}]
[{"$f":"'[1]II 4.2.4'!B12","v":"Cuero y Calzado"},0,{"$f":"'[1]II 4.2.4'!C12","v":0},{"$f":"'[1]II 4.2.4'!D12","v":0},{"$f":"'[1]II 4.2.4'!E12","v":0},{"$f":"'[1]II 4.2.4'!F12","v":0},{"$f":"'[1]II 4.2.4'!G12","v":0},{"$f":"'[1]II 4.2.4'!H12","v":0}]
[{"$f":"'[1]II 4.2.4'!B13","v":"Deportes"},0,{"$f":"'[1]II 4.2.4'!C13","v":0},{"$f":"'[1]II 4.2.4'!D13","v":0},{"$f":"'[1]II 4.2.4'!E13","v":0},{"$f":"'[1]II 4.2.4'!F13","v":0},{"$f":"'[1]II 4.2.4'!G13","v":0},{"$f":"'[1]II 4.2.4'!H13","v":0}]
[{"$f":"'[1]II 4.2.4'!B14","v":"Electricidad y Electrónica"},3313,{"$f":"'[1]II 4.2.4'!C14","v":0},{"$f":"'[1]II 4.2.4'!D14","v":0},{"$f":"'[1]II 4.2.4'!E14","v":0},{"$f":"'[1]II 4.2.4'!F14","v":881},{"$f":"'[1]II 4.2.4'!G14","v":2210},{"$f":"'[1]II 4.2.4'!H14","v":222}]
[{"$f":"'[1]II 4.2.4'!B15","v":"Forestal"},25,{"$f":"'[1]II 4.2.4'!C15","v":0},{"$f":"'[1]II 4.2.4'!D15","v":0},{"$f":"'[1]II 4.2.4'!E15","v":0},{"$f":"'[1]II 4.2.4'!F15","v":25},{"$f":"'[1]II 4.2.4'!G15","v":0},{"$f":"'[1]II 4.2.4'!H15","v":0}]
[{"$f":"'[1]II 4.2.4'!B16","v":"Gastronomía"},1686,{"$f":"'[1]II 4.2.4'!C16","v":0},{"$f":"'[1]II 4.2.4'!D16","v":80},{"$f":"'[1]II 4.2.4'!E16","v":0},{"$f":"'[1]II 4.2.4'!F16","v":1606},{"$f":"'[1]II 4.2.4'!G16","v":0},{"$f":"'[1]II 4.2.4'!H16","v":0}]
[{"$f":"'[1]II 4.2.4'!B17","v":"Gráficos"},0,{"$f":"'[1]II 4.2.4'!C17","v":0},{"$f":"'[1]II 4.2.4'!D17","v":0},{"$f":"'[1]II 4.2.4'!E17","v":0},{"$f":"'[1]II 4.2.4'!F17","v":0},{"$f":"'[1]II 4.2.4'!G17","v":0},{"$f":"'[1]II 4.2.4'!H17","v":0}]
[{"$f":"'[1]II 4.2.4'!B18","v":"Hortifruticultura y Jardinería"},49,{"$f":"'[1]II 4.2.4'!C18","v":0},{"$f":"'[1]II 4.2.4'!D18","v":0},{"$f":"'[1]II 4.2.4'!E18","v":0},{"$f":"'[1]II 4.2.4'!F18","v":49},{"$f":"'[1]II 4.2.4'!G18","v":0},{"$f":"'[1]II 4.2.4'!H18","v":0}]
[{"$f":"'[1]II 4.2.4'!B19","v":"Hotelería"},0,{"$f":"'[1]II 4.2.4'!C19","v":0},{"$f":"'[1]II 4.2.4'!D19","v":0},{"$f":"'[1]II 4.2.4'!E19","v":0},{"$f":"'[1]II 4.2.4'!F19","v":0},{"$f":"'[1]II 4.2.4'!G19","v":0},{"$f":"'[1]II 4.2.4'!H19","v":0}]
[{"$f":"'[1]II 4.2.4'!B20","v":"Informática"},5441,{"$f":"'[1]II 4.2.4'!C20","v":0},{"$f":"'[1]II 4.2.4'!D20","v":40},{"$f":"'[1]II 4.2.4'!E20","v":0},{"$f":"'[1]II 4.2.4'!F20","v":596},{"$f":"'[1]II 4.2.4'!G20","v":4805},{"$f":"'[1]II 4.2.4'!H20","v":0}]
[{"$f":"'[1]II 4.2.4'!B21","v":"Madera y Muebles"},438,{"$f":"'[1]II 4.2.4'!C21","v":0},{"$f":"'[1]II 4.2.4'!D21","v":31},{"$f":"'[1]II 4.2.4'!E21","v":0},{"$f":"'[1]II 4.2.4'!F21","v":407},{"$f":"'[1]II 4.2.4'!G21","v":0},{"$f":"'[1]II 4.2.4'!H21","v":0}]
[{"$f":"'[1]II 4.2.4'!B22","v":"Mant. y Reparación de Vehículos"},1695,{"$f":"'[1]II 4.2.4'!C22","v":0},{"$f":"'[1]II 4.2.4'!D22","v":71},{"$f":"'[1]II 4.2.4'!E22","v":0},{"$f":"'[1]II 4.2.4'!F22","v":1236},{"$f":"'[1]II 4.2.4'!G22","v":388},{"$f":"'[1]II 4.2.4'!H22","v":0}]
[{"$f":"'[1]II 4.2.4'!B23","v":"Mant., Rep., y Serv. a la Producción"},151,{"$f":"'[1]II 4.2.4'!C23","v":0},{"$f":"'[1]II 4.2.4'!D23","v":0},{"$f":"'[1]II 4.2.4'!E23","v":0},{"$f":"'[1]II 4.2.4'!F23","v":151},{"$f":"'[1]II 4.2.4'!G23","v":0},{"$f":"'[1]II 4.2.4'!H23","v":0}]
[{"$f":"'[1]II 4.2.4'!B24","v":"Metal - Mecánica"},667,{"$f":"'[1]II 4.2.4'!C24","v":0},{"$f":"'[1]II 4.2.4'!D24","v":16},{"$f":"'[1]II 4.2.4'!E24","v":0},{"$f":"'[1]II 4.2.4'!F24","v":415},{"$f":"'[1]II 4.2.4'!G24","v":236},{"$f":"'[1]II 4.2.4'!H24","v":0}]
[{"$f":"'[1]II 4.2.4'!B25","v":"Pesca"},81,{"$f":"'[1]II 4.2.4'!C25","v":0},{"$f":"'[1]II 4.2.4'!D25","v":14},{"$f":"'[1]II 4.2.4'!E25","v":0},{"$f":"'[1]II 4.2.4'!F25","v":67},{"$f":"'[1]II 4.2.4'!G25","v":0},{"$f":"'[1]II 4.2.4'!H25","v":0}]
[{"$f":"'[1]II 4.2.4'!B26","v":"Producción de Alimentos"},0,{"$f":"'[1]II 4.2.4'!C26","v":0},{"$f":"'[1]II 4.2.4'!D26","v":0},{"$f":"'[1]II 4.2.4'!E26","v":0},{"$f":"'[1]II 4.2.4'!F26","v":0},{"$f":"'[1]II 4.2.4'!G26","v":0},{"$f":"'[1]II 4.2.4'!H26","v":0}]
[{"$f":"'[1]II 4.2.4'!B27","v":"Prog. Articulación entre Niveles"},0,{"$f":"'[1]II 4.2.4'!C27","v":0},{"$f":"'[1]II 4.2.4'!D27","v":0},{"$f":"'[1]II 4.2.4'!E27","v":0},{"$f":"'[1]II 4.2.4'!F27","v":0},{"$f":"'[1]II 4.2.4'!G27","v":0},{"$f":"'[1]II 4.2.4'!H27","v":0}]
[{"$f":"'[1]II 4.2.4'!B28","v":"Prog. Ciclo Básico. Educacion Media"},0,{"$f":"'[1]II 4.2.4'!C28","v":0},{"$f":"'[1]II 4.2.4'!D28","v":0},{"$f":"'[1]II 4.2.4'!E28","v":0},{"$f":"'[1]II 4.2.4'!F28","v":0},{"$f":"'[1]II 4.2.4'!G28","v":0},{"$f":"'[1]II 4.2.4'!H28","v":0}]
[{"$f":"'[1]II 4.2.4'!B29","v":"Protección al medio ambiente"},0,{"$f":"'[1]II 4.2.4'!C29","v":0},{"$f":"'[1]II 4.2.4'!D29","v":0},{"$f":"'[1]II 4.2.4'!E29","v":0},{"$f":"'[1]II 4.2.4'!F29","v":0},{"$f":"'[1]II 4.2.4'!G29","v":0},{"$f":"'[1]II 4.2.4'!H29","v":0}]
[{"$f":"'[1]II 4.2.4'!B30","v":"Química, Termodinámica y Agroenergía"},427,{"$f":"'[1]II 4.2.4'!C30","v":0},{"$f":"'[1]II 4.2.4'!D30","v":0},{"$f":"'[1]II 4.2.4'!E30","v":0},{"$f":"'[1]II 4.2.4'!F30","v":0},{"$f":"'[1]II 4.2.4'!G30","v":370},{"$f":"'[1]II 4.2.4'!H30","v":57}]
[{"$f":"'[1]II 4.2.4'!B31","v":"Servicios de seguridad"},0,{"$f":"'[1]II 4.2.4'!C31","v":0},{"$f":"'[1]II 4.2.4'!D31","v":0},{"$f":"'[1]II 4.2.4'!E31","v":0},{"$f":"'[1]II 4.2.4'!F31","v":0},{"$f":"'[1]II 4.2.4'!G31","v":0},{"$f":"'[1]II 4.2.4'!H31","v":0}]
[{"$f":"'[1]II 4.2.4'!B32","v":"Servicios personales"},1297,0,0,180,1117,0,0]
[{"$f":"'[1]II 4.2.4'!B33","v":"Textil y Confección de Vestimenta"},352,0,0,154,198,0,0]
[{"$f":"'[1]II 4.2.4'!B34","v":"Turismo"},1571,{"$f":"'[1]II 4.2.4'!C34","v":0},{"$f":"'[1]II 4.2.4'!D34","v":0},{"$f":"'[1]II 4.2.4'!E34","v":0},{"$f":"'[1]II 4.2.4'!F34","v":0},{"$f":"'[1]II 4.2.4'!G34","v":1521},{"$f":"'[1]II 4.2.4'!H34","v":50}]
["Fuente: D.E.- CETP (U.T.U.) "]
["Nota: Los cursos de Articulación no corresponden estrictamente a Educación Media Superior. El curso de Articulación brinda"]
["la posibilidad de adquirir el nivel educativo para ingresar a cursos terciarios dentro de la oferta educativa del CEPT. "]
["De esta manera se entiende que su inclusión en Educación Media Superior parece más apropiada que su inclusión en nivel "]
["Terciario. "]

{"sheet":"II-4.2.5","index":187,"n_rows":35,"n_cols":8,"rows_kept":35,"cut":false,"hidden":false,"merged":[[34,0,34,7],[0,5,1,7],[4,0,4,7],[6,0,9,1],[6,2,6,7],[7,2,7,3],[7,4,7,5],[7,6,7,7],[8,2,8,7]]}
["CONSEJO DE EDUCACIÓN SECUNDARIA",null,null,null,null,"ALUMNOS MATRICULADOS"]
[]
["Cuadro Nº II-4.2.5."]
[]
["ALUMNOS MATRICULADOS EN EL CES EN EDUCACIÓN MEDIA SUPERIOR GENERAL POR GRADO Y FORMA DE ADMINISTRACIÓN SEGÚN DEPARTAMENTO AÑO 2011"]
[]
["DEPARTAMENTO",null,"GRADO"]
[null,null,"CUARTO",null,"QUINTO",null,"SEXTO"]
[null,null,"FORMA DE ADMINISTRACIÓN"]
[null,null,"Públicos","Privados","Públicos","Privados","Públicos","Privados"]
[]
["TOTAL",null,34570,6837,36001,5394,28604,4711]
["MONTEVIDEO",null,10585,4640,13343,4114,11080,3781]
["RESTO DEL PAÍS",null,23985,2197,22658,1280,17524,930]
["Artigas",null,1076,0,984,0,779,0]
["Canelones",null,5927,697,5735,422,4298,316]
["Cerro Largo",null,1197,78,1098,28,808,0]
["Colonia",null,1398,11,1389,0,1230,0]
["Durazno",null,681,75,681,35,548,0]
["Flores",null,303,38,317,19,262,0]
["Florida",null,828,12,631,30,589,30]
["Lavalleja",null,744,11,739,32,509,0]
["Maldonado",null,1859,505,1760,471,1307,421]
["Paysandú",null,1158,177,1112,105,871,65]
["Río Negro",null,616,25,631,6,477,0]
["Rivera",null,1536,97,1450,29,1088,18]
["Rocha",null,1019,39,929,0,640,0]
["Salto ",null,1563,140,1521,9,1235,14]
["San José",null,1236,65,1231,33,856,24]
["Soriano",null,950,57,984,0,779,0]
["Tacuarembó",null,1242,109,893,61,821,42]
["Treinta y Tres",null,652,61,573,0,427,0]
[]
["Fuente: DE — CES"]
["Nota:  La referencia \"Privados\" (incluye los Habilitados \"Liceo Naval\" y \"Liceo Militar\"), se corresponde con la de \"Liceos Habilitados\" presente en ediciones anteriores del Anuario Estadístico del MEC"]

{"sheet":"II-4.2.6","index":188,"n_rows":30,"n_cols":20,"rows_kept":30,"cut":false,"hidden":false,"merged":[[5,0,9,0],[5,1,9,1],[5,2,5,5],[5,7,9,7],[5,8,9,8],[0,3,1,5],[0,6,1,6],[0,16,1,18],[4,0,4,5],[4,7,4,13],[8,14,8,15],[8,16,8,17],[5,9,5,19],[6,2,6,5],[6,9,6,11],[6,12,6,17],[6,18,9,18],[7,19,9,19],[8,9,9,9],[8,10,9,10],[8,11,9,11],[8,12,8,13]]}
["CONSEJO DE EDUCACIÓN SECUNDARIA",null,null,"ALUMNOS MATRICULADOS",null,null,null,"CONSEJO DE EDUCACIÓN SECUNDARIA",null,null,null,null,null,null,null,null,"ALUMNOS MATRICULADOS"]
[]
["Cuadro Nº II-4.2.6"]
[]
["ALUMNOS MATRICULADOS EN EL CES EN QUINTO GRADO DE EDUCACIÓN MEDIA POR PLAN Y ORIENTACIÓN SEGÚN GRANDES ÁREAS Y FORMA DE ADMINISTRACIÓN AÑO 2011",null,null,null,null,null,null,"ALUMNOS MATRICULADOS EN EL CES EN QUINTO GRADO DE EDUCACIÓN MEDIA GENERAL POR PLAN Y ORIENTACIÓN SEGÚN GRANDES ÁREAS Y FORMA DE ADMINISTRACIÓN AÑO 2011"]
["GRANDES ÁREAS Y FORMAS DE ADMINISTRACIÓN","TOTAL","QUINTO GRADO DE EDUCACIÓN MEDIA GENERAL",null,null,null,null,"GRANDES ÁREAS Y FORMAS DE ADMINISTRACIÓN","TOTAL","QUINTO GRADO DE EDUCACIÓN MEDIA GENERAL"]
[null,null,"ORIENTACIÓN     PLAN REFORMULACIÓN 2006",null,null,null,null,null,null,"ORIENTACIÓN  PLAN / 76",null,null,"ORIENTACIÓN  PLAN 94",null,null,null,null,null,"TOTPLANESPRIVADOS","OTROS (*)"]
[null,null,null,null,null,null,null,null,null,null,null,null,null,null,null,null,null,null,null,"BINT y/o BICUL "]
[null,null,"DivHum","DivBiol","DivCient","DivArt",null,null,null,"Hum","Biol","Cient","2º H",null,"2º B",null,"2º C"]
[null,null,null,null,null,null,null,null,null,null,null,null,"ANUAL","1ºSemestre","ANUAL","1ºSemestre","ANUAL","1ºSemestre"]
["TOTAL DEL PAÍS",41395,9067,7951,3434,1626,null,"TOTAL DEL PAÍS",19317,1320,778,105,3950,2841,2827,1242,594,266,5279,115]
["EDUCACIÓN MEDIA SUPERIOR PÚBLICA",36001,9067,7951,3434,1626,null,"EDUCACIÓN MEDIA SUPERIOR PÚBLICA",13923,1320,778,105,3950,2841,2827,1242,594,266,0,0]
["  Diurna",21988,9067,7951,3434,1524,null,"  Diurna",12,0,0,0,12,0,0,0,0,0,0,0]
["  Cuarto Turno",14013,0,0,0,102,null,"  Cuarto Turno",13911,1320,778,105,3938,2841,2827,1242,594,266,0,0]
["EDUCACIÓN MEDIA SUPERIOR PRIVADA",5394,0,0,0,0,null,"EDUCACIÓN MEDIA SUPERIOR PRIVADA",5394,0,0,0,0,0,0,0,0,0,5279,115]
["TOTAL MONTEVIDEO",17457,2767,1976,1152,683,null,"TOTAL MONTEVIDEO",10879,694,394,88,1393,1839,892,923,276,266,4015,99]
["EDUCACIÓN MEDIA SUPERIOR PÚBLICA",13343,2767,1976,1152,683,null,"EDUCACIÓN MEDIA SUPERIOR PÚBLICA",6765,694,394,88,1393,1839,892,923,276,266,0,0]
["  Diurna",6488,2767,1976,1152,581,null,"  Diurna",12,0,0,0,12,0,0,0,0,0,0,0]
["  Cuarto Turno",6855,null,null,null,102,null,"  Cuarto Turno",6753,694,394,88,1381,1839,892,923,276,266,0,0]
["EDUCACIÓN MEDIA SUPERIOR PRIVADA",4114,null,null,null,null,null,"EDUCACIÓN MEDIA SUPERIOR PRIVADA",4114,0,0,0,null,null,null,null,null,null,4015,99]
["TOTAL RESTO DEL PAÍS",23938,6300,5975,2282,943,null,"TOTAL RESTO DEL PAÍS",8438,626,384,17,2557,1002,1935,319,318,0,1264,16]
["EDUCACIÓN MEDIA SUPERIOR PÚBLICA",22658,6300,5975,2282,943,null,"EDUCACIÓN MEDIA SUPERIOR PÚBLICA",7158,626,384,17,2557,1002,1935,319,318,0,0,0]
["  Diurna",15500,6300,5975,2282,943,null,"  Diurna",0,0,0,0,0,0,0,0,0,0,0,0]
["Cuarto Turno",7158,0,0,0,0,null,"Cuarto Turno",7158,626,384,17,2557,1002,1935,319,318,0,0,0]
["EDUCACIÓN MEDIA SUPERIOR PRIVADA",1280,0,0,0,0,null,"EDUCACIÓN MEDIA SUPERIOR PRIVADA",1280,0,0,0,0,0,0,0,0,0,1264,16]
["Fuente: DE — CES",null,null,null,null,null,null,"Fuente: DE — CES"]
["Nota:   OTROS (*) Corresponde a los cursos de Bachillerato Internacional y Bachillerato Bicultural",null,null,null,null,null,null,"Nota:   OTROS (*) Corresponde a los cursos de Bachillerato Internacional y Bachillerato Bicultural"]
["        La referencia \"Privada\", (incluye los Habilitados \"Liceo Naval\" y \"Liceo Militar\"),",null,null,null,null,null,null,"        La referencia \"Privada\", (incluye los Habilitados \"Liceo Naval\" y \"Liceo Militar\"),"]
["        se corresponde con la de \"Liceos Habilitados\" presente en ediciones anteriores",null,null,null,null,null,null,"        se corresponde con la de \"Liceos Habilitados\" presente en ediciones anteriores"]
["        del Anuario Estadístico del MEC",null,null,null,null,null,null,"        del Anuario Estadístico del MEC"]

{"sheet":"II-4.2.7","index":189,"n_rows":33,"n_cols":15,"rows_kept":33,"cut":false,"hidden":false,"merged":[[0,7,1,7],[0,11,1,13],[4,0,4,21],[6,0,10,0],[6,1,10,1],[6,2,6,14],[7,2,7,4],[7,5,7,10],[7,11,7,14],[8,2,10,2],[8,3,10,3],[8,4,10,4],[8,5,8,6],[8,7,8,8],[8,9,8,10],[9,5,10,5],[9,11,10,11],[9,12,10,12],[9,13,10,13],[9,14,10,14],[9,6,10,6],[9,7,10,7],[9,8,10,8],[9,9,10,9],[9,10,10,10]]}
["CONSEJO DE EDUCACIÓN SECUNDARIA",null,null,null,null,null,null,null,null,null,null,"ALUMNOS MATRICULADOS"]
[]
["Cuadro Nº II-4.2.7"]
[]
["ALUMNOS MATRICULADOS EN EL CES EN QUINTO GRADO DE EDUCACIÓN MEDIA GENERAL PÚBLICA POR PLAN Y ORIENTACIÓN SEGÚN DEPARTAMENTO AÑO 2011"]
[]
["DEPARTAMENTO","TOTAL","QUINTO GRADO DE EDUCACIÓN MEDIA GENERAL"]
[null,null,"ORIENTACIÓN     PLANES / 76",null,null,"ORIENTACIÓN  PLAN / 94",null,null,null,null,null,"ORIENTACIÓN  PLAN / REFORMULACIÓN 2006"]
[null,null,"Humanística","Biológica","Científica","2º H",null,"2º B",null,"2º C"]
[null,null,null,null,null,"ANUAL","1ºSemestre","ANUAL","1ºSemestre","ANUAL","1ºSemestre","DivHum","DivBiol","DivCient","DivArt"]
[]
["TOTAL",36001,1320,778,105,3950,2841,2827,1242,594,266,9067,7951,3434,1626]
["MONTEVIDEO",13343,694,394,88,1393,1839,892,923,276,266,2767,1976,1152,683]
["RESTO DEL PAÍS",22658,626,384,17,2557,1002,1935,319,318,0,6300,5975,2282,943]
["Artigas",984,0,0,0,93,95,60,0,0,0,318,287,95,36]
["Canelones",5735,67,28,17,856,343,648,0,145,0,1474,1158,700,299]
["Cerro Largo",1098,142,87,0,46,0,26,0,12,0,326,327,86,46]
["Colonia",1389,0,0,0,270,0,259,0,0,0,273,338,179,70]
["Durazno",681,0,0,0,113,0,53,0,0,0,257,159,77,22]
["Flores",317,0,0,0,66,0,56,0,0,0,68,92,28,7]
["Florida",631,92,28,0,14,0,20,0,0,0,214,172,70,21]
["Lavalleja",739,70,57,0,0,0,0,0,0,0,254,286,53,19]
["Maldonado",1760,171,113,0,103,74,43,28,45,0,476,390,190,127]
["Paysandú",1112,0,0,0,0,152,0,163,22,0,297,368,90,20]
["Río Negro",631,0,0,0,144,0,84,0,0,0,148,184,51,20]
["Rivera",1450,0,0,0,47,173,50,102,27,0,547,368,106,30]
["Rocha",929,84,71,0,57,42,23,26,0,0,234,257,92,43]
["Salto ",1521,0,0,0,188,0,130,0,24,0,478,537,125,39]
["San José",1231,0,0,0,246,0,222,0,34,0,235,305,119,70]
["Soriano",984,0,0,0,89,123,106,0,9,0,228,308,97,24]
["Tacuarembó",893,0,0,0,124,0,91,0,0,0,288,277,80,33]
["Treinta y Tres",573,0,0,0,101,0,64,0,0,0,185,162,44,17]
["Fuente: DE — CES"]

{"sheet":"II-4.2.8 ","index":190,"n_rows":36,"n_cols":7,"rows_kept":36,"cut":false,"hidden":false,"merged":[[10,4,11,4],[10,5,11,5],[10,6,11,6],[0,5,1,7],[4,0,4,10],[6,0,6,7],[8,0,11,0],[8,1,11,1],[8,2,8,6],[8,9,11,10],[9,2,9,5],[10,2,11,2],[10,3,11,3]]}
["CONSEJO DE EDUCACIÓN SECUNDARIA",null,null,null,null,"ALUMNOS MATRICULADOS"]
[]
["Cuadro Nº II-4.2.8"]
[]
[]
[]
["ALUMNOS MATRICULADOS EN EL CES EN QUINTO GRADO DE EDUCACIÓN MEDIA SUPERIOR DE EDUCACIÓN SECUNDARIA PRIVADA POR ORIENTACIÓN SEGÚN DEPARTAMENTO AÑO 2011"]
[]
["DEPARTAMENTO","TOTAL","QUINTO GRADO DE EDUCACIÓN MEDIA GENERAL"]
[null,null,"ORIENTACIÓN Planes 76+86+93+2006",null,null,null,"OTROS (*)"]
[null,null,"Humanística","Biológica","Científica","Artístico","BINT y/o BICUL"]
[]
["TOTAL",5394,1878,1318,1693,390,115]
["MONTEVIDEO",4114,1447,890,1347,331,99]
["RESTO DEL PAÍS",1280,431,428,346,59,16]
["Artigas",0,0,0,0,0,0]
["Canelones",422,148,121,127,26,0]
["Cerro Largo",28,0,15,13,0,0]
["Colonia",0,0,0,0,0,0]
["Durazno",35,9,14,12,0,0]
["Flores",19,6,9,4,0,0]
["Florida",30,11,9,10,0,0]
["Lavalleja",32,15,17,0,0,0]
["Maldonado",471,154,140,128,33,16]
["Paysandú",105,44,39,22,0,0]
["Río Negro",6,3,3,0,0,0]
["Rivera",29,8,16,5,0,0]
["Rocha",0,0,0,0,0,0]
["Salto ",9,0,9,0,0,0]
["San José",33,14,9,10,0,0]
["Soriano",0,0,0,0,0,0]
["Tacuarembó",61,19,27,15,0,0]
["Treinta y Tres",0,0,0,0,0,0]
["Fuente: DE — CES"]
["Nota:   Otros (*) Corresponde a los cursos de Bachillerato Internacional y"]
["        Bachillerato Bicultural"]

{"sheet":"II_4_2_9","index":191,"n_rows":31,"n_cols":31,"rows_kept":31,"cut":false,"hidden":false,"merged":[[0,7,1,7],[0,16,1,18],[0,29,1,31],[6,0,10,0],[6,1,10,1],[6,2,6,18],[6,20,10,20],[6,21,10,21],[6,22,6,30],[7,2,7,7],[9,22,10,22],[7,8,7,18],[7,22,8,28],[7,30,8,30],[8,2,10,2],[8,3,10,3],[8,4,10,4],[8,5,10,5],[8,6,10,6],[8,7,10,7],[8,8,9,9],[8,10,9,11],[8,12,9,13],[8,14,9,14],[8,15,9,16],[8,17,9,18],[9,29,10,29],[9,30,10,30],[9,23,10,23],[9,24,10,24],[9,25,10,25],[9,26,10,26],[9,27,10,27],[9,28,10,28]]}
["CONSEJO DE EDUCACIÓN SECUNDARIA",null,null,null,null,null,null,null,null,null,null,null,null,null,null,null,"ALUMNOS MATRICULADOS",null,null,null,"CONSEJO DE EDUCACIÓN SECUNDARIA",null,null,null,null,null,null,null,null,"ALUMNOS MATRICULADOS"]
[]
["Cuadro Nº II-4.2.9",null,null,null,null,null,null,null,null,null,null,null,null,null,null,null,null,null,null,null,"Cuadro Nº II-429 (continuación)"]
[]
["ALUMNOS MATRICULADOS EN EL CES EN SEXTO GRADO DE BACHILLERATO POR OPCIÓN Y PLAN SEGÚN GRANDES ÁREAS Y FORMA DE ADMINISTRACIÓN AÑO 2011",null,null,null,null,null,null,null,null,null,null,null,null,null,null,null,null,null,null,null,"ALUMNOS MATRICULADOS DE SEXTO GRADO DE BACHILLERATO POR OPCIÓN Y PLAN SEGÚN GRANDES ÁREAS Y FORMA DE ADMINISTRACIÓN AÑO 2011"]
[]
["GRANDES ÁREAS Y FORMA DE ADMINISTRACIÓN","Total todos los planes","SEXTO GRADO DE EDUCACIÓN MEDIA GENERAL",null,null,null,null,null,null,null,null,null,null,null,null,null,null,null,null,null,"GRANDES ÁREAS Y FORMA DE ADMINISTRACIÓN","TOTAL","SEXTO GRADO"]
[null,null,"O P C I Ó N     P L A N E S    / 76 ",null,null,null,null,null,"O P C I Ó N     P L A N    / 94",null,null,null,null,null,null,null,null,null,null,null,null,null,"O P C I Ó N     P L A N    / R E F O R  M  U L A C I Ó N  2006",null,null,null,null,null,null,null,"OTROS (*)"]
[null,null,"Derecho","Economía","Agronomía","Medicina","Arquitectura","Ingeniería","3º DER",null,"3º ECO",null,"3º AGR",null,"3º MED","3º ARQ",null,"3º ING"]
[null,null,null,null,null,null,null,null,null,null,null,null,null,null,null,null,null,null,null,null,null,null,"SH","SE","CA","CB","FM","MD","AE","TotPlanes Privados","BINT y/o BICUL"]
[null,null,null,null,null,null,null,null,"ANUAL","1ºSemestre","ANUAL","1ºSemestre","ANUAL","1ºSemestre","ANUAL","ANUAL","1ºSemestre","ANUAL","1ºSemestre"]
["TOTAL",33315,903,85,19,600,30,94,3148,1650,377,138,131,0,2624,165,109,527,140,null,"TOTAL",21758,5834,1882,624,5263,1815,737,892,4611,100]
["EDUCACIÓN MEDIA SUPERIOR PÚBLICA",28604,903,85,19,600,30,94,3148,1650,377,138,131,0,2624,165,109,527,140,null,"EDUCACIÓN MEDIA SUPERIOR PÚBLICA",17047,5834,1882,624,5263,1815,737,892,0,0]
["  Diurna",17019,0,0,0,0,0,0,8,0,0,0,0,0,0,0,0,0,0,null,"  Diurna",17011,5834,1882,624,5263,1815,737,856,0,0]
["  Cuarto Turno",11585,903,85,19,600,30,94,3140,1650,377,138,131,0,2624,165,109,527,140,null,"  Cuarto Turno",36,0,0,0,0,0,0,36,0,0]
["EDUCACIÓN MEDIA SUPERIOR PRIVADA",4711,0,0,0,0,0,0,0,0,0,0,0,0,0,0,0,0,0,null,"EDUCACIÓN MEDIA SUPERIOR PRIVADA",4711,0,0,0,0,0,0,0,4611,100]
["TOTAL MONTEVIDEO",14861,485,61,19,320,30,77,873,1315,237,138,35,0,884,121,109,311,140,null,"TOTAL MONTEVIDEO",8995,1705,716,91,1453,611,257,381,3692,89]
["EDUCACIÓN MEDIA SUPERIOR PÚBLICA",11080,485,61,19,320,30,77,873,1315,237,138,35,0,884,121,109,311,140,null,"EDUCACIÓN MEDIA SUPERIOR PÚBLICA",5214,1705,716,91,1453,611,257,381,0,0]
["  Diurna",5186,0,0,0,0,0,0,8,0,0,0,0,0,0,0,0,0,0,null,"  Diurna",5178,1705,716,91,1453,611,257,345,0,0]
["  Cuarto Turno",5894,485,61,19,320,30,77,865,1315,237,138,35,0,884,121,109,311,140,null,"  Cuarto Turno",36,0,0,0,0,0,0,36,0,0]
["EDUCACIÓN MEDIA SUPERIOR PRIVADA",3781,0,0,0,0,0,0,0,0,0,0,0,0,0,0,0,0,0,null,"EDUCACIÓN MEDIA SUPERIOR PRIVADA",3781,0,0,0,0,0,0,0,3692,89]
["RESTO DEL PAÍS",18454,418,24,0,280,0,17,2275,335,140,0,96,0,1740,44,0,216,0,null,"RESTO DEL PAÍS",12763,4129,1166,533,3810,1204,480,511,919,11]
["EDUCACIÓN MEDIA SUPERIOR PÚBLICA",17524,418,24,0,280,0,17,2275,335,140,0,96,0,1740,44,0,216,0,null,"EDUCACIÓN MEDIA SUPERIOR PÚBLICA",11833,4129,1166,533,3810,1204,480,511,0,0]
["  Diurna",11833,0,0,0,0,0,0,0,0,0,0,0,0,0,0,0,0,0,null,"  Diurna",11833,4129,1166,533,3810,1204,480,511,0,0]
["Cuaro Turno",5691,418,24,0,280,0,17,2275,335,140,0,96,0,1740,44,0,216,0,null,"Cuarto Turno",0,0,0,0,0,0,0,0,0,0]
["EDUCACIÓN MEDIA SUPERIOR PRIVADA",930,0,0,0,0,0,0,0,0,0,0,0,0,0,0,0,0,0,null,"EDUCACIÓN MEDIA SUPERIOR PRIVADA",930,null,0,0,0,0,0,0,919,11]
[]
["Fuente: DE — CES",null,null,null,null,null,null,null,null,null,null,null,null,null,null,null,null,null,null,null,"Fuente: DE — CES",null,null,null,0]
["Nota:   La referencia \"Privada\" (incluye los Habilitados \"Liceo Naval\" y \"Liceo Militar\"), se corresponde con la de \"Liceos Habilitados\"",null,null,null,null,null,null,null,null,null,null,null,null,null,null,null,null,null,null,null,"Nota:   OTROS (*) Corresponde a los cursos de Bachillerato Internacional y Bachillerato Bicultural"]
["        presente en ediciones anteriores del Anuario Estadístico del MEC",null,null,null,null,null,null,null,null,null,null,null,null,null,null,null,null,null,null,null,"        La referencia \"Privada\" (incluye los Habilitados \"Liceo Naval\" y \"Liceo Militar\"), se corresponde con la de \"Liceos Habilitados\""]
[null,null,null,null,null,null,null,null,null,null,null,null,null,null,null,null,null,null,null,null,"        presente en ediciones anteriores del Anuario Estadístico del MEC"]

{"sheet":"II_4_2_10","index":192,"n_rows":33,"n_cols":31,"rows_kept":33,"cut":false,"hidden":false,"merged":[[0,7,1,9],[0,27,1,28],[4,22,4,30],[5,2,5,19],[5,22,10,22],[5,23,10,23],[5,24,5,30],[8,6,10,6],[8,7,10,7],[8,8,8,9],[6,24,7,30],[8,2,10,2],[8,3,10,3],[8,4,10,4],[8,5,10,5],[8,30,10,30],[6,0,10,0],[6,1,10,1],[6,2,7,7],[6,8,7,19],[6,21,7,21],[8,10,8,11],[8,12,8,13],[8,14,8,15],[8,16,8,17],[8,18,8,19],[9,8,10,8],[9,9,10,9],[9,10,10,10],[9,11,10,11],[9,12,10,12],[9,13,10,13],[8,24,10,24],[9,14,10,14],[9,15,10,15],[9,16,10,16],[9,17,10,17],[9,18,10,18],[9,19,10,19],[8,25,10,25],[8,26,10,26],[8,27,10,27],[8,28,10,28],[8,29,10,29]]}
["CONSEJO DE EDUCACIÓN SECUNDARIA",null,null,null,null,null,null,"ALUMNOS MATRICULADOS",null,null,null,null,null,null,null,null,null,null,null,null,null,null,"CONSEJO DE EDUCACIÓN SECUNDARIA",null,null,null,null,"ALUMNOS MATRICULADOS"]
[]
["Cuadro Nº II-4.2.10",null,null,null,null,null,null,null,null,null,null,null,null,null,null,null,null,null,null,null,null,null,"Cuadro Nº II-4210 (continuación)"]
[]
["ALUMNOS MATRICULADOS EN EL CES EN SEXTO GRADO DE EDUCACIÓN MEDIA GENERAL PÚBLICA POR PLAN Y OPCIÓN SEGÚN DEPARTAMENTO AÑO 2011",null,null,null,null,null,null,null,null,null,null,null,null,null,null,null,null,null,null,null,null,null,"ALUMNOS MATRICULADOS EN EL CES EN SEXTO GRADO DE EDUCACIÓN MEDIA PÚBLICA POR PLAN Y OPCIÓN SEGÚN DEPARTAMENTO AÑO 2011"]
[null,null,null,null,null,null,null,null,null,null,null,null,null,null,null,null,null,null,null,null,null,null,"DEPARTAMENTO","Total","SEXTO GRADO"]
["DEPARTAMENTO","TOTAL","O P C I Ó N      P L A N  /76 ",null,null,null,null,null,"O P C I Ó N   P L A N /  94",null,null,null,null,null,null,null,null,null,null,null,null,null,null,null,"O P C I Ó N      P L A N  / R E F O R M U L A C I Ó N  2006"]
[]
[null,null,"Derecho","Economía","Agronomía","Medicina","Arquitectura","Ingeniería","3º DER",null,"3º ECO",null,"3º AGR",null,"3º MED",null,"3º ARQ",null,"3º ING",null,null,null,null,null,"SH","SE","CA","CB","FM","MD","AE"]
[null,null,null,null,null,null,null,null,"ANUAL","1ºSemestre","ANUAL","1ºSemestre","ANUAL","1ºSemestre","ANUAL","1ºSemestre","ANUAL","1ºSemestre","ANUAL","1ºSemestre"]
[]
["TOTAL",28604,903,85,19,600,30,94,3148,1650,377,138,131,0,2624,817,165,109,527,140,null,null,"TOTAL",{"$f":"+Y12+Z12+AA12+AB12+AC12+AD12+AE12","v":17047},5834,1882,624,5263,1815,737,892]
["MONTEVIDEO",11080,485,61,19,320,30,77,873,1315,237,138,35,0,884,711,121,109,311,140,null,null,"MONTEVIDEO",{"$f":"+Y13+Z13+AA13+AB13+AC13+AD13+AE13","v":5214},1705,716,91,1453,611,257,381]
["RESTO DEL PAÍS",17524,418,24,0,280,0,17,2275,335,140,0,96,0,1740,106,44,0,216,0,null,null,"RESTO DEL PAÍS",11833,4129,1166,533,3810,1204,480,511]
["Artigas",779,0,0,0,0,0,0,58,87,0,0,0,0,87,0,0,0,0,0,null,null,"Artigas",547,215,40,0,204,62,14,12]
["Canelones",4298,57,0,0,11,0,17,780,54,82,0,28,0,456,0,20,0,97,0,null,null,"Canelones",2696,910,337,94,745,343,132,135]
["Cerro Largo",808,102,0,0,82,0,0,36,0,0,0,0,0,17,0,0,0,11,0,null,null,"Cerro Largo",560,195,45,43,187,47,20,23]
["Colonia",1230,0,0,0,0,0,0,254,0,10,0,0,0,220,0,0,0,0,0,null,null,"Colonia",746,184,110,57,206,93,52,44]
["Durazno",548,0,0,0,0,0,0,99,0,0,0,0,0,72,0,0,0,0,0,null,null,"Durazno",377,150,44,19,108,36,7,13]
["Flores",262,0,0,0,0,0,0,41,0,0,0,0,0,47,0,0,0,0,0,null,null,"Flores",174,49,11,10,66,26,6,6]
["Florida",589,68,0,0,51,0,0,40,0,0,0,0,0,32,0,0,0,0,0,null,null,"Florida",398,162,24,5,132,46,20,9]
["Lavalleja",509,50,0,0,17,0,0,0,0,0,0,0,0,0,0,0,0,0,0,null,null,"Lavalleja",442,184,41,10,160,27,10,10]
["Maldonado",1307,99,24,0,79,0,0,106,0,14,0,0,0,70,0,14,0,13,0,null,null,"Maldonado",888,313,86,22,250,87,62,68]
["Paysandú",871,0,0,0,0,0,0,0,86,13,0,22,0,112,0,0,0,22,0,null,null,"Paysandú",616,217,55,37,231,33,22,21]
["Río Negro",477,0,0,0,0,0,0,115,0,5,0,16,0,58,0,0,0,0,0,null,null,"Río Negro",283,98,14,14,98,36,8,15]
["Rivera",1088,0,0,0,0,0,0,44,108,0,0,0,0,0,106,0,0,34,0,null,null,"Rivera",796,321,67,52,238,75,11,32]
["Rocha",640,42,0,0,40,0,0,28,0,0,0,0,0,35,0,0,0,0,0,null,null,"Rocha",495,170,43,27,180,35,22,18]
["Salto ",1235,0,0,0,0,0,0,146,0,0,0,18,0,148,0,10,0,30,0,null,null,"Salto ",883,307,73,28,365,64,25,21]
["San José",856,0,0,0,0,0,0,164,0,0,0,0,0,169,0,0,0,0,0,null,null,"San José",523,152,59,18,191,65,18,20]
["Soriano",779,0,0,0,0,0,0,167,0,16,0,7,0,87,0,0,0,9,0,null,null,"Soriano",493,148,52,39,158,43,25,28]
["Tacuarembó",821,0,0,0,0,0,0,111,0,0,0,5,0,79,0,0,0,0,0,null,null,"Tacuarembó",626,236,56,31,198,61,18,26]
["Treinta y Tres",427,0,0,0,0,0,0,86,0,0,0,0,0,51,0,0,0,0,0,null,null,"Treinta y Tres",290,118,9,27,93,25,8,10]
["Fuente: DE — CES",null,null,null,null,null,null,null,null,null,null,null,null,null,null,null,null,null,null,null,null,null,"Fuente: DE — CES"]

{"sheet":"II-4.2.11 ","index":193,"n_rows":31,"n_cols":10,"rows_kept":31,"cut":false,"hidden":false,"merged":[[30,0,30,5],[31,0,31,5],[0,3,1,3],[0,4,1,5],[4,0,4,9],[5,0,6,0],[5,1,6,1],[5,2,5,8]]}
["CONSEJO DE EDUCACIÓN SECUNDARIA",null,null,null,"ALUMNOS MATRICULADOS"]
[]
["Cuadro Nº II-4.2.11"]
[]
["ALUMNOS MATRICULADOS EN EL CES EN SEXTO GRADO DE EDUCACIÓN MEDIA GENERAL PRIVADA POR OPCIÓN SEGÚN DEPARTAMENTO. AÑO 2011"]
["DEPARTAMENTO","TOTAL"," TODOS LOS PLANES OPCIÓN SEXTO GRADO",null,null,null,null,null,null,"Otros (*)"]
[null,null,"Social Humanístico","Social Economía","Ciencias Agrarias","Ciencias Biológicas","Física Matemática","Matemática Diseño","Arte y Expresión","B.INT.y/o BICUL."]
["TOTAL",4711,1114,908,153,920,742,492,282,100]
["MONTEVIDEO",3781,875,789,95,679,618,388,248,89]
["RESTO DEL PAÍS",930,239,119,58,241,124,104,34,11]
["Artigas",0,0,0,0,0,0,0,0,0]
["Canelones",316,82,46,18,87,56,15,12,0]
["Cerro Largo",0,0,0,0,0,0,0,0,0]
["Colonia",0,0,0,0,0,0,0,0,0]
["Durazno",0,0,0,0,0,0,0,0,0]
["Flores",0,0,0,0,0,0,0,0,0]
["Florida",30,10,0,0,9,0,11,0,0]
["Lavalleja",0,0,0,0,0,0,0,0,0]
["Maldonado",421,124,50,8,94,54,58,22,11]
["Paysandú",65,12,12,10,13,11,7,0,0]
["Río Negro",0,0,0,0,0,0,0,0,0]
["Rivera",18,0,0,9,9,0,0,0,0]
["Rocha",0,0,0,0,0,0,0,0,0]
["Salto ",14,0,0,0,14,0,0,0,0]
["San José",24,0,0,5,10,0,9,0,0]
["Soriano",0,0,0,0,0,0,0,0,0]
["Tacuarembó",42,11,11,8,5,3,4,0,0]
["Treinta y Tres",0,0,0,0,0,0,0,0,0]
[]
["Fuente D.E - CES"]
["Nota: Otros (*) Corresponde a los cursosa de Bachillerato Internacional y Bachillerato Bicultural. "]

{"sheet":"II-4.3.1 ","index":194,"n_rows":48,"n_cols":7,"rows_kept":48,"cut":false,"hidden":false,"merged":[[0,5,1,6],[0,7,1,7],[4,0,4,6],[6,0,7,0],[6,1,7,1],[6,2,6,3],[6,4,7,4],[6,5,6,6]]}
["CONSEJO DE EDUCACIÓN SECUNDARIA",null,null,null,null,"PERSONAL DOCENTE"]
[]
["Cuadro Nº II-431"]
[]
["PERSONAL DOCENTE Y HORAS DOCENTES DEL CES EN EDUCACIÓN MEDIA SUPERIOR GENERAL PÚBLICA POR CONDICÓN DE TITULACIÓN AÑO 2011"]
[]
["ASIGNATURAS","TOTAL DOCENTES","PERSONAL DOCENTE",null,"TOTAL HORAS ","HORAS DOCENTES"]
[null,null,"Titulados","No Titulados",null,"Titulados","No Titulados"]
["TOTAL",{"$f":"SUM(C9:D9)","v":7214},{"$f":"SUM(C10:C46)","v":4726},{"$f":"SUM(D10:D46)","v":2488},{"$f":"SUM(F9:G9)","v":87131},{"$f":"SUM(F10:F46)","v":60426},{"$f":"SUM(G10:G46)","v":26705}]
["ASTRONOMIA",{"$f":"+C10+D10","v":28},6,22,{"$f":"+F10+G10","v":208},77,131]
["BIOLOGIA",{"$f":"+C11+D11","v":608},514,94,{"$f":"+F11+G11","v":7277},6171,1106]
["CONTABILIDAD",159,18,141,1269,138,1131]
["DIBUJO",333,173,160,2967,1831,1136]
["EDUCACION FISICA",174,150,24,1325,1184,141]
["EDUCACION MUSICAL",63,23,40,535,205,330]
["ED Y CIVICA -DERECHO-",611,515,96,7021,6121,900]
["FILOSOFIA",533,381,152,6332,5024,1308]
["FISICA",489,296,193,7539,4785,2754]
["FRANCES",7,6,1,123,103,20]
["GEOGRAFIA",199,158,41,1539,1238,301]
["HISTORIA",608,540,68,7150,6437,713]
["IDIOMA ESPAÑOL",14,9,5,220,153,67]
["INGLES",532,200,332,6632,3016,3616]
["ITALIANO",75,21,54,846,274,572]
["LITERATURA",583,485,98,6857,5954,903]
["FISICO - QUIMICA",11,5,6,142,76,66]
["MATEMATICA",1007,496,511,17026,9601,7425]
["QUIMICA",488,352,136,7562,5722,1840]
["RECNATURY PAISAJE AGRARIA",44,31,13,118,68,50]
["GEOLOGIA",14,5,9,64,30,34]
["DIRECTOR DE COROS",16,8,8,132,58,74]
["PIANISTA ACOMPA･ANTE",12,2,10,82,12,70]
["INFORMATICA",85,27,58,872,356,516]
["LENGCOMUY MEDIOS AUDIOVISUAL",32,12,20,160,42,118]
["ESTUDIOS ECONOMICOS Y SOCIALES",215,184,31,1306,1124,182]
["LABORATORIO INFORMATICA EDUCAT",18,7,11,179,61,118]
["MANUALIDADES",0,0,0,0,0,0]
["LENGUA ALEMAN",0,0,0,0,0,0]
["TEATRO",34,9,25,211,48,163]
["LENGUAS PORTUGUES",5,1,4,65,10,55]
["EXPRESION CORPORAL Y TEATRO",46,13,33,219,59,160]
["EXPRESION CORPORAL Y DANZA",28,3,25,192,16,176]
["ACTADAPTADAS AL MEDIO AMBIENT",2,0,2,15,0,15]
["ECONOMIA",132,76,56,854,432,422]
["ESPACIO CURRICULAR ABIERTO",8,0,8,64,0,64]
["LENGUA DE SE･AS",1,0,1,28,0,28]
["Fuente: Departamento de Computación - División Hacienda — CES"]
["Nota: Los docentes que dictan más de una asignatura son considerados como personas distintas en cada asignatura"]

{"sheet":"II-4.3.2","index":195,"n_rows":16,"n_cols":3,"rows_kept":16,"cut":false,"hidden":false,"merged":[[0,0,0,1],[0,2,1,3],[0,7,1,7],[4,0,4,3],[5,0,6,0],[5,1,6,1]]}
["CONSEJO DE EDUCACIÓN TÉCNICO PROFESIONAL (U.T.U.)",null,"PERSONAL DOCENTE"]
[]
["Cuadro Nº II-4.3.2"]
[]
["PERSONAL DOCENTE DEL CETP EN EDUCACIÓN MEDIA SUPERIOR TECNOLÓGICA POR TIPO DE CURSO. AÑO 2011."]
["EDUCACIÓN MEDIA SUPERIOR TECNOLÓGICA","TOTAL"]
[]
["TOTAL",{"$f":"SUM(B9:B14)","v":6814}]
["Bachillerato Figari",88]
["Bachillerato Profesional",737]
["Educación Media Profesional",2517]
["Educación Media Tecnológica",3267]
["Curso de Articulación",116]
["Curso Técnico",89]
["Fuente: U.T.U. División Informática."]
["Los cursos EMP Especialización, fueron reubicados en el  Nivel Superior de Formación Profesional.  "]

{"sheet":"II-4.4.1","index":196,"n_rows":28,"n_cols":3,"rows_kept":28,"cut":false,"hidden":false,"merged":[[0,2,1,3],[0,7,1,7],[4,0,4,2],[5,0,6,0],[23,0,23,2]]}
["CONSEJO DE EDUCACIÓN SECUNDARIA",null,"GRUPOS"]
[]
["Cuadro Nº II-4.4.1"]
[]
["GRUPOS DE EDUCACIÓN MEDIA SUPERIOR GENERAL COMPARADOS CON EL TOTAL DE AMBOS CICLOS SEGÚN GRANDES ÁREAS Y FORMA DE ADMINISTRACIÓN AÑO 2011"]
[null,"FORMA DE ADMINISTRACIÓN"]
[null,"Grupos en Educación Media Superior General","Total de Grupos en Educación Media Superior General"]
["TOTAL DEL PAÍS",4230,9532]
["EDUCACIÓN MEDIA SUPERIOR PÚBLICA",3067,7332]
["  Diurna",2451,6345]
["  Nocturna",616,987]
["EDUCACIÓN MEDIA SUPERIOR PRIVADA",1163,2200]
["TOTAL MONTEVIDEO",1682,3624]
["EDUCACIÓN MEDIA SUPERIOR PÚBLICA",869,2164]
["  Diurna",634,1799]
["  Nocturna",235,365]
["EDUCACIÓN MEDIA SUPERIOR PRIVADA",813,1460]
["TOTAL RESTO DEL PAÍS",2548,5908]
["EDUCACIÓN MEDIA SUPERIOR PÚBLICA",2198,5168]
["  Diurna",1817,4546]
["  Nocturna",381,622]
["EDUCACIÓN MEDIA SUPERIOR PRIVADA",350,740]
["Fuente: DE — CES"]
["Nota: El “Total de ambos Ciclos” presenta de manera agregada la cantidad  total de grupos con que cuente Educación Secundaria y es el resultado de adicionar al total de Grupos del presente cuadro (Ciclo Superior de Educación Secundaria), el total de los grupos presentados en el Cuadro II-341 (Ciclo Básico de Educación Secundaria)"]
["       "]
["        "]
["        "]
["        "]

{"sheet":"TERCIERIA NO UNIVERSITARIA ","index":197,"n_rows":0,"n_cols":0,"rows_kept":0,"cut":false,"hidden":false,"merged":[[20,0,20,4],[10,0,10,4],[12,0,12,4],[14,0,14,4],[16,0,16,4],[18,0,18,4],[34,0,34,4],[36,0,36,4],[22,0,22,4],[24,0,24,4],[26,0,26,4],[28,0,28,4],[30,0,30,4],[32,0,32,4]]}

{"sheet":"II-5.1.1  ","index":198,"n_rows":110,"n_cols":5,"rows_kept":110,"cut":false,"hidden":false,"merged":[[0,3,1,4],[4,0,4,4],[5,0,9,0],[5,1,9,1],[5,2,5,3],[5,4,9,4],[6,2,7,3],[8,2,9,2],[8,3,9,3],[110,0,112,4],[114,0,115,5],[57,3,58,4],[61,0,61,4],[62,0,66,0],[62,1,66,1],[62,2,62,3],[62,4,66,4],[63,2,64,3],[65,2,66,2],[65,3,66,3]]}
["OFERTA TERCIARIA NO UNIVERSITARIA",null,null,"INSTITUCIONES"]
[]
["Cuadro Nº II-5.1.1"]
[]
["MATRÍCULA Y PERSONAL DOCENTE POR SEXO SEGÚN GRANDES ÁREAS, DEPARTAMENTOS E INSTITUCIONES. AÑO 2011."]
["GRANDES ÁREAS / DEPARTAMENTO / INSTITUCIÓN","TOTAL","MATRICULA",null,"DOCENTES"]
[null,null,"SEXO"]
[]
[null,null,"M","F"]
[]
["TOTAL",{"$f":"+B13+B27","v":27857},"-","-",{"$f":"+E13+E27","v":3193}]
[]
["MONTEVIDEO",{"$f":"SUM(B15:B25)","v":14218},"-","-",{"$f":"SUM(E15:E25)","v":1395}]
[]
["IINN",2228,"-","-",217]
["IPA ",6121,"-","-",557]
["INET",758,"-","-",110]
["ESCUELA NAVAL",{"$f":"C18+D18","v":58},47,11,127]
["ESCUELA NACIONAL DE POLICÍA",{"$f":"C19+D19","v":242},195,47,109]
["ESCUELA MILITAR",122,108,14,99]
["ESCUELA MILITAR DE AERONÁUTICA",48,40,8,92]
["EMAD",89,23,66,36]
["INAU",230,33,197,19]
["CIEP",93,0,93,29]
["UTU",{"$f":"+C25+D25","v":4229},2554,1675,"s/d"]
[]
["RESTO DEL PAÍS",{"$f":"+B29+B32+B36+B38+B42+B45+B48+B52+B68+B72+B75+B78+B82+B85+B89+B91+B94+B97","v":13639},"-","-",{"$f":"+E29+E32+E36+E38+E42+E45+E48+E52+E68+E72+E75+E78+E82+E85+E89+E91+E94+E97","v":1798}]
[]
["Artigas",{"$f":"SUM(B30:B31)","v":662},"-","-",{"$f":"+E30+E31","v":72}]
["  IFD",540,"-","-",72]
["  UTU",{"$f":"+C31+D31","v":122},74,48,"s/d"]
["Canelones",{"$f":"SUM(B33:B35)","v":2092},"-","-",{"$f":"E33+E34+E35","v":338}]
["  IFD ",1363,"-","-",210]
["  CERP",500,"-","-",128]
["  UTU",{"$f":"+C35+D35","v":229},103,126,"s/d"]
["Cerro Largo - IFD",450,"-","-",66]
["  UTU",{"$f":"+C37+D37","v":112},58,54,"s/d"]
["Colonia",{"$f":"SUM(B39:B41)","v":1245},"-","-",{"$f":"SUM(E39:E41)","v":186}]
["  IFD",558,"-","-",71]
["  CERP",405,"-","-",115]
["  UTU",{"$f":"+C41+D41","v":282},131,151,"s/d"]
["Durazno",{"$f":"B43+B44","v":597},"-","-",{"$f":"E43+E44","v":49}]
["  IFD ",523,"-","-",49]
["  UTU",{"$f":"+C44+D44","v":74},29,45,"s/d"]
["Flores",{"$f":"SUM(B46:B47)","v":289},{"$f":"SUM(C46:C47)","v":100},{"$f":"SUM(D46:D47)","v":51},{"$f":"E46+E47","v":32}]
["  IFD",138,"-","-",32]
["  UTU",{"$f":"+C47+D47","v":151},100,51,"s/d"]
["Florida",{"$f":"SUM(B49:B51)","v":685},{"$f":"SUM(C49:C51)","v":63},{"$f":"SUM(D49:D51)","v":49},{"$f":"E49+E50","v":157}]
["  IFD",264,"-","-",54]
["  CERP",309,"-","-",103]
["  UTU",{"$f":"+C51+D51","v":112},63,49,"s/d"]
["Lavalleja",{"$f":"SUM(B53:B54)","v":273},{"$f":"+C53+C54","v":11},{"$f":"+D53+D54","v":7},{"$f":"E53+E54","v":48}]
["  IFD",255,"-","-",48]
["  UTU",{"$f":"+C54+D54","v":18},11,7,"s/d"]
[null,null,null,null,"(Continúa)"]
[]
[]
["OFERTA TERCIARIA NO UNIVERSITARIA",null,null,"INSTITUCIONES"]
[]
["Cuadro Nº II-5.1.1 (continuación)"]
[]
["MATRÍCULA Y PERSONAL DOCENTE POR SEXO SEGÚN GRANDES ÁREAS, DEPARTAMENTOS E INSTITUCIONES. AÑO 2011."]
["GRANDES ÁREAS / DEPARTAMENTO / INSTITUCIÓN","TOTAL","MATRICULA",null,"DOCENTES"]
[null,null,"SEXO"]
[]
[null,null,"M","F"]
[]
["Maldonado ",{"$f":"SUM(B69:B71)","v":866},"-","-",{"$f":"E69+E70+E71","v":149}]
["  IFD ",202,"-","-",46]
["  CERP ",506,"-","-",103]
["  UTU",{"$f":"+C71+D71","v":158},96,62,"s/d"]
["Paysandú",{"$f":"SUM(B73:B74)","v":1126},{"$f":"SUM(C73:C74)","v":251},{"$f":"SUM(D73:D74)","v":94},{"$f":"E73+E74","v":83}]
["  IFD",781,"-","-",83]
["  UTU",{"$f":"+C74+D74","v":345},251,94,"s/d"]
["Río Negro",{"$f":"SUM(B76:B77)","v":507},{"$f":"SUM(C76:C77)","v":22},{"$f":"SUM(D76:D77)","v":47},{"$f":"E76+E77","v":32}]
["  IFD",438,"-","-",32]
["  UTU",{"$f":"+C77+D77","v":69},22,47,"s/d"]
["Rivera",{"$f":"SUM(B79:B81)","v":1289},{"$f":"SUM(C79:C81)","v":127},{"$f":"SUM(D79:D81)","v":113},{"$f":"+E79+E80+E81","v":164}]
["  IFD",412,"-","-",71]
["  CERP ",637,"-","-",93]
["  UTU",{"$f":"+C81+D81","v":240},127,113,"s/d"]
["Rocha",{"$f":"SUM(B84:B84)","v":40},{"$f":"SUM(C84:C84)","v":21},{"$f":"SUM(D84:D84)","v":19},{"$f":"E84","v":0}]
["  IFD",233,"-","-",43]
["  UTU",{"$f":"+C84+D84","v":40},21,19]
["Salto",{"$f":"SUM(B86:B88)","v":1543},{"$f":"SUM(C86:C88)","v":199},{"$f":"SUM(D86:D88)","v":76},{"$f":"E86+E87+E88","v":190}]
["  IFD ",465,"-","-",66]
["  CERP",803,"-","-",124]
["  UTU",{"$f":"+C88+D88","v":275},199,76,"s/d"]
["San José",268,"-","-",48]
["  UTU",{"$f":"+C90+D90","v":43},18,25,"s/d"]
["Soriano",{"$f":"SUM(B92:B93)","v":408},{"$f":"SUM(C92:C93)","v":95},{"$f":"SUM(D92:D93)","v":79},{"$f":"E92+E93","v":45}]
["  IFD ",234,"-","-",45]
["  UTU",{"$f":"+C93+D93","v":174},95,79,"s/d"]
["Tacuarembó",{"$f":"SUM(B95:B96)","v":740},{"$f":"SUM(C95:C96)","v":45},{"$f":"SUM(D95:D96)","v":31},{"$f":"E95+E96","v":77}]
["  IFD ",664,"-","-",77]
["  UTU",{"$f":"+C96+D96","v":76},45,31,"s/d"]
["Treinta y Tres",{"$f":"SUM(B98:B99)","v":559},"-","-",62]
["  IFD ",528,"-","-",66]
["  UTU",{"$f":"+C99+D99","v":31},11,20,"s/d"]
["Fuente: Informática - D.F.P.D. "]
["        Gestión Educativa - Escuela Naval. "]
["        Jefatura de Estudios - Escuela Nacional de Policía. "]
["        Escuela Militar."]
["        Departamento de Bedelía - Escuela Militar de Aeronáutica. "]
["        Secretaría General - E.M.A.D. "]
["        CEN.FOR.ES - I.N.A.U. "]
["        C.D.I"]
["        C.I.E.P"]
["        Secretaría General - CALEN. "]
["        D.E. - U.T.U"]

{"sheet":"II-5.2.1 ","index":199,"n_rows":53,"n_cols":11,"rows_kept":53,"cut":false,"hidden":false,"merged":[[8,10,9,10],[0,8,1,11],[4,0,4,9],[5,0,9,1],[5,2,7,4],[5,5,5,10],[6,5,7,7],[6,8,7,10],[8,2,9,2],[8,3,9,3],[8,4,9,4],[52,0,52,9],[53,0,53,9],[8,5,9,5],[8,6,9,6],[8,7,9,7],[8,8,9,8],[8,9,9,9]]}
["DIRECCIÓN DE FORMACIÓN Y PERFECCIONAMIENTO DOCENTE",null,null,null,null,null,null,null,"ALUMNOS MATRICULADOS"]
[]
["Cuadro Nº II-5.2.1"]
[]
["ALUMNOS INGRESADOS Y MATRICULADOS EN FORMACIÓN DOCENTE POR CARRERA SEGÚN DEPARTAMENTO Y ESTABLECIMIENTO. AÑO 2011."]
["DEPARTAMENTO / ESTABLECIMIENTO",null,"TOTAL",null,null,"CARRERA"]
[null,null,null,null,null,"Magisterio",null,null,"Profesorado"]
[]
[null,null,"Ingr.","Matr.","Egr.","Ingr.","Matr.","Egr.","Ingr.","Matr.","Egr."]
[]
["TOTAL",null,{"$f":"+C13+C17","v":8304},{"$f":"+D13+D17","v":20583},{"$f":"E13+E17","v":1286},{"$f":"+F13+F17","v":0},{"$f":"+G13+G17","v":6373},{"$f":"H13+H17","v":699},{"$f":"+I13+I17","v":0},{"$f":"+J13+J17","v":14210},{"$f":"K13+K17","v":587}]
[]
["MONTEVIDEO",null,3760,{"$f":"SUM(D14:D16)","v":9107},472,0,2228,187,0,{"$f":"SUM(J14:J16)","v":6879},285]
["                IINN",null,{"$f":"F14+I14","v":0},2228,187,"S/D",2228,187,"N/C","N/C",0]
["                IPA ",null,0,6121,267,"N/C","N/C",0,"S/D",6121,267]
["                INET ",null,0,758,18,"N/C","N/C",0,"S/D",758,18]
["RESTO DEL PAÍS",null,{"$f":"SUM(C18:C51)","v":4544},{"$f":"G17+J17","v":11476},814,{"$f":"F18+F19+F25+F26+F31+F30+F32+F35+F36+F39+F40+F41+F44+F45+F48+F49+F50+F51","v":0},{"$f":"G18+G19+G25+G26+G31+G30+G32+G35+G36+G39+G40+G41+G44+G45+G48+G49+G50+G51","v":4145},{"$f":"H18+H19+H25+H26+H31+H30+H32+H35+H36+H39+H40+H41+H44+H45+H48+H49+H50+H51","v":512},{"$f":"I18+I19+I25+I26+I31+I30+I32+I35+I36+I39+I40+I41+I44+I45+I48+I49+I50+I51","v":0},{"$f":"J18+J19+J25+J26+J31+J30+J32+J35+J36+J39+J40+J41+J44+J45+J48+J49+J50+J51","v":7331},{"$f":"K18+K19+K25+K26+K31+K30+K32+K35+K36+K39+K40+K41+K44+K45+K48+K49+K50+K51","v":302}]
["Artigas         IFD Artigas",null,178,540,43,"S/D",338,41,"S/D",202,2]
["Canelones",null,618,1863,92,"S/D",{"$f":"SUM(G20:G24)","v":710},{"$f":"SUM(H20:H24)","v":41},"S/D",{"$f":"SUM(J20:J24)","v":1153},{"$f":"SUM(K20:K24)","v":51}]
["                IFD Canelones ",null,0,387,14,"S/D",207,10,"S/D",180,4]
["                IFD de la Costa ",null,0,355,16,"S/D",159,0,"S/D",196,16]
["                IFD Pando",null,0,462,24,"S/D",252,22,"S/D",210,2]
["                IFD San Ramón ",null,0,159,10,"S/D",92,9,"S/D",67,1]
["                CERP del Sur",null,0,500,28,"N/C","N/C",0,"S/D",500,28]
["Cerro Largo     IFD Melo",null,346,450,44,"S/D",190,41,"S/D",260,3]
["Colonia",null,269,963,63,"S/D",{"$f":"SUM(G27:G29)","v":181},37,"S/D",782,26]
["                IFD Carmelo",null,0,328,13,"S/D",81,11,"S/D",247,2]
["                IFD Rosario",null,0,230,27,"S/D",100,26,"S/D",130,1]
["                CERP del Suroeste",null,0,405,23,"N/C","N/C",0,"S/D",405,23]
["Durazno         IFD Durazno ",null,207,523,27,"S/D",239,26,"S/D",284,1]
["Flores          IFD Trinidad",null,48,138,6,"S/D",54,6,"S/D",84,0]
["Florida",null,226,573,46,"S/D",{"$f":"SUM(G33:G34)","v":228},{"$f":"SUM(H33:H34)","v":19},"S/D",{"$f":"SUM(J33:J34)","v":345},{"$f":"SUM(K33:K34)","v":27}]
["                IFD Florida",null,0,264,22,"S/D",228,19,"S/D",36,3]
["                CERP del Centro",null,0,309,24,"N/C","N/C",0,"S/D",309,24]
["Lavalleja       IFD Minas",null,115,255,33,"S/D",127,31,"S/D",128,2]
["Maldonado",null,267,708,55,"S/D",{"$f":"SUM(G37:G38)","v":181},24,"S/D",527,31]
["                IFD Maldonado ",null,0,202,24,"S/D",181,24,"S/D",21,0]
["                CERP del Centro ",null,0,506,31,"N/C","N/C",0,"S/D",506,31]
["Paysandú        IFD Paysandú",null,332,781,35,"S/D",243,28,"S/D",538,7]
["Río Negro       IFD Fray Bentos",null,99,438,19,"S/D",155,19,"S/D",283,0]
["Rivera",null,422,1049,99,"S/D",{"$f":"+G42+G43","v":306},32,"S/D",743,67]
["                IFD Rivera",null,0,412,41,"S/D",306,32,"S/D",106,9]
["                CERP del Norte ",null,0,637,58,"N/C","N/C",0,"S/D",637,58]
["Rocha           IFD Rocha",null,132,233,21,"S/D",98,20,"S/D",135,1]
["Salto",null,369,1268,137,"S/D",{"$f":"SUM(G46:G47)","v":406},{"$f":"SUM(H46:H47)","v":59},"S/D",{"$f":"SUM(J46:J47)","v":862},{"$f":"SUM(K46:K47)","v":78}]
["                IFD Salto ",null,0,465,73,"S/D",406,59,"S/D",59,14]
["                CERP del Litoral",null,0,803,64,"N/C","N/C",0,"S/D",803,64]
["San José        IFD San José",null,140,268,6,"S/D",148,6,"S/D",120,0]
["Soriano         IFD Mercedes ",null,137,234,26,"S/D",142,25,"S/D",92,1]
["Tacuarembó      IFD Tacuarembó ",null,290,664,40,"S/D",187,37,"S/D",477,3]
["Treinta y Tres  IFD Treinta y Tres",null,349,528,22,"S/D",212,20,"S/D",316,2]
["Fuente: Informática - DFPD "]
["Nota: No se dispone de datos de ingreso desagregado por Carrera. Por eso se presenta el dato total por Departamento."]

{"sheet":"II-5.2.2 ","index":200,"n_rows":32,"n_cols":10,"rows_kept":32,"cut":false,"hidden":false,"merged":[[7,5,7,6],[7,8,7,9],[0,6,1,9],[4,0,4,9],[6,0,8,0],[6,1,8,1],[6,2,6,3],[6,4,8,4],[6,5,6,6],[6,7,8,7],[6,8,6,9],[7,2,7,3]]}
["OFERTAS TERCIARIAS NO UNIVERSITARIAS DEL ÁREA SEGURIDAD Y DEFENSA",null,null,null,null,null,"ALUMNOS MATRICULADOS"]
[]
["Cuadro Nº II-5.2.2"]
[]
["ALUMNOS INGRESADOS, MATRICULADOS Y EGRESADOS EN NIVEL TERCIARIO NO UNIVERSITARIO DEL ÁREA SEGURIDAD Y DEFENSA POR SEXO SEGÚN INSTITUCIÓN Y CARRERA. AÑO 2011."]
[]
["INSTITUCION / CARRERA","TOTAL","INGRESADOS",null,"TOTAL","MATRICULADOS",null,"TOTAL","EGRESADOS"]
[null,null,"SEXO",null,null,"SEXO",null,null,"SEXO"]
[null,null,"M","F",null,"M","F",null,"M","F"]
["ESCUELA NAVAL",{"$f":"SUM(B11:B16)","v":39},32,7,58,47,11,27,22,5]
["Guardiamarina del Cuerpo General",{"$f":"SUM(C11:D11)","v":27},22,5,{"$f":"SUM(F11:G11)","v":13},11,2,{"$f":"SUM(I11:J11)","v":7},4,3]
["Guardiamarina del Cuerpo de Ingenieros en máquinas y Electricidad",0,0,0,9,8,1,5,5,0]
["Guardiamarinas del Cuerpo de Aprovisionamiento y Administración",0,0,0,2,0,2,3,1,2]
["Guardiamarinas de Prefectura",0,0,0,10,7,3,2,2,0]
["Tercer Oficial Piloto Mercante",7,5,2,18,15,3,10,10,0]
["Tercer Oficial Ingeniero Mercante",5,5,0,6,6,0,0,0,0]
[]
["ESCUELA NACIONAL DE POLICÍA",{"$f":"+C18+D18","v":111},{"$f":"+C19","v":96},{"$f":"+D19","v":15},{"$f":"+F18+G18","v":242},{"$f":"+F19","v":195},{"$f":"+G19","v":47},{"$f":"+I18+J18","v":71},{"$f":"+I19","v":53},{"$f":"+J19","v":18}]
["Curso de OflSubAyte y Licenciado en Seguridad Pública",{"$f":"SUM(C19:D19)","v":111},96,15,{"$f":"SUM(F19:G19)","v":242},195,47,{"$f":"SUM(I19:J19)","v":71},53,18]
[]
["ESCUELA MILITAR",{"$f":"SUM(C21:D21)","v":59},{"$f":"SUM(C22:C22)","v":48},{"$f":"SUM(D22:D22)","v":11},{"$f":"SUM(F21:G21)","v":122},{"$f":"SUM(F22:F22)","v":108},{"$f":"SUM(G22:G22)","v":14},{"$f":"SUM(I21:J21)","v":0},{"$f":"SUM(I22:I22)","v":0},{"$f":"SUM(J22:J22)","v":0}]
["Alférez del Ejército Nacional del Cuerpo Comando",{"$f":"+C22+D22","v":59},48,11,{"$f":"+F22+G22","v":122},108,14,"s/d","s/d","s/d"]
[]
["ESCUELA MILITAR DE AERONÁUTICA -",{"$f":"SUM(C24:D24)","v":16},{"$f":"SUM(C25:C28)","v":14},{"$f":"SUM(D25:D28)","v":2},{"$f":"SUM(F24:G24)","v":48},{"$f":"SUM(F25:F28)","v":40},{"$f":"SUM(G25:G28)","v":8},{"$f":"SUM(I24:J24)","v":13},{"$f":"SUM(I25:I28)","v":11},{"$f":"SUM(J25:J28)","v":2}]
["Curso de Oficial Aviadores",{"$f":"+C25+D25","v":16},14,2,{"$f":"+F25+G25","v":28},27,1,{"$f":"+I25+J25","v":10},10,0]
["Curso de Oficial Navegantes Perfil Meteorología","s/d","s/d","s/d",2,0,2,"s/d","s/d","s/d"]
["Curso de Oficial Navegantes Perfil Com y electrónica","s/d","s/d","s/d",12,8,4,3,1,2]
["Curso de Oficial Navegantes Perfil Logística","s/d","s/d","s/d",6,5,1,"s/d","s/d","s/d"]
["Fuente: Gestión Educativa - Escuela Naval"]
["        Jefatura de Estudios - Escuela Nacional de Policía "]
["        Escuela Militar"]
["        Departamento de Bedelía - Escuela Militar de Aeronáutica"]

{"sheet":"II-5.2.3 ","index":201,"n_rows":80,"n_cols":10,"rows_kept":80,"cut":false,"hidden":false,"merged":[[7,2,8,2],[7,3,8,3],[7,5,8,5],[7,6,8,6],[7,8,8,8],[7,9,8,9],[0,6,1,9],[4,0,4,9],[5,0,8,0],[5,1,8,1],[5,2,5,3],[5,4,8,4],[5,5,5,6],[5,7,8,7],[5,8,5,9],[6,2,6,3],[6,5,6,6],[6,8,6,9]]}
["OTRAS OFERTAS TERCIARIAS NO UNIVERSITARIAS",null,null,null,null,null,"ALUMNOS MATRICULADOS"]
[]
["Cuadro Nº II-5.2.3"]
[]
["ALUMNOS INGRESADOS, MATRICULADOS Y EGRESADOS EN OTRAS OFERTAS DE NIVEL TERCIARIO NO UNIVERSITARIO POR SEXO SEGÚN INSTITUCIÓN Y CARRERA. AÑO 2011."]
["INSTITUCION / CARRERA","TOTAL","INGRESADOS",null,"TOTAL","MATRICULADOS",null,"TOTAL","EGRESADOS"]
[null,null,"SEXO",null,null,"SEXO",null,null,"SEXO"]
[null,null,"M","F",null,"M","F",null,"M","F"]
[]
["EMAD Margarita Xirgu",{"$f":"SUM(C10:D10)","v":35},{"$f":"SUM(C11:C12)","v":10},{"$f":"SUM(D11:D12)","v":25},{"$f":"SUM(F10:G10)","v":89},{"$f":"SUM(F11:F12)","v":23},{"$f":"SUM(G11:G12)","v":66},{"$f":"SUM(I10:J10)","v":40},{"$f":"SUM(I11:I12)","v":8},{"$f":"SUM(J11:J12)","v":32}]
["Carrera de actuación",{"$f":"SUM(C11:D11)","v":19},5,14,{"$f":"SUM(F11:G11)","v":54},16,38,{"$f":"SUM(I11:J11)","v":22},7,15]
["Carrera de diseño teatral",{"$f":"SUM(C12:D12)","v":16},5,11,{"$f":"SUM(F12:G12)","v":35},7,28,{"$f":"SUM(I12:J12)","v":18},1,17]
[]
["INAU – CENFORES - Educador Social ",{"$f":"SUM(C14:D14)","v":0},0,0,{"$f":"SUM(F14:G14)","v":230},33,197,{"$f":"SUM(I14:J14)","v":24},0,24]
[]
["CIEP",{"$f":"SUM(C16:D16)","v":59},{"$f":"SUM(C17:C18)","v":0},{"$f":"SUM(D17:D18)","v":59},{"$f":"SUM(F16:G16)","v":93},{"$f":"SUM(F17:F18)","v":0},{"$f":"SUM(G17:G18)","v":93},{"$f":"SUM(I16:J16)","v":28},{"$f":"SUM(I17:I18)","v":0},{"$f":"SUM(J17:J18)","v":28}]
["  Técnico en Educador/a Inicial",{"$f":"SUM(C17:D17)","v":54},0,54,{"$f":"SUM(F17:G17)","v":88},0,88,{"$f":"SUM(I17:J17)","v":25},0,25]
["  Lic en Educación Inicial",{"$f":"SUM(C18:D18)","v":5},0,5,{"$f":"SUM(F18:G18)","v":5},0,5,{"$f":"SUM(I18:J18)","v":3},0,3]
[]
["CETP (UTU) ","-","-","-",{"$f":"SUM(E21:E72)","v":6780},{"$f":"SUM(F21:F72)","v":4008},2772,"-","-","-"]
["Acondicionamiento Térmico","-","-","-",{"$f":"F21+G21","v":12},12,0,"-","-","-"]
["Administración de Personal","-","-","-",{"$f":"F22+G22","v":285},73,212,"-","-","-"]
["Administración Hotelera","-","-","-",32,7,25,"-","-","-"]
["Administración Pública","-","-","-",346,85,261,"-","-","-"]
["Agrónica énfasis agrícola","-","-","-",7,7,0,"-","-","-"]
["Agrónica énfasis forestal","-","-","-",13,13,0,"-","-","-"]
["Analista en Marketing","-","-","-",346,127,219,"-","-","-"]
["Óptico","-","-","-",116,43,73,"-","-","-"]
["Autotrónica Lab S de Control","-","-","-",8,8,0,"-","-","-"]
["Com Social Op Prensa","-","-","-",68,29,39,"-","-","-"]
["Com Social Op Publicidad","-","-","-",97,35,62,"-","-","-"]
["Com Social Op Radiodifusión","-","-","-",79,44,35,"-","-","-"]
["Com Social Op RR PP","-","-","-",64,17,47,"-","-","-"]
["Com Social Op Televisión","-","-","-",52,26,26,"-","-","-"]
["Construcción","-","-","-",109,89,20,"-","-","-"]
["Control ambiental","-","-","-",25,14,11,"-","-","-"]
["Corredor de Seguros","-","-","-",40,15,25,"-","-","-"]
["Diseño Gráfico","-","-","-",385,155,230,"-","-","-"]
["Electrónica","-","-","-",386,381,5,"-","-","-"]
["Electrotecnia","-","-","-",578,569,9,"-","-","-"]
["Enología Módulo Enológico II","-","-","-",11,4,7,"-","-","-"]
["Enología Módulo Vitivinícola","-","-","-",19,11,8,"-","-","-"]
["Forestal","-","-","-",20,14,6,"-","-","-"]
["Gestión de Alojamiento","-","-","-",33,11,22,"-","-","-"]
["Gestión Empresas Turísticas","-","-","-",16,4,12,"-","-","-"]
["Guía y Tec Diseño Circ Turísticos","-","-","-",56,18,38,"-","-","-"]
["Industrias Lácteas","-","-","-",57,28,29,"-","-","-"]
["Infografía de Arquitectura","-","-","-",77,29,48,"-","-","-"]
["Inmobiliario (Operador)","-","-","-",82,34,48,"-","-","-"]
["Instalaciones Eléctricas","-","-","-",61,61,0,"-","-","-"]
["Instalaciones Sanitarias","-","-","-",47,38,9,"-","-","-"]
["Instrumentación y Control","-","-","-",46,46,0,"-","-","-"]
["Mantenimiento Mecánico Industrial","-","-","-",29,29,0,"-","-","-"]
["Maquinista Naval","-","-","-",78,78,0,"-","-","-"]
["Mecánica General","-","-","-",51,43,8,"-","-","-"]
["Mecatrónica - Int. Aut. y Control","-","-","-",14,14,0,"-","-","-"]
["Mecatrónica - Mant. Electromecánico","-","-","-",14,14,0,"-","-","-"]
["Náutica y Pesca","-","-","-",13,11,2,"-","-","-"]
["Pequeña y Mediana Empresa","-","-","-",57,14,43,"-","-","-"]
["Prevencionista en Seg. Industrial","-","-","-",993,524,469,"-","-","-"]
["Producción Agrícola Ganadera","-","-","-",180,144,36,"-","-","-"]
["Producción Lechera","-","-","-",29,21,8,"-","-","-"]
["Producciones Vegetales Intensivas","-","-","-",16,11,5,"-","-","-"]
["Redes y Telecomunicaciones","-","-","-",108,95,13,"-","-","-"]
["Rematador","-","-","-",204,133,71,"-","-","-"]
["Rematador - Op. Inmobiliario","-","-","-",216,137,79,"-","-","-"]
["Sistemas de Prod. Arroz-Pasturas","-","-","-",36,23,13,"-","-","-"]
["Técnico en Comunicación Social","-","-","-",427,161,266,"-","-","-"]
["Tecnólogo Agroenergético","-","-","-",42,29,13,"-","-","-"]
["Tecnólogo en Informática","-","-","-",354,299,55,"-","-","-"]
["Tecnólogo Mecánico","-","-","-",138,129,9,"-","-","-"]
["Tecnólogo Químico","-","-","-",208,52,156,"-","-","-"]
["Fuente: Secretaría General - E.M.A.D."]
["        CEN.FOR.ES - I.N.A.U. "]
["        C.D.I"]
["        C.I.E.P"]
["        Secretaría General - CALEN. "]
["        C.E.P.T (UTU)"]
["NOTA: Si bien a lo largo del Anuario el código S/D corresponde al Sin Dato, "]
["      en este cuadro, para mejorar la legibilidad, se utiliza el guión (-)."]

{"sheet":"II-5.2.4 ","index":202,"n_rows":54,"n_cols":12,"rows_kept":54,"cut":false,"hidden":false,"merged":[[0,9,1,12],[6,0,10,0],[6,1,6,11],[7,1,10,1],[7,3,7,6],[7,8,7,11],[8,2,9,2],[8,5,8,6],[8,7,9,7],[8,8,8,11]]}
["DIRECCIÓN DE FORMACIÓN Y PERFECCIONAMIENTO DOCENTE",null,null,null,null,null,null,null,null,"ALUMNOS MATRICULADOS"]
[]
["Cuadro Nº II-5.2.4"]
[]
["ALUMNOS MATRICULADOS EN FORMACIÓN DOCENTE POR CARRERA Y GRADO SEGÚN DEPARTAMENTO Y ESTABLECIMIENTOS. AÑO 2011."]
[]
["DEPARTAMENTO / ESTABLECIMIENTO","CARRERA"]
[null,"TOTAL",null,"Magisterio",null,null,null,null,"Profesorado"]
[null,null,"TOTAL",null,null,null,null,"TOTAL"]
[null,null,null,"Primero","Segundo","Tercero","Cuarto",null,"Primero","Segundo","Tercero","Cuarto"]
[]
["TOTAL",{"$f":"+B14+B18","v":19678},{"$f":"+C14+C18","v":6373},2621,1652,1120,980,14210,8311,3169,1680,1050]
[]
["MONTEVIDEO",{"$f":"SUM(B15:B17)","v":9107},{"$f":"SUM(C15:C17)","v":2228},957,671,381,219,6879,4531,1534,638,176]
["                IINN",{"$f":"SUM(C15+H15)","v":2228},{"$f":"SUM(D15:G15)","v":2228},957,671,381,219,{"$f":"SUM(I15:L15)","v":0},"N/C","N/C","N/C","N/C"]
["                IPA",{"$f":"SUM(C16+H16)","v":6121},0,"N/C","N/C","N/C","N/C",{"$f":"SUM(I16:L16)","v":6121},3987,1399,582,153]
["                INET",{"$f":"SUM(C17+H17)","v":758},0,"N/C","N/C","N/C","N/C",{"$f":"SUM(I17:L17)","v":758},544,135,56,23]
["RESTO DEL PAÍS",{"$f":"+B19+B20+B26+B27+B31+B32+B33+B36+B37+B40+B41+B42+B45+B46+B49+B50+B51+B52","v":10571},{"$f":"+C19+C20+C26+C27+C31+C32+C33+C36+C37+C40+C41+C42+C45+C46+C49+C50+C51+C52","v":4145},{"$f":"+D19+D20+D26+D27+D31+D32+D33+D36+D37+D40+D41+D43+D45+D47+D49+D50+D51+D52","v":1664},{"$f":"+E19+E20+E26+E27+E31+E32+E33+E36+E37+E40+E41+E43+E45+E47+E49+E50+E51+E52","v":981},{"$f":"+F19+F20+F26+F27+F31+F32+F33+F36+F37+F40+F41+F43+F45+F47+F49+F50+F51+F52","v":739},{"$f":"+G19+G20+G26+G27+G31+G32+G33+G36+G37+G40+G41+G43+G45+G47+G49+G50+G51+G52","v":761},7331,3780,1635,1042,874]
["Artigas",{"$f":"SUM(C19+H19)","v":540},{"$f":"SUM(D19:G19)","v":338},154,75,51,58,{"$f":"SUM(I19:L19)","v":202},146,25,16,15]
["Canelones",{"$f":"SUM(B21:B24)","v":1363},{"$f":"SUM(C21:C24)","v":710},291,177,143,99,{"$f":"SUM(H21:H25)","v":1153},{"$f":"SUM(I21:I25)","v":590},{"$f":"SUM(J21:J25)","v":270},158,135]
["                IFD Canelones",{"$f":"SUM(C21+H21)","v":387},{"$f":"SUM(D21:G21)","v":207},82,49,41,35,{"$f":"SUM(I21:L21)","v":180},109,30,22,19]
["                IFD de la Costa",355,159,64,34,42,19,196,108,40,22,26]
["                IFD Pando",462,252,124,61,42,25,210,117,52,22,19]
["                IFD San Ramón",159,92,21,33,18,20,67,49,6,4,8]
[" IFD Cerp Sur - Atlántida",500,0,"N/C","N/C","N/C","N/C",500,207,142,88,63]
["Cerro Largo",450,190,68,45,27,50,260,168,64,17,11]
["Colonia",{"$f":"SUM(B28:B29)","v":558},{"$f":"SUM(C28:C29)","v":181},{"$f":"SUM(D28:D29)","v":68},44,25,44,{"$f":"SUM(H28:H30)","v":782},{"$f":"SUM(I28:I30)","v":389},{"$f":"SUM(J28:J30)","v":175},113,105]
["                IFD Carmelo",{"$f":"SUM(C28+H28)","v":328},{"$f":"SUM(D28:G28)","v":81},33,22,15,11,{"$f":"SUM(I28:L28)","v":247},152,44,26,25]
["                IFD Rosario",230,100,35,22,10,33,130,70,29,7,24]
["Cerp Suroeste - Colonia",405,0,"N/C","N/C","N/C","N/C",405,167,102,80,56]
["Durazno",523,239,112,59,36,32,284,212,38,17,17]
["Flores",138,54,19,14,13,8,84,46,24,12,2]
["Florida",573,228,{"$f":"(D34+D35)","v":77},{"$f":"(E34+E35)","v":55},61,35,345,{"$f":"SUM(I34:I35)","v":112},{"$f":"SUM(J34:J35)","v":94},65,74]
["Florida",264,228,77,55,61,35,36,1,9,9,17]
["Cerp Centro Florida",309,0,"N/C","N/C","N/C","N/C",309,111,85,56,57]
["Lavalleja",255,127,39,21,25,42,128,78,17,12,21]
["Maldonado",708,181,{"$f":"(D38+D39)","v":58},{"$f":"(E38+E39)","v":43},38,42,527,{"$f":"SUM(I38:I39)","v":241},{"$f":"SUM(J38:J39)","v":132},108,46]
["Maldonado",202,181,58,43,38,42,21,2,6,12,1]
["Cerp Este - Maldonado",506,0,"N/C","N/C","N/C","N/C",506,239,126,96,45]
["Paysandú",781,243,93,67,49,34,538,279,111,77,71]
["Río Negro",438,155,63,44,24,24,283,212,39,14,18]
["Rivera",1049,{"$f":"SUM(D42:G42)","v":306},{"$f":"(D43+D44)","v":116},{"$f":"(E43+E44)","v":90},55,45,743,{"$f":"SUM(I43:I44)","v":371},{"$f":"SUM(J43:J44)","v":178},112,82]
["Rivera",412,{"$f":"SUM(D43:G43)","v":306},116,90,55,45,106,64,16,6,20]
["Cerp Norte - Rivera",637,0,"N/C","N/C","N/C","N/C",637,307,162,106,62]
["Rocha",233,98,48,16,17,17,135,83,27,12,13]
["Salto",1268,{"$f":"SUM(D46:G46)","v":406},{"$f":"(D47+D48)","v":159},{"$f":"(E47+E48)","v":98},67,82,862,{"$f":"SUM(I47:I48)","v":276},{"$f":"SUM(J47:J48)","v":209},201,176]
["Salto",465,{"$f":"SUM(D47:G47)","v":406},159,98,67,82,59,0,3,23,33]
["Cerp Litoral - Salto",803,0,"N/C","N/C","N/C","N/C",803,276,206,178,143]
["San José",268,148,75,29,16,28,120,64,23,15,18]
["Soriano",234,142,69,28,18,27,92,55,19,10,8]
["Tacuarembó",664,187,87,32,27,41,477,301,118,40,18]
["Treinta y Tres",528,212,68,44,47,53,316,157,72,43,44]
["Fuente: Informática - DFPD "]
["Nota:   Los cursos de INET tiene como duración un año"]

{"sheet":"II-5.3.1 ","index":203,"n_rows":51,"n_cols":5,"rows_kept":51,"cut":false,"hidden":false,"merged":[[0,4,1,5],[4,0,4,3],[5,0,7,0],[5,1,6,4]]}
["DIRECCIÓN DE FORMACIÓN Y PERFECCIONAMIENTO DOCENTE",null,null,null,"FUNCIONARIOS"]
[]
["Cuadro Nº II-531"]
[]
["FUNCIONARIOS DE LOS INSTITUTOS DE FORMACIÓN DOCENTE Y CANTIDAD DE HORAS POR INSTITUCIÓN Y DEPARTAMENTO AÑO 2011"]
["DEPARTAMENTO / ESTABLECIMIENTO","DOCENTES Y HORAS"]
[]
[null,"TOTAL","Cant Docentes","Cant Horas","Cant Horas Depto"]
["TOTAL",{"$f":"+B11+B15","v":64905},{"$f":"+C11+C15","v":2738},{"$f":"+D11+D15","v":50271},{"$f":"+E11+E15","v":14634}]
[]
["MONTEVIDEO",{"$f":"SUM(B12:B14)","v":21400},{"$f":"SUM(C12:C14)","v":884},{"$f":"SUM(D12:D14)","v":16526},{"$f":"SUM(E12:E14)","v":4874}]
["MontevideoIINN",{"$f":"+D12+E12","v":4323},217,3388,935]
["                IPA ",{"$f":"+D13+E13","v":14691},557,11292,3399]
["                INET ",2386,110,1846,540]
["RESTO DEL PAÍS",{"$f":"+D15+E15","v":43505},{"$f":"+C16+C17+C23+C24+C28+C29+C30+C33+C34+C37+C38+C39+C42+C43+C46+C47+C48+C49","v":1854},{"$f":"+D16+D17+D23+D24+D28+D29+D30+D33+D34+D37+D38+D39+D42+D43+D46+D47+D48+D49","v":33745},{"$f":"+E16+E17+E23+E24+E28+E29+E30+E33+E34+E37+E38+E39+E42+E43+E46+E47+E48+E49","v":9760}]
["Artigas",{"$f":"+D16+E16","v":1469},72,1113,356]
["Canelones",7144,{"$f":"SUM(C18:C22)","v":329},{"$f":"SUM(D18:D22)","v":5511},{"$f":"SUM(E18:E22)","v":1633}]
["                IFD Canelones ",1099,60,855,244]
["                IFD de la Costa ",844,42,634,210]
["                IFD Pando",1031,60,816,215]
["                IFD San Ramón ",691,39,535,156]
["                CERP del Sur",3479,128,2671,808]
["Cerro Largo",1325,66,1040,285]
["Colonia",4514,{"$f":"SUM(C25:C27)","v":186},{"$f":"SUM(D25:D27)","v":3505},{"$f":"SUM(E25:E27)","v":1009}]
["                IFD Carmelo",592,33,475,117]
["                IFD Rosario ",686,38,545,141]
["                CERP del Suroeste",3236,115,2485,751]
["Durazno ",963,49,768,195]
["Flores",553,32,445,108]
["Florida",4014,{"$f":"+C31+C32","v":175},{"$f":"+D31+D32","v":3105},{"$f":"+E31+E32","v":909}]
["                IFD Florida",888,54,685,203]
["                CERP del Centro",3126,121,2420,706]
["Lavalleja",904,48,715,189]
["Maldonado ",3989,{"$f":"+C35+C36","v":149},{"$f":"+D35+D36","v":3105},{"$f":"+E35+E36","v":884}]
["                IFD Maldonado",889,46,730,159]
["                CERP del Centro",3100,103,2375,725]
["Paysandú",2146,83,1686,460]
["Río Negro",522,32,422,100]
["Rivera",4240,{"$f":"+C40+C41","v":164},{"$f":"+D40+D41","v":3279},{"$f":"+E40+E41","v":961}]
["                IFD Rivera",1408,71,1086,322]
["                CERP del Norte",2832,93,2193,639]
["Rocha",868,43,682,186]
["Salto ",5593,{"$f":"+C44+C45","v":190},{"$f":"+D44+D45","v":4294},{"$f":"+E44+E45","v":1299}]
["                IFD Salto",1412,66,1102,310]
["                CERP del Litoral",4181,124,3192,989]
["San José",916,48,731,185]
["Soriano ",865,45,692,173]
["Tacuarembó ",1718,77,1285,433]
["Treinta y Tres",1762,66,1367,395]
["Fuente: Contralor Docente - CFE"]
["(Nota: Horas de Departamento = a cada docente de acuerdo a la cantidad de horas de docencia directa que elige se le calcula el 40% +2 horas como horas de departamento (indirecta  para coordinación en los Centros y tareas específicas que fijan los Coordinadores de departamento, proyecto del Centro, etc) Este cambio se introdujo con el plan 2008 de Formación Docente "]

{"sheet":"II-5.3.2","index":204,"n_rows":38,"n_cols":11,"rows_kept":38,"cut":false,"hidden":false,"merged":[[37,0,37,10],[0,4,1,6],[4,0,4,10],[5,0,8,0],[5,1,8,1],[5,2,5,10],[6,2,8,2],[6,3,6,4],[6,5,8,5],[6,6,6,7],[6,8,8,8],[6,9,6,10],[7,3,7,4],[7,6,7,7],[7,9,7,10]]}
["OFERTAS TERCIARIAS NO UNIVERSITARIAS DEL ÁREA SEGURIDAD Y DEFENSA",null,null,null,"PERSONAL ACADÉMICO"]
[]
["Cuadro Nº II-5.3.2"]
[]
["PERSONAL ACADÉMICO DE NIVEL TERCIARIO NO UNIVERSITARIO DEL ÁREA SEGURIDAD Y DEFENSA POR CARGA HORARIA, SEXO, SEGÚN INSTITUCIÓN Y FORMACIÓN. AÑO 2011."]
["INSTITUCIONES / FORMACIÓN","TOTAL","HORAS SEMANALES"]
[null,null,"Total","20 horas o menos",null,"Total","Entre 21 y 30 horas",null,"Total","31 horas y más"]
[null,null,null,"SEXO",null,null,"SEXO",null,null,"SEXO"]
[null,null,null,"M","F",null,"M","F",null,"M","F"]
["ESCUELA NAVAL",{"$f":"C10+F10+I10","v":127},{"$f":"D10+E10","v":127},{"$f":"SUM(D11:D14)","v":104},{"$f":"SUM(E11:E14)","v":23},{"$f":"G10+H10","v":0},{"$f":"SUM(G11:G14)","v":0},{"$f":"SUM(H11:H14)","v":0},{"$f":"J10+K10","v":0},{"$f":"SUM(J11:J14)","v":0},{"$f":"SUM(K11:K14)","v":0}]
["  Sin formación degrado completa",{"$f":"C11+F11+I11","v":23},{"$f":"D11+E11","v":23},7,16,{"$f":"G11+H11","v":0},0,0,{"$f":"J11+K11","v":0},0,0]
["  Con formación de grado",103,103,97,6,0,0,0,0,0,0]
["  Con postgrado de especialización o maestría",1,1,0,1,0,0,0,0,0,0]
["  Con doctorado",0,0,0,0,0,0,0,0,0,0]
[]
["ESCUELA NACIONAL DE POLICÍA",{"$f":"C16+F16+I16","v":109},{"$f":"D16+E16","v":108},{"$f":"SUM(D17:D20)","v":84},{"$f":"SUM(E17:E20)","v":24},{"$f":"G16+H16","v":1},{"$f":"SUM(G17:G20)","v":1},{"$f":"SUM(H17:H20)","v":0},{"$f":"J16+K16","v":0},{"$f":"SUM(J17:J20)","v":0},{"$f":"SUM(K17:K20)","v":0}]
["  Sin formación degrado completa",{"$f":"C17+F17+I17","v":11},{"$f":"D17+E17","v":11},7,4,{"$f":"G17+H17","v":0},0,0,{"$f":"J17+K17","v":0},0,0]
["  Con formación de grado",98,97,77,20,1,1,0,0,0,0]
["  Con postgrado de especialización o maestría",0,0,0,0,0,0,0,0,0,0]
["  Con doctorado",0,0,0,0,0,0,0,0,0,0]
[]
["ESCUELA MILITAR",{"$f":"C22+F22+I22","v":99},{"$f":"D22+E22","v":99},{"$f":"SUM(D23:D26)","v":87},{"$f":"SUM(E23:E26)","v":12},{"$f":"G22+H22","v":0},{"$f":"SUM(G23:G26)","v":0},{"$f":"SUM(H23:H26)","v":0},{"$f":"J22+K22","v":0},{"$f":"SUM(J23:J26)","v":0},{"$f":"SUM(K23:K26)","v":0}]
["  Sin formación degrado completa",{"$f":"C23+F23+I23","v":4},{"$f":"D23+E23","v":4},1,3,{"$f":"G23+H23","v":0},0,0,{"$f":"J23+K23","v":0},0,0]
["  Con formación de grado",94,94,85,9,0,0,0,0,0,0]
["  Con postgrado de especialización o maestría",1,1,1,0,0,0,0,0,0,0]
["  Con doctorado",0,0,0,0,0,0,0,0,0,0]
[]
["ESCUELA MILITAR DE AERONÁUTICA",{"$f":"C28+F28+I28","v":92},{"$f":"D28+E28","v":92},{"$f":"SUM(D29:D32)","v":73},{"$f":"SUM(E29:E32)","v":19},{"$f":"G28+H28","v":0},{"$f":"SUM(G29:G32)","v":0},{"$f":"SUM(H29:H32)","v":0},{"$f":"J28+K28","v":0},{"$f":"SUM(J29:J32)","v":0},{"$f":"SUM(K29:K32)","v":0}]
["  Sin formación degrado completa",{"$f":"C29+F29+I29","v":0},{"$f":"D29+E29","v":0},0,0,{"$f":"G29+H29","v":0},0,0,{"$f":"J29+K29","v":0},0,0]
["  Con formación de grado",86,86,68,18,0,0,0,0,0,0]
["  Con postgrado de especialización o maestría",6,6,5,1,0,0,0,0,0,0]
["  Con doctorado",0,{"$f":"D32+E32","v":0},0,0,{"$f":"G32+H32","v":0},0,0,{"$f":"J32+K32","v":0},0,0]
["Fuente: Gestión Educativa - Escuela Naval"]
[" Fuente: Jefatura de Estudios - Escuela Nacional de Policía "]
["         Escuela Militar"]
["         Departamento de Bedelía - Escuela Militar de Aeronáutica"]
["         Escuela Naval"]
["Nota: Sin formación de grado completa incluye docentes que no alcanzaron el grado o contaban con formación terciaria no universitaria"]

{"sheet":"II-5.3.3","index":205,"n_rows":31,"n_cols":11,"rows_kept":31,"cut":false,"hidden":false,"merged":[[6,9,6,10],[7,3,7,4],[7,6,7,7],[7,9,7,10],[0,2,1,4],[4,0,4,10],[5,0,8,0],[5,1,8,1],[5,2,5,10],[6,2,8,2],[6,3,6,4],[6,5,8,5],[6,6,6,7],[6,8,8,8]]}
["OTRAS OFERTAS TERCIARIAS NO UNIVERSITARIAS ",null,"PERSONAL ACADÉMICO"]
[]
["Cuadro Nº II-533"]
[]
["PERSONAL ACADÉMICO DE NIVEL TERCIARIO NO UNIVERSITARIO POR CARGA HORARIA SEMANAL, SEXO, SEGÚN INSTITUCIÓN Y FORMACIÓN AÑO 2011"]
["INSTITUCIONES / FORMACIÓN","TOTAL","HORAS SEMANALES"]
[null,null,"Total","20 horas o menos",null,"Total","Entre 21 y 30 horas",null,"Total","31 horas y más"]
[null,null,null,"SEXO",null,null,"SEXO",null,null,"SEXO"]
[null,null,null,"M","F",null,"M","F",null,"M","F"]
["EMAD Margarita Xirgu",{"$f":"C10+F10+I10","v":36},{"$f":"D10+E10","v":35},{"$f":"SUM(D11:D14)","v":19},{"$f":"SUM(E11:E14)","v":16},{"$f":"G10+H10","v":1},{"$f":"SUM(G11:G14)","v":0},{"$f":"SUM(H11:H14)","v":1},{"$f":"J10+K10","v":0},{"$f":"SUM(J11:J14)","v":0},{"$f":"SUM(K11:K14)","v":0}]
["  Sin formación degrado completa",{"$f":"C11+F11+I11","v":28},{"$f":"D11+E11","v":28},15,13,{"$f":"G11+H11","v":0},0,0,{"$f":"J11+K11","v":0},0,0]
["  Con formación de grado",7,6,4,2,1,0,1,0,0,0]
["  Con postgrado de especialización o maestría",0,0,0,0,0,0,0,0,0,0]
["  Con doctorado",1,1,0,1,0,0,0,0,0,0]
[]
["INAU ",{"$f":"C16+F16+I16","v":19},{"$f":"D16+E16","v":11},{"$f":"SUM(D17:D20)","v":8},{"$f":"SUM(E17:E20)","v":3},{"$f":"G16+H16","v":8},{"$f":"SUM(G17:G20)","v":5},{"$f":"SUM(H17:H20)","v":3},{"$f":"J16+K16","v":0},{"$f":"SUM(J17:J20)","v":0},{"$f":"SUM(K17:K20)","v":0}]
["  Sin formación degrado completa",{"$f":"C17+F17+I17","v":3},3,0,0,{"$f":"G17+H17","v":0},0,0,{"$f":"J17+K17","v":0},0,0]
["  Con formación de grado",21,13,8,3,8,5,3,0,0,0]
["  Con postgrado de especialización o maestría",1,1,0,0,0,0,0,0,0,0]
["  Con doctorado",1,1,0,0,0,0,0,0,0,0]
[]
["CIEP",{"$f":"C22+F22+I22","v":29},{"$f":"D22+E22","v":29},{"$f":"SUM(D23:D26)","v":2},{"$f":"SUM(E23:E26)","v":27},{"$f":"G22+H22","v":0},{"$f":"SUM(G23:G26)","v":0},{"$f":"SUM(H23:H26)","v":0},{"$f":"J22+K22","v":0},{"$f":"SUM(J23:J26)","v":0},{"$f":"SUM(K23:K26)","v":0}]
["  Sin formación degrado completa",{"$f":"C23+F23+I23","v":0},{"$f":"D23+E23","v":0},0,0,{"$f":"G23+H23","v":0},0,0,{"$f":"J23+K23","v":0},0,0]
["  Con formación de grado",18,18,1,17,0,0,0,0,0,0]
["  Con postgrado de especialización o maestría",2,2,1,1,0,0,0,0,0,0]
["  Con doctorado",9,{"$f":"D26+E26","v":9},0,9,{"$f":"G26+H26","v":0},0,0,{"$f":"J26+K26","v":0},0,0]
["Fuente: Secretaría General - EMAD"]
["        CENFORES - INAU "]
["        CDI"]
["        CIEP"]
["Nota: No se cuenta con datos de personal académico en nivel terciario de UTU"]

{"sheet":"II-5.3.4 ","index":206,"n_rows":32,"n_cols":4,"rows_kept":32,"cut":false,"hidden":false,"merged":[[0,3,1,4],[4,0,4,2],[5,0,6,0],[5,1,6,1],[5,2,6,2]]}
["OTRAS OFERTAS TERCIARIAS NO UNIVERSITARIAS ",null,null,"ALUMNOS MATRICULADOS"]
[]
["Cuadro Nº II-5.3.4"]
[]
["ESTUDIANTES INGRESADOS Y MATRICULADOS EN FORMACIÓN DOCENTE SEGÚN ORIGEN GEOGRÁFICO. AÑO 2011."]
["DEPARTAMENTODONDE CURSÓ EL ÚLTIMO AÑO LICEAL","ESTUDIANTES INGRESADOS","ESTUDIANTES MATRICULADOS"]
[]
["TOTAL ",{"$f":"SUM(B9:B31)","v":8304},{"$f":"SUM(C9:C31)","v":20717}]
["Montevideo",{"$f":"494+1658+544+82+982","v":3760},{"$f":"2228+758+5139+982+134","v":9241}]
["Artigas",{"$f":"106+72","v":178},{"$f":"338+202","v":540}]
["Canelones",{"$f":"82+55+79+21+59+149+85+60+28","v":618},{"$f":"500+207+159+252+92+180+196+210+67","v":1863}]
["Cerro Largo",{"$f":"106+240","v":346},{"$f":"190+260","v":450}]
["Colonia",{"$f":"27+34+42+129+37","v":269},{"$f":"405+328+230","v":963}]
["Durazno",{"$f":"108+99","v":207},523]
["Flores",{"$f":"20+28","v":48},138]
["Florida",{"$f":"59+167+0","v":226},{"$f":"264+309","v":573}]
["Lavalleja",{"$f":"43+72","v":115},255]
["Maldonado",{"$f":"58+209+0","v":267},{"$f":"506+202","v":708}]
["Paysandú",{"$f":"132+200","v":332},781]
["Río Negro",{"$f":"37+62","v":99},438]
["Rivera",{"$f":"62+42+318","v":422},{"$f":"637+412","v":1049}]
["Rocha",{"$f":"59+73","v":132},233]
["Salto",{"$f":"110+259","v":369},{"$f":"803+465","v":1268}]
["San José",{"$f":"62+78","v":140},268]
["Soriano",{"$f":"48+89","v":137},234]
["Tacuarembó",{"$f":"65+225","v":290},664]
["Treinta y Tres",{"$f":"68+281","v":349},528]
["Total extranjeros","---","---"]
["Extranjeros cono sur (Argentina, Brasil, Chile y Paraguay)","---","---"]
["Extranjeros extraregionales","---","---"]
["Extranjeros extraregionales","---","---"]
["Fuente: Institutos de Formación Docente"]

{"sheet":"EDUCACIÓN UNIVERSITARIA","index":207,"n_rows":0,"n_cols":0,"rows_kept":0,"cut":false,"hidden":false,"merged":[[20,0,20,4],[10,0,10,4],[12,0,12,4],[14,0,14,4],[16,0,16,4],[18,0,18,4],[34,0,34,4],[36,0,36,4],[22,0,22,4],[24,0,24,4],[26,0,26,4],[28,0,28,4],[30,0,30,4],[32,0,32,4]]}

{"sheet":"II-6.1.1 ","index":208,"n_rows":48,"n_cols":11,"rows_kept":48,"cut":false,"hidden":false,"merged":[[38,0,38,6],[39,0,39,6],[40,0,40,6],[0,3,1,5],[4,0,4,10],[5,0,7,1],[5,2,7,2],[5,3,5,4],[5,5,7,5],[5,6,5,7],[5,8,7,8],[5,9,5,10],[6,3,6,4],[6,6,6,7],[6,9,6,10]]}
["OFERTA UNIVERSITARIA DE GRADO",null,null,"INSTITUCIONES"]
[]
["Cuadro Nº II-6.1.1"]
[]
["ALUMNOS INGRESADOS, MATRICULADOS Y EGRESDADOS EN PROGRAMAS DE GRADO POR SEXO SEGÚN GRANDES ÁREAS, DEPARTAMENTO E INSTITUCIÓN. AÑO 2011."]
["GRANDES ÁREAS / DEPARTAMENTO / INSTITUCIÓN",null,"TOTAL","INGRESO",null,"TOTAL","MATRICULA",null,"TOTAL","EGRESO"]
[null,null,null,"SEXO",null,null,"SEXO",null,null,"SEXO"]
[null,null,null,"M","F",null,"M","F",null,"M","F"]
["TOTAL",null,{"$f":"+D9+E9","v":22945},{"$f":"+D11+D25","v":8803},{"$f":"+E11+E25","v":14142},{"$f":"+G9+H9","v":132420},{"$f":"+G11+G25","v":51857},{"$f":"+H11+H25","v":80563},{"$f":"+J9+K9","v":6476},{"$f":"+J11+J25","v":2262},{"$f":"+K11+K25","v":4214}]
[]
["MONTEVIDEO",null,{"$f":"SUM(D11:E11)","v":20768},{"$f":"SUM(D12:D24)","v":8016},{"$f":"SUM(E12:E24)","v":12752},{"$f":"SUM(G11:H11)","v":130844},{"$f":"SUM(G12:G24)","v":51278},{"$f":"SUM(H12:H24)","v":79566},{"$f":"SUM(J11:K11)","v":6155},{"$f":"SUM(J12:J24)","v":2158},{"$f":"SUM(K12:K24)","v":3997}]
["UdelaR*",null,{"$f":"SUM(D12:E12)","v":16910},6075,10835,{"$f":"SUM(G12:H12)","v":112707},41901,70806,{"$f":"SUM(J12:K12)","v":5005},1649,3356]
["UCUDAL",null,1292,506,786,6063,2487,3576,354,130,224]
["Universidad ORT Uruguay",null,1181,669,512,6991,4125,2866,302,145,157]
["Universidad de Montevideo",null,357,188,169,1667,824,843,223,101,122]
["Universidad de la Empresa",null,570,325,245,1780,929,851,104,65,39]
["Inst Univ Autónomo del Sur",null,109,92,17,691,580,111,30,26,4]
["Inst Univ Asociación Cristiana de Jóvenes",null,208,129,79,515,328,187,70,30,40]
["Inst Metodista Univ Crandon",null,22,0,22,48,1,47,22,1,21]
["Inst Univ Monseñor Mariano Soler",null,16,13,3,61,58,3,6,6,0]
["Inst Univ Bios",null,16,8,8,51,21,30,18,5,13]
["Inst Univ CEDIIAP",null,68,4,64,227,11,216,21,0,21]
["Inst Univ CLAEH ",null,{"$f":"SUM(D23:E23)","v":19},7,12,{"$f":"SUM(G23:H23)","v":43},13,30,{"$f":"SUM(J23:K23)","v":0},0,0]
["Escuela Naval",null,"s/d","s/d","s/d","s/d","s/d","s/d","s/d","s/d","s/d"]
["RESTO DEL PAÍS",null,{"$f":"+D25+E25","v":2177},{"$f":"+D26+D31+D32+D35+D36+D37+D38","v":787},{"$f":"+E26+E31+E32+E35+E36+E37+E38","v":1390},{"$f":"+G25+H25","v":1576},{"$f":"+G26+G31+G32+G35+G36+G37+G38","v":579},{"$f":"+H26+H31+H32+H35+H36+H37+H38","v":997},{"$f":"+J25+K25","v":321},{"$f":"+J26+J31+J32+J35+J36+J37+J38","v":104},{"$f":"+K26+K31+K32+K35+K36+K37+K38","v":217}]
["Maldonado",null,{"$f":"SUM(D26:E26)","v":778},{"$f":"SUM(D27:D30)","v":314},{"$f":"SUM(E27:E30)","v":464},{"$f":"SUM(G26:H26)","v":1052},{"$f":"SUM(G27:G30)","v":392},{"$f":"SUM(H27:H30)","v":660},{"$f":"SUM(J26:K26)","v":76},{"$f":"SUM(J27:J30)","v":37},{"$f":"SUM(K27:K30)","v":39}]
["  UdelaR",null,509,214,295,"S/D","S/D","S/D",34,22,12]
["  UCUDAL",null,83,31,52,{"$f":"SUM(G28:H28)","v":252},117,135,4,1,3]
["  Inst Univ Francisco de Asís ",null,63,29,34,{"$f":"SUM(G29:H29)","v":489},156,333,9,1,8]
["  Inst Univ CLAEH ",null,123,40,83,{"$f":"SUM(G30:H30)","v":311},119,192,29,13,16]
["Paysandú - UdelaR",null,390,147,243,"S/D","S/D","S/D",142,38,104]
["Salto",null,630,{"$f":"SUM(D33:D34)","v":236},{"$f":"SUM(E33:E34)","v":394},{"$f":"SUM(G32:H32)","v":524},{"$f":"SUM(G33:G34)","v":187},{"$f":"SUM(H33:H34)","v":337},99,{"$f":"SUM(J33:J34)","v":28},{"$f":"SUM(K33:K34)","v":71}]
["  UdelaR ",null,517,182,335,{"$f":"SUM(G33:H33)","v":184},37,147,99,28,71]
["  UCUDAL",null,113,54,59,{"$f":"SUM(G34:H34)","v":340},150,190,"S/D"]
["Artigas - UdelaR",null,6,3,3,"S/D",null,null,"S/D"]
["Rivera - UdelaR",null,219,41,178,"S/D",null,null,"S/D"]
["Rocha - UdelaR",null,123,32,91,"S/D",null,null,{"$f":"SUM(J37:K37)","v":3},1,2]
["Tacuarembó - UdelaR",null,31,14,17,"S/D",null,null,1,0,1]
["Fuente: Oficinas Productoras de cada una de las Instituciones. "]
["Nota: * no se dispone de datos correspondientes a matrícula para el año 2011, se incorpora el último dato disponible. (último dato disponible CENSO 2007)."]
["Las expresión “Estudiantes” hace referencia a relaciones entre personas e instituciones y no al conteo de personas físicas. De manera que una persona puede ser estudiante de más de una institución o región, ostentando en cualquiera de ambas categorías inserciones múltiples y en cada caso será contada como personas diferentes."]
[]
["        "]
["        "]
["        "]
["        "]
["        "]
["        "]

{"sheet":"II-6.2.2 ","index":209,"n_rows":288,"n_cols":9,"rows_kept":288,"cut":false,"hidden":false,"merged":[[219,6,220,8],[223,0,223,6],[223,7,223,9],[224,1,226,1],[224,2,224,3],[224,4,226,4],[224,5,224,6],[225,2,225,3],[225,5,225,6],[160,1,162,1],[160,2,160,3],[160,4,162,4],[160,5,160,6],[161,2,161,3],[161,5,161,6],[159,0,159,6],[159,7,159,9],[83,6,84,8],[87,0,87,6],[88,1,90,1],[88,2,88,3],[88,4,90,4],[88,5,88,6],[89,2,89,3],[89,5,89,6],[105,1,107,1],[105,4,107,4],[122,1,124,1],[122,4,124,4],[155,6,156,8],[0,6,1,8],[4,0,4,6],[5,1,7,1],[5,2,5,3],[5,4,7,4],[5,5,5,6],[6,2,6,3],[6,5,6,6]]}
["UNIVERSIDAD DE LA REPÚBLICA: OFERTA DE GRADO",null,null,null,null,null,"ALUMNOS MATRICULADOS"]
[]
["Cuadro Nº II-622"]
[]
["ALUMNOS INGRESADOS Y EGRESADOS EN PROGRAMAS DE GRADO POR SEXO SEGÚN SERVICIO UNIVERSITARIO Y CARRERA AÑO 2011"]
[null,"TOTAL","INGRESADOS",null,"TOTAL","EGRESADOS"]
["SERVICIO UNIVERSITARIO / CARRERA",null,"SEXO",null,null,"SEXO"]
[null,null,"M","F",null,"M","F"]
["TOTAL",{"$f":"SUM(C9:D9)","v":18705},{"$f":"C11+C27+C35+C53+C68+C72+C76+C79+C92+C95+C103+C113+C118+C123+C128+C136+C139+C164+C168+C173+C204+C228+C241+C250+C259+C267+C272+C23+C42","v":6708},{"$f":"D11+D27+D35+D53+D68+D72+D76+D79+D92+D95+D103+D113+D118+D123+D128+D136+D139+D164+D168+D173+D204+D228+D241+D250+D259+D267+D272+D23+D42","v":11997},{"$f":"SUM(F9:G9)","v":5284},{"$f":"F11+F27+F35+F53+F68+F72+F76+F79+F92+F95+F103+F113+F118+F123+F128+F136+F139+F164+F168+F173+F204+F228+F241+F250+F259+F267+F272+F23+F42","v":1738},{"$f":"G11+G27+G35+G53+G68+G72+G76+G79+G92+G95+G103+G113+G118+G123+G128+G136+G139+G164+G168+G173+G204+G228+G241+G250+G259+G267+G272+G23+G42","v":3546}]
[]
["FACULTAD DE HUMANIDADES Y CIENCIAS DE LA EDUCACIÓN",{"$f":"SUM(C11:D11)","v":1166},{"$f":"SUM(C12:C21)","v":314},{"$f":"SUM(D12:D21)","v":852},{"$f":"SUM(F11:G11)","v":69},{"$f":"SUM(F12:F21)","v":17},{"$f":"SUM(G12:G21)","v":52}]
["Lic en Ciencias Antropológicas",141,54,87,14,6,8]
["Lic en Ciencias de la Educación",183,36,147,21,4,17]
["Lic en Ciencias Históricas",101,48,53,4,2,2]
["Lic en Filosofía",104,50,54,8,3,5]
["Lic en Letras",109,34,75,6,0,6]
["Lic en Turismo",0,0,0,1,0,1]
["Lic en Lingüística",58,15,43,4,1,3]
["Téc Universitario en Interpretación LSU ",22,0,22,1,1,0]
["Téc Universitario en Corrección de Estilo",113,10,103,10,0,10]
["Técnico Universitario en Museología",335,67,268,0,0,0]
[]
["FACULTAD DE AGRONOMÍA -",{"$f":"SUM(C23:D23)","v":419},{"$f":"SUM(C24:C25)","v":274},{"$f":"SUM(D24:D25)","v":145},{"$f":"SUM(F23:G23)","v":146},{"$f":"SUM(F24:F25)","v":114},{"$f":"SUM(G24:G25)","v":32}]
["Ingeniero Agrónomo",{"$f":"SUM(C24:D24)","v":356},244,112,{"$f":"SUM(F24:G24)","v":146},114,32]
["Ingeniero Agrónomo (Salto)(5)",{"$f":"SUM(C25:D25)","v":63},30,33,"S/D",0,0]
[]
["FACULTAD DE ARQUITECTURA -",{"$f":"SUM(C27:D27)","v":882},{"$f":"SUM(C28:C33)","v":313},{"$f":"SUM(D28:D33)","v":569},{"$f":"SUM(F27:G27)","v":285},{"$f":"SUM(F28:F33)","v":126},{"$f":"SUM(G28:G33)","v":159}]
["Arquitecto",572,240,332,{"$f":"SUM(F28:G28)","v":273},125,148]
["Arquitecto (Salto)(5)",25,11,14,{"$f":"SUM(F29:G29)","v":0},0,0]
["Licenciado en Diseño Industrial",98,28,70,10,1,9]
["Licenciado en Diseño Textil y Moda",98,2,96,2,0,2]
["Diseño de Paisaje(Maldonado)(10)",61,22,39,0,0,0]
["Licenciado en Diseño de Comunicación Visual (8)",28,10,18,0,0,0]
[]
["FACULTAD DE CIENCIAS ECONÓMICAS Y ADMINISTRACIÓN",{"$f":"SUM(C35:D35)","v":1955},{"$f":"SUM(C36:C40)","v":868},{"$f":"SUM(D36:D40)","v":1087},{"$f":"SUM(F35:G35)","v":495},{"$f":"SUM(F36:F40)","v":180},{"$f":"SUM(G36:G40)","v":315}]
["Ciclo Básico",{"$f":"SUM(C36:D36)","v":1838},814,1024,"N/C"]
["Lic en Estadística",{"$f":"SUM(C37:D37)","v":117},54,63,{"$f":"SUM(F37:G37)","v":7},2,5]
["Contador Público","N/C",null,null,{"$f":"SUM(F38:G38)","v":372},140,232]
["Lic en Economía (Plan 1990)","N/C",null,null,{"$f":"SUM(F39:G39)","v":89},30,59]
["Lic en Administración-Contador (Plan 1990)","N/C",null,null,{"$f":"SUM(F40:G40)","v":27},8,19]
[]
["FACULTAD DE DERECHO",{"$f":"SUM(C42:D42)","v":1716},{"$f":"SUM(C43:C51)","v":543},{"$f":"SUM(D43:D51)","v":1173},{"$f":"SUM(F42:G42)","v":814},{"$f":"SUM(F43:F51)","v":218},{"$f":"SUM(G43:G51)","v":596}]
["Téc en Relaciones Laborales",0,0,0,{"$f":"SUM(F43:G43)","v":56},11,45]
["Dr en Derecho – Escribano Público",1090,320,770,"N/C"]
["Dr en Derecho – Escribano Público (Salto)",113,36,77,"N/C"]
["Traductor Público",33,9,24,25,3,22]
["Dr en Derecho","N/C",null,null,349,116,233]
["Dr en Derecho (Salto)","N/C",null,null,28,13,15]
["Escribano Público","N/C",null,null,250,45,205]
["Escribano Público (Salto)","N/C",null,null,13,1,12]
["Lic en Relaciones Internacionales",{"$f":"SUM(C51:D51)","v":480},178,302,93,29,64]
[]
["FACULTAD DE INGENIERÍA",{"$f":"SUM(C53:D53)","v":1295},{"$f":"SUM(C54:C66)","v":1022},{"$f":"SUM(D54:D66)","v":273},{"$f":"SUM(F53:G53)","v":262},{"$f":"SUM(F54:F66)","v":210},{"$f":"SUM(G54:G66)","v":52}]
["Tecnólogo Mecánico (1)",52,50,2,{"$f":"SUM(F54:G54)","v":12},12,0]
["Tecnólogo Mecánico (Paysandú)(1)",10,9,1,"s/d"]
["Tecnólogo Informática (1)",15,11,4,{"$f":"SUM(F56:G56)","v":2},2,0]
["Tecnólogo Informática (Paysandú)(1)",28,22,6,"s/d"]
["Tecnólogo Informática (Maldonado)(1)",21,17,4,5,5,0]
["Tecnólogo en Telecomunicaciones (Rocha)(1)",22,16,6,3,1,2]
["Ingeniero Naval",9,7,2,2,1,1]
["Ingeniero Civil",172,102,70,46,33,13]
["Ingeniero Industrial Mecánico",113,93,20,23,21,2]
["Ingeniero Electricista",156,125,31,61,51,10]
["Ingeniero en Computación",651,543,108,105,82,23]
["Agrimensura",24,17,7,3,2,1]
["Ingeniero de Producción",22,10,12,"s/d"]
[]
["FACULTAD DE INGENIERÍA y QUÍMICA",{"$f":"SUM(C68:D68)","v":120},{"$f":"SUM(C69:C70)","v":48},{"$f":"SUM(D69:D70)","v":72},{"$f":"SUM(F68:G68)","v":46},{"$f":"SUM(F69:F70)","v":22},{"$f":"SUM(G69:G70)","v":24}]
["Ingeniero Químico (2)",{"$f":"SUM(C69:D69)","v":118},48,70,{"$f":"SUM(F69:G69)","v":46},22,24]
["Ingeniero Químico (Salto)(2)(5)",{"$f":"SUM(C70:D70)","v":2},0,2,"s/d"]
[]
["FACULTAD DE AGRONOMÍA, INGENIERÍA, QUÍMICA y VETERINARIA",{"$f":"SUM(C72:D72)","v":83},{"$f":"SUM(C73:C74)","v":22},{"$f":"SUM(D73:D74)","v":61},{"$f":"SUM(F72:G72)","v":23},{"$f":"SUM(F73:F74)","v":2},{"$f":"SUM(G73:G74)","v":21}]
["Ingeniero Alimentario (3)",{"$f":"SUM(C73:D73)","v":82},22,60,{"$f":"SUM(F73:G73)","v":23},2,21]
["Ingeniero Alimentario (Salto)(3)",{"$f":"SUM(C74:D74)","v":1},0,1,"s/d"]
[]
["FACULTAD DE INGENIERÍA y CIENCIAS",{"$f":"SUM(C76:D76)","v":16},{"$f":"+SUM(C77)","v":8},{"$f":"+SUM(D77)","v":8},{"$f":"SUM(F76:G76)","v":0},{"$f":"+SUM(F77)","v":0},{"$f":"+SUM(G77)","v":0}]
["Lic en Ciencias de la Atmósfera (4)",{"$f":"SUM(C77:D77)","v":16},8,8,"S/D"]
[]
["FACULTAD DE AGRONOMÍA, INGENIERÍA, QUÍMICA y CETP-UTU",{"$f":"SUM(C79:D79)","v":37},{"$f":"SUM(C80:C81)","v":17},{"$f":"SUM(D80:D81)","v":20},{"$f":"SUM(F79:G79)","v":0},{"$f":"+F80","v":0},{"$f":"+G80","v":0}]
["Tecnólogo Agroenergético (Artigas) (9)",{"$f":"SUM(C80:D80)","v":6},3,3,"s/d"]
["Tecnólogo Carnico (Tacuarembó)(9)",{"$f":"SUM(C81:D81)","v":31},14,17,"s/d"]
[null,null,null,null,null,null,null,null,"(Continúa)"]
[]
["UNIVERSIDAD DE LA REPÚBLICA: OFERTA DE GRADO",null,null,null,null,null,"ALUMNOS MATRICULADOS"]
[]
["Cuadro Nº II-622  (continuación)"]
[]
["ALUMNOS INGRESADOS Y EGRESADOS EN PROGRAMAS DE GRADO POR SEXO SEGÚN SERVICIO UNIVERSITARIO Y CARRERA AÑO 2011"]
[null,"TOTAL","INGRESADOS",null,"TOTAL","EGRESADOS"]
["SERVICIO UNIVERSITARIO / CARRERA",null,"SEXO",null,null,"SEXO"]
[null,null,"M","F",null,"M","F"]
["FACULTAD DE MEDICINA",{"$f":"SUM(C92:D92)","v":1164},{"$f":"SUM(C93)","v":344},{"$f":"SUM(D93)","v":820},{"$f":"SUM(F92:G92)","v":574},{"$f":"SUM(F93)","v":215},{"$f":"SUM(G93)","v":359}]
["Dr en Medicina",{"$f":"SUM(C93:D93)","v":1164},344,820,{"$f":"SUM(F93:G93)","v":574},215,359]
[]
["FACULTAD DE ODONTOLOGÍA ",{"$f":"SUM(C95:D95)","v":406},{"$f":"SUM(C96:C101)","v":80},{"$f":"SUM(D96:D101)","v":326},{"$f":"SUM(F95:G95)","v":288},{"$f":"SUM(F96:F101)","v":52},{"$f":"SUM(G96:G101)","v":236}]
["Dr en Odontología",{"$f":"SUM(C96:D96)","v":233},57,176,{"$f":"SUM(F96:G96)","v":156},33,123]
["Laboratorista en Odontología",{"$f":"SUM(C97:D97)","v":66},15,51,{"$f":"SUM(F97:G97)","v":75},15,60]
["Higienista en Odontología",36,3,33,19,2,17]
["Higienista en Odontología (Rivera)",13,1,12,0,0,0]
["Asistente en Odontología",44,3,41,38,2,36]
["Asistente en Odontología(Rivera)",14,1,13,0,0,0]
[]
["FACULTAD DE QUÍMICA",{"$f":"SUM(C103:D103)","v":356},{"$f":"SUM(C104:C111)","v":93},{"$f":"SUM(D104:D111)","v":263},{"$f":"SUM(F103:G103)","v":96},{"$f":"SUM(F104:F111)","v":28},{"$f":"SUM(G104:G111)","v":68}]
["Téc Químico (7)",{"$f":"SUM(C104:D104)","v":22},8,14,4,1,3]
["Téc Químico (Paysandú)(7)",{"$f":"SUM(C105:D105)","v":21},4,17,0,0,0]
["Bioquímico Clínico",{"$f":"SUM(C106:D106)","v":102},22,80,15,1,14]
["Bioquímico Clínico (Salto)(5)",2,1,1,0,0,0]
["Licenciatura en Química",0,0,0,10,3,7]
["Químico Farmacéutico",139,28,111,61,18,43]
["Químico Farmacéutico (Salto)(5)",4,1,3,0,0,0]
["Químico ",66,29,37,6,5,1]
[]
["FACULTAD DE VETERINARIA ",{"$f":"SUM(C113:D113)","v":564},{"$f":"SUM(C114:C116)","v":205},{"$f":"SUM(D114:D116)","v":359},{"$f":"SUM(F113:G113)","v":126},{"$f":"SUM(F114:F116)","v":65},{"$f":"SUM(G114:G116)","v":61}]
["Dr en Ciencias Veterinarias",{"$f":"SUM(C114:D114)","v":498},172,326,{"$f":"SUM(F114:G114)","v":116},62,54]
["Dr en Ciencias Veterinarias (Salto)",{"$f":"SUM(C115:D115)","v":66},33,33,"-"]
["Dr en Medicina y Tecnología Veterinaria","N/C",null,null,{"$f":"SUM(F116:G116)","v":10},3,7]
[]
["ESCUELA UNIV DE BIBLIOTECOLOGÍA Y CS AFINES",{"$f":"SUM(C118:D118)","v":106},{"$f":"SUM(C119:C121)","v":27},{"$f":"SUM(D119:D121)","v":79},{"$f":"SUM(F118:G118)","v":38},{"$f":"SUM(F119:F121)","v":2},{"$f":"SUM(G119:G121)","v":36}]
["Archivólogo",{"$f":"SUM(C119:D119)","v":53},16,37,{"$f":"SUM(F119:G119)","v":15},2,13]
["Archivólogo (Paysandú)","S/D",null,null,{"$f":"SUM(F120:G120)","v":4},0,4]
["Lic en Bibliotecología",{"$f":"SUM(C121:D121)","v":53},11,42,{"$f":"SUM(F121:G121)","v":19},0,19]
[]
["INSTITUTO ESCUELA NACIONAL DE BELLAS ARTES ",{"$f":"+C123+D123","v":534},{"$f":"SUM(C124:C126)","v":182},{"$f":"SUM(D124:D126)","v":352},{"$f":"+F123+G123","v":55},{"$f":"SUM(F124:F126)","v":20},{"$f":"SUM(G124:G126)","v":35}]
["Creador Plástico - Plan 1991","N/C","N/C","N/C",{"$f":"SUM(F124:G124)","v":40},18,22]
["Lic en Artes",{"$f":"SUM(C125:D125)","v":61},28,33,"N/C"]
["Lic en Artes - Artes Plásticas y Visuales",{"$f":"SUM(C126:D126)","v":473},154,319,{"$f":"SUM(F126:G126)","v":15},2,13]
[]
["FACULTAD DE ENFERMERÍA ",{"$f":"SUM(C128:D128)","v":596},{"$f":"SUM(C129:C133)","v":89},{"$f":"SUM(D129:D133)","v":507},{"$f":"SUM(F128:G128)","v":229},{"$f":"SUM(F129:F134)","v":31},{"$f":"SUM(G129:G134)","v":198}]
["Carrera Escalonada",5,0,5,"N/C"]
["Carrera Escalonada (Rivera)",150,20,130,"N/C"]
["Carrera Escalonada (Rocha)",83,12,71,"N/C"]
["Lic en Enfermería",300,43,257,{"$f":"SUM(F132:G132)","v":206},22,184]
["Lic en Enfermería (Salto)",58,14,44,{"$f":"SUM(F133:G133)","v":22},9,13]
["Lic en Enfermería (Tacuarembó)","N/C",null,null,{"$f":"SUM(F134:G134)","v":1},0,1]
[]
["ESCUELA DE NUTRICIÓN Y DIETÉTICA",{"$f":"SUM(C136:D136)","v":343},{"$f":"C137","v":52},{"$f":"D137","v":291},{"$f":"+F136+G136","v":86},{"$f":"F137","v":5},{"$f":"G137","v":81}]
["Lic en Nutrición",{"$f":"SUM(C137:D137)","v":343},52,291,{"$f":"SUM(F137:G137)","v":86},5,81]
[]
["ESCUELA UNIVERSITARIA DE MÚSICA",{"$f":"SUM(C139:D139)","v":54},{"$f":"SUM(C140:C147)","v":33},{"$f":"SUM(D140:D147)","v":21},{"$f":"SUM(F139:G139)","v":12},{"$f":"SUM(F140:F147)","v":7},{"$f":"SUM(G140:G147)","v":5}]
["Téc en Dirección de Coros (Salto)",3,1,2,{"$f":"SUM(F140:G140)","v":1},1,0]
["Técnico en Interpretación Musical (Salto)",9,8,1,"N/C"]
["Lic en Interpretación Instrumental","N/C",null,null,{"$f":"SUM(F142:G142)","v":2},2,0]
["Lic en Interpretación Musical",14,7,7,4,3,1]
["Lic en Interpretación Musical (Rivera)",1,1,0,"N/C"]
["Licenciado en Música",26,16,10,3,1,2]
["Licenciado en Música (Rocha)",1,0,1,"N/C"]
["Licenciado en Musicología","N/C",null,null,2,0,2]
[]
[null,null,null,null,null,null,null,null,"(Continúa)"]
[]
[]
[]
[]
[]
[]
["UNIVERSIDAD DE LA REPÚBLICA: OFERTA DE GRADO",null,null,null,null,null,"ALUMNOS MATRICULADOS"]
[]
["Cuadro Nº II-622  (continuación)"]
[]
["ALUMNOS INGRESADOS Y EGRESADOS EN PROGRAMAS DE GRADO POR SEXO SEGÚN SERVICIO UNIVERSITARIO Y CARRERA AÑO 2011"]
[null,"TOTAL","INGRESADOS",null,"TOTAL","EGRESADOS"]
["SERVICIO UNIVERSITARIO / CARRERA",null,"SEXO",null,null,"SEXO"]
[null,null,"M","F",null,"M","F"]
["ESCUELA DE PARTERAS",{"$f":"SUM(C164:D164)","v":408},{"$f":"SUM(C165:C166)","v":39},{"$f":"SUM(D165:D166)","v":369},{"$f":"SUM(F164:G164)","v":70},{"$f":"SUM(F165:F166)","v":0},{"$f":"SUM(G165:G166)","v":70}]
["Obstetra - Partera",{"$f":"SUM(C165:D165)","v":346},39,307,{"$f":"SUM(F165:G165)","v":37},0,37]
["Obstétrica (Carrera Binacional)(6)",{"$f":"SUM(C166:D166)","v":62},0,62,{"$f":"SUM(F166:G166)","v":33},0,33]
[]
["FACULTAD DE PSICOLOGÍA",{"$f":"SUM(C168:D168)","v":1284},{"$f":"SUM(C169:C171)","v":332},{"$f":"SUM(D169:D171)","v":952},{"$f":"SUM(F168:G168)","v":473},{"$f":"SUM(F169:F171)","v":81},{"$f":"SUM(G169:G171)","v":392}]
["Lic en Psicología",{"$f":"SUM(C169:D169)","v":1284},332,952,{"$f":"SUM(F169:G169)","v":470},80,390]
["Psicólogo","-",null,null,{"$f":"SUM(F170:G170)","v":2},0,2]
["Técnico en Psicología Infantil","-",null,null,{"$f":"SUM(F171:G171)","v":1},1,0]
[]
["ESCUELA DE TECNOLOGÍA MEDICA",{"$f":"SUM(C173:D173)","v":746},{"$f":"SUM(C174:C202)","v":141},{"$f":"SUM(D174:D202)","v":605},{"$f":"SUM(F173:G173)","v":219},{"$f":"SUM(F174:F202)","v":45},{"$f":"SUM(G174:G202)","v":174}]
["Técnico en Anatomía Patológica",18,1,17,7,0,7]
["Técnico en Anatomía Patológica (Paysandú)",4,1,3,5,2,3]
["Técnico en Cosmetología Médica",30,1,29,14,0,14]
["Técnico en Hemoterapia",7,1,6,2,0,2]
["Técnico en Hemoterapia (Paysandú)",22,6,16,12,7,5]
["Técnico en Podología Médica (Paysandú)",41,12,29,8,0,8]
["Técnico en Podología Médica",20,4,16,4,0,4]
["Técnico en Radioisótopos",10,3,7,6,2,4]
["Técnico en Radioterapia",9,0,9,4,1,3]
["Técnico en Radioterapia (Paysandú)",0,0,0,2,0,2]
["Licenciado en Fisioterapia",51,20,31,32,11,21]
["Licenciado en Fisioterapia (Paysandú)",31,2,29,6,0,6]
["Licenciado en Fonoaudiología",33,21,12,5,4,1]
["Licenciado en Imagenología",19,7,12,6,1,5]
["Licenciado en Imagenología (Paysandú)",48,5,43,17,2,15]
["Licenciado en Instrumentación Quirúrgica",10,2,8,7,2,5]
["Licenciado en Instrumentación Quirúrgica (Paysandú)",94,13,81,19,4,15]
["Licenciado en Laboratorio Clínico",10,0,10,6,0,6]
["Licenciado en Laboratorio Clínico (Paysandú)",27,3,24,7,4,3]
["Licenciado en Neumocardiología",24,9,15,6,1,5]
["Licenciado en Neurofisiología Clínica",28,6,22,0,0,0]
["Licenciado en Oftalmología",0,0,0,1,0,1]
["Licenciado en Psicomotricidad",23,0,23,6,0,6]
["Licenciado en Psicomotricidad (Paysandú)",35,0,35,20,0,20]
["Licenciado en Registros Médicos",69,10,59,0,0,0]
["Licenciado en Terapia Ocupacional",30,1,29,"S/D",0,0]
["Técnico en Salud Ocupacional",23,5,18,{"$f":"SUM(F200:G200)","v":3},0,3]
["Técnico en Radiología",30,8,22,13,4,9]
["Licenciado en Fisioterapia",0,0,0,1,0,1]
[]
["CIENCIAS DE LA COMUNICACIÓN",{"$f":"SUM(C204:D204)","v":638},{"$f":"SUM(C205:C205)","v":259},{"$f":"SUM(D205:D205)","v":379},{"$f":"SUM(F204:G204)","v":155},{"$f":"SUM(F205:F205)","v":57},{"$f":"SUM(G205:G205)","v":98}]
["Lic en Ciencias de la Comunicación……",{"$f":"SUM(C205:D205)","v":638},259,379,{"$f":"SUM(F205:G205)","v":155},57,98]
[]
[null,null,null,null,null,null,null,null,"(Continúa)"]
[]
[]
[]
[]
[]
[]
[]
[]
[]
[]
[]
[]
["UNIVERSIDAD DE LA REPÚBLICA: OFERTA DE GRADO",null,null,null,null,null,"ALUMNOS MATRICULADOS"]
[]
["Cuadro Nº II-622  (continuación)"]
[]
["ALUMNOS INGRESADOS Y EGRESADOS EN PROGRAMAS DE GRADO POR SEXO SEGÚN SERVICIO UNIVERSITARIO Y CARRERA AÑO 2011"]
[null,"TOTAL","INGRESADOS",null,"TOTAL","EGRESADOS"]
["SERVICIO UNIVERSITARIO / CARRERA",null,"SEXO",null,null,"SEXO"]
[null,null,"M","F",null,"M","F"]
["FACULTAD DE CIENCIAS",{"$f":"SUM(C228:D228)","v":598},{"$f":"SUM(C229:C239)","v":278},{"$f":"SUM(D229:D239)","v":320},{"$f":"SUM(F228:G228)","v":158},{"$f":"SUM(F229:F239)","v":54},{"$f":"SUM(G229:G239)","v":104}]
["Licenciado en Matemática",54,31,23,1,1,0]
["Licenciado en Física   ",114,69,45,2,1,1]
["Licenciado en Biología Humana (12)",23,6,17,1,0,1]
["Licenciado en Biología Humana (Paysandú)(12)",5,0,5,"S/D"]
["Licenciado en Biología Humana (Salto)(12)",3,2,1,"S/D"]
["Licenciado en Recursos Naturales (Rivera)",41,18,23,"S/D"]
["Licenciado en Bioquímica",113,45,68,67,21,46]
["Licenciado en Física Médica (11)",29,18,11,0,0,0]
["Licenciado de Geografía",13,7,6,1,0,1]
["Licenciado de Geología",27,10,17,3,1,2]
["Licenciado en Ciencias Biológicas",176,72,104,83,30,53]
[]
["FACULTAD DE CIENCIAS SOCIALES",{"$f":"SUM(C241:D241)","v":1062},{"$f":"SUM(C242:C248)","v":264},{"$f":"SUM(D242:D248)","v":798},{"$f":"SUM(F241:G241)","v":220},{"$f":"SUM(F242:F248)","v":46},{"$f":"SUM(G242:G248)","v":174}]
["Estudios Iniciales en Ciencias Sociales ",{"$f":"SUM(C242:D242)","v":933},243,690,"N/C"]
["Estudios Iniciales en Ciencias Sociales (Salto)",{"$f":"SUM(C243:D243)","v":129},21,108,"N/C"]
["Licenciado en Ciencia Política","N/C",null,null,16,8,8]
["Licenciado en Sociología","N/C",null,null,54,22,32]
["Licenciado en Ciencias Sociales (Salto)","N/C",null,null,4,1,3]
["Licenciado en Trabajo Social","N/C",null,null,115,12,103]
["Licenciado en Trabajo Social (Salto)","N/C",null,null,31,3,28]
[]
["INSTITUTO SUPERIOR DE EDUCACIÓN FÍSICA",{"$f":"SUM(C250:D250)","v":336},{"$f":"SUM(C251:C257)","v":216},{"$f":"SUM(D251:D257)","v":120},{"$f":"SUM(F250:G250)","v":180},{"$f":"SUM(F251:F257)","v":102},{"$f":"SUM(G251:G257)","v":78}]
["Licenciado en Educación Física (Maldonado)",{"$f":"SUM(C251:D251)","v":72},35,37,{"$f":"SUM(F251:G251)","v":27},17,10]
["Licenciado en Educación Física (Paysandú)",{"$f":"SUM(C252:D252)","v":72},50,22,{"$f":"SUM(F252:G252)","v":51},29,22]
["Licenciado en Educación Física",80,42,38,91,45,46]
["Técnico Deportivo Superior – Fútbol",45,44,1,9,9,0]
["Técnico Deportivo Superior – Básquetbol",{"$f":"SUM(C255:D255)","v":0},0,0,{"$f":"SUM(F255:G255)","v":2},2,0]
["Técnico Deportivo Superior - Volley (Maldonado)",{"$f":"SUM(C256:D256)","v":21},11,10,{"$f":"SUM(F256:G256)","v":0},0,0]
["Técnico Deportivo Superior - Básquetbol (Paysandú)",{"$f":"SUM(C257:D257)","v":46},34,12,{"$f":"SUM(F257:G257)","v":0},0,0]
[]
["ESCUELA DE ADMINISTRACIÓN",{"$f":"SUM(C259:D259)","v":1494},{"$f":"SUM(C260:C265)","v":517},{"$f":"SUM(D260:D265)","v":977},{"$f":"SUM(F259:G259)","v":165},{"$f":"SUM(F260:F265)","v":39},{"$f":"SUM(G260:G265)","v":126}]
["Técnico Universitario en Administración ",{"$f":"SUM(C260:D260)","v":1475},513,962,{"$f":"SUM(F260:G260)","v":159},39,120]
["Técnico Universitario en Administración (Maldonado)","N/C",null,null,{"$f":"SUM(F261:G261)","v":2},0,2]
["Técnico en Administración de Empresas ","N/C",null,null,3,0,3]
["Técnico en Administración Pública ","N/C",null,null,1,0,1]
["Técnico en Gestión Universitaria",{"$f":"SUM(C264:D264)","v":17},3,14,"N/C",0,0]
["Técnico en Gestión Universitaria (Salto)",2,1,1,"N/C",0,0]
[]
["Área Cs y Tecnológía",{"$f":"SUM(C267:D267)","v":76},{"$f":"SUM(C268:C270)","v":43},{"$f":"SUM(D268:D270)","v":33},"N/C","N/C","N/C"]
["Ciclo Inicial Optativo (Salto)",{"$f":"SUM(C268:D268)","v":37},23,14,"N/C"]
["Ciclo Inicial Optativo (Rocha)",{"$f":"SUM(C269:D269)","v":17},4,13,"N/C"]
["Ciclo Inicial Optativo (Maldonado)",22,16,6,"N/C"]
[]
[" Área Social",{"$f":"SUM(C272:D272)","v":251},{"$f":"SUM(C273:C273)","v":85},{"$f":"SUM(D273:D273)","v":166},"N/C","N/C","N/C"]
["Ciclo Inicial Optativo (Salto)",{"$f":"SUM(C273:D273)","v":251},85,166,"N/C"]
[]
["Fuente: División Estadística - Dirección General de Planeamiento - UdelaR"]
["Notas:"]
["(1) Título expedido por UdelaR y CETP-UTU"]
["(2) Se dicta con la participación de las Facultades de Ingeniería y Química El ingreso puede realizarse en cualquiera de las dos Facultades"]
["(3) Se dicta con la participación de las Facultades de Agronomía, Ingeniería, Química y Veterinaria El ingreso a esta carrera, así como los primeros años son administrados por la Facultad de Química, y los últimos años por la Facultad de Ingeniería"]
["(4) Se dicta con la participación de las Facultades de Ingeniería y Ciencias"]
["(5) En dicho departamento la carrera se cursa de modo parcial"]
["(6) Carrera Binacional de Obstetricia que se ducta en Paysandú y Entre Ríos - Argentina"]
["(7) Carrera dictada en conjunto con CETP-UTU"]
["(8) Carrera compartida entre la Facultad de Arquitectura y el Instituto Escuela Nacional de Bellas Artes"]
["(9) Se dicta con la participación de las Facultades de Agronomía, Química, Ingeniería, Veterinaria y CETP-UTU"]
["(10) Carrera compartida entre la Facultades de Agronomía y Arquitectura"]
["(11) Carrera compartida entre las Facultades de Ciencias y Medicina"]
["(12) Carrera compartida entre las Facultades de Ciencias, Humanidades, Medicina y Odontología"]

{"sheet":"II-6.2.3 ","index":210,"n_rows":177,"n_cols":32,"rows_kept":177,"cut":false,"hidden":false,"merged":[[140,8,140,9],[141,2,141,3],[141,5,141,6],[141,8,141,9],[140,0,142,0],[140,1,142,1],[140,2,140,3],[140,4,142,4],[140,5,140,6],[140,7,142,7],[139,0,139,9],[91,0,93,0],[91,1,93,1],[91,2,91,3],[91,4,93,4],[91,5,91,6],[91,7,93,7],[91,8,91,9],[92,2,92,3],[92,5,92,6],[92,8,92,9],[135,5,136,8],[90,0,90,9],[6,5,6,6],[6,8,6,9],[43,5,44,8],[47,0,47,9],[48,0,50,0],[48,1,50,1],[48,2,48,3],[48,4,50,4],[48,5,48,6],[48,7,50,7],[48,8,48,9],[49,2,49,3],[49,5,49,6],[49,8,49,9],[86,5,87,8],[0,5,1,8],[4,0,4,9],[5,0,7,0],[5,1,7,1],[5,2,5,3],[5,4,7,4],[5,5,5,6],[5,7,7,7],[5,8,5,9],[6,2,6,3]]}
["UNIVERSIDADES PRIVADAS: OFERTA DE GRADO",null,null,null,null,"ALUMNOS MATRICULADOS"]
[]
["Cuadro Nº II-6.2.3"]
[]
["ALUMNOS INGRESADOS, MATRICULADOS Y EGRESADOS EN PROGRAMAS DE GRADO DE UNIVERSIDADES PRIVADAS POR SEXO SEGÚN UNIVERSIDAD Y CARRERA. AÑO 2011."]
["UNIVERSIDAD / CARRERA","TOTAL","INGRESADOS",null,"TOTAL","MATRICULADOS",null,"TOTAL","EGRESADOS"]
[null,null,"SEXO",null,null,"SEXO",null,null,"SEXO"]
[null,null,"    M","   F",null,"M","F",null,"M","F"]
["TOTAL",{"$f":"SUM(C9:D9)","v":3596},{"$f":"+C11+C71+C111+C152","v":1773},{"$f":"+D11+D71+D111+D152","v":1823},{"$f":"SUM(F9:G9)","v":17093},{"$f":"+F11+F71+F111+F152","v":8632},{"$f":"+G11+G71+G111+G152","v":8461},{"$f":"SUM(I9:J9)","v":987},{"$f":"+I11+I71+I111+I152","v":442},{"$f":"+J11+J71+J111+J152","v":545},null,null,null,null,null,null,null,null,null,null,null,null,null,null,null,null,null,{"$f":"+AE9+AF9","v":3},null,null,1,2]
[null,null,null,null,null,null,null,null,null,null,null,null,null,null,null,null,null,null,null,null,null,null,null,null,null,null,null,{"$f":"+AE10+AF10","v":24},null,null,10,14]
["UCUDAL",{"$f":"SUM(C11:D11)","v":1488},{"$f":"+C13+C20+C32+C52+C57+C61+C69","v":591},{"$f":"+D13+D20+D32+D52+D57+D61+D69","v":897},{"$f":"SUM(F11:G11)","v":6655},{"$f":"+F13+F20+F32+F52+F57+F61+F69","v":2754},{"$f":"+G13+G20+G32+G52+G57+G61+G69","v":3901},{"$f":"SUM(I11:J11)","v":358},{"$f":"+I13+I20+I32+I52+I57+I61+I69","v":131},{"$f":"+J13+J20+J32+J52+J57+J61+J69","v":227}]
[]
["FACULTAD DE CIENCIAS HUMANAS",{"$f":"SUM(C13:D13)","v":214},{"$f":"SUM(C14:C18)","v":75},{"$f":"SUM(D14:D18)","v":139},{"$f":"SUM(F13:G13)","v":1133},{"$f":"SUM(F14:F18)","v":367},{"$f":"SUM(G14:G18)","v":766},{"$f":"SUM(I13:J13)","v":92},{"$f":"SUM(I14:I18)","v":31},{"$f":"SUM(J14:J18)","v":61}]
["Técnico en educación, Tiempo Libre y Recreación",17,8,9,67,35,32,9,6,3]
["Licenciatura en educación, Tiempo Libre y Recreación",20,13,7,27,14,13,0,0,0]
["Lic en Comunicación Social",130,47,83,821,287,534,67,21,46]
["Lic en Ciencias Sociales",21,7,14,108,30,78,9,3,6]
["Lic en Educación Inicial",26,0,26,110,1,109,7,1,6]
[]
["FACULTAD DE CIENCIAS EMPRESARIALES",{"$f":"SUM(C20:D20)","v":665},{"$f":"SUM(C21:C30)","v":289},{"$f":"SUM(D21:D30)","v":376},{"$f":"SUM(F20:G20)","v":2924},{"$f":"SUM(F21:F30)","v":1362},{"$f":"SUM(G21:G30)","v":1562},{"$f":"SUM(I20:J20)","v":97},{"$f":"SUM(I21:I30)","v":44},{"$f":"SUM(J21:J30)","v":53}]
["Contador Público",148,67,81,889,405,484,48,22,26]
["Contador Público (Maldonado)",58,23,35,156,70,86,0,0,0]
["Contador Público (Salto)",89,37,52,256,108,148,0,0,0]
["Lic en Dirección de Empresas",92,48,44,436,251,185,25,13,12]
["Lic en Dirección de Empresas (Maldonado)",25,8,17,92,46,46,3,1,2]
["Lic en Dirección de Empresas (Salto)",14,9,5,65,28,37,0,0,0]
["Lic en Negocios Internacionales",106,50,56,530,273,257,14,6,8]
["Lic en Recursos Humanos y Relaciones Laborales",51,9,42,189,36,153,1,0,1]
["Lic en Economía",38,20,18,155,87,68,4,2,2]
["Lic en Dirección de Empresas Turísticas",44,18,26,156,58,98,2,0,2]
[]
["FACULTAD DE INGENIERÍA Y TECNOLOGÍAS",{"$f":"SUM(C32:D32)","v":186},{"$f":"SUM(C33:C40)","v":150},{"$f":"SUM(D33:D40)","v":36},{"$f":"SUM(F32:G32)","v":869},{"$f":"SUM(F33:F40)","v":713},{"$f":"SUM(G33:G40)","v":156},{"$f":"SUM(I32:J32)","v":34},{"$f":"SUM(I33:I40)","v":31},{"$f":"SUM(J33:J40)","v":3}]
["Ingeniería en Informática",65,54,11,383,324,59,14,13,1]
["Ingeniería en Informática (Salto)",{"$f":"SUM(C34:D34)","v":10},8,2,{"$f":"SUM(F34:G34)","v":19},14,5,{"$f":"SUM(I34:J34)","v":0},0,0]
["Ingeniería en Electrónica",18,14,4,94,77,17,1,0,1]
["Ingeniería en Telecomunicación",9,6,3,65,51,14,5,5,0]
["Lic en Informática",24,20,4,91,79,12,13,13,0]
["Ingeniería Industrial",27,24,3,109,89,20,1,0,1]
["Ingeniería en Sistemas Eléctricos de Potencia",3,3,0,9,7,2,0,0,0]
["Licenciatura en Ingeniería Audiovisual",30,21,9,99,72,27,0,0,0]
[null,null,null,null,null,null,null,null,"(Continúa)"]
[]
[]
["UNIVERSIDADES PRIVADAS: OFERTA DE GRADO",null,null,null,null,"ALUMNOS MATRICULADOS"]
[]
["Cuadro Nº II-6.2.3 (continuación)"]
[]
["ALUMNOS INGRESADOS, MATRICULADOS Y EGRESADOS EN PROGRAMAS DE GRADO DE UNIVERSIDADES PRIVADAS POR SEXO SEGÚN UNIVERSIDAD Y CARRERA. AÑO 2011."]
["UNIVERSIDAD / CARRERA","TOTAL","INGRESADOS",null,"TOTAL","MATRICULADOS",null,"TOTAL","EGRESADOS"]
[null,null,"SEXO",null,null,"SEXO",null,null,"SEXO"]
[null,null,"    M","   F",null,"M","F",null,"M","F"]
["FACULTAD DE DERECHO",{"$f":"SUM(C52:D52)","v":77},{"$f":"SUM(C53:C55)","v":26},{"$f":"SUM(D53:D55)","v":51},{"$f":"SUM(F52:G52)","v":346},{"$f":"SUM(F53:F55)","v":136},{"$f":"SUM(G53:G55)","v":210},{"$f":"SUM(I52:J52)","v":34},{"$f":"SUM(I53:I55)","v":14},{"$f":"SUM(J53:J55)","v":20}]
["Dr en Derecho",{"$f":"SUM(C53:D53)","v":53},22,31,{"$f":"SUM(F53:G53)","v":293},122,171,{"$f":"SUM(I53:J53)","v":28},9,19]
["Dr en Derecho (Maldonado)",{"$f":"SUM(C54:D54)","v":0},0,0,{"$f":"SUM(F54:G54)","v":4},1,3,{"$f":"SUM(I54:J54)","v":1},0,1]
["Notariado",{"$f":"SUM(C55:D55)","v":24},4,20,{"$f":"SUM(F55:G55)","v":49},13,36,{"$f":"SUM(I55:J55)","v":5},5,0]
[]
["FACULTAD DE PSICOLOGÍA",{"$f":"SUM(C57:D57)","v":180},{"$f":"SUM(C58:C59)","v":33},{"$f":"SUM(D58:D59)","v":147},{"$f":"SUM(F57:G57)","v":680},{"$f":"SUM(F58:F59)","v":104},{"$f":"SUM(G58:G59)","v":576},{"$f":"SUM(I57:J57)","v":41},{"$f":"SUM(I58:I59)","v":5},{"$f":"SUM(J58:J59)","v":36}]
["Lic en Psicología",{"$f":"SUM(C58:D58)","v":151},32,119,{"$f":"SUM(F58:G58)","v":588},102,486,{"$f":"SUM(I58:J58)","v":38},5,33]
["Lic en Psicopedagogía",{"$f":"SUM(C59:D59)","v":29},1,28,{"$f":"SUM(F59:G59)","v":92},2,90,{"$f":"SUM(I59:J59)","v":3},0,3]
[]
["FACULTAD DE ENFERMERÍA Y TECNOLOGÍAS DE LA SALUD",{"$f":"SUM(C61:D61)","v":146},{"$f":"SUM(C62:C66)","v":14},{"$f":"SUM(D62:D66)","v":132},{"$f":"SUM(F61:G61)","v":598},{"$f":"SUM(F62:F66)","v":47},{"$f":"SUM(G62:G66)","v":551},{"$f":"SUM(I61:J61)","v":52},{"$f":"SUM(I62:I66)","v":3},{"$f":"SUM(J62:J66)","v":49}]
["Técnico en Acompañamiento Terapéutico",19,1,18,37,2,35,2,0,2]
["Lic en Enfermería",28,4,24,91,11,80,11,1,10]
["Licenciatura en Enfermería - Profesionalización",9,2,7,48,8,40,14,2,12]
["Lic en Psicomotricidad",45,3,42,191,8,183,8,0,8]
["Lic en Nutrición",45,4,41,231,18,213,17,0,17]
[]
["FACULTAD DE ODONTOLOGÍA -"]
["Dr en Odontología",{"$f":"SUM(C69:D69)","v":20},4,16,{"$f":"SUM(F69:G69)","v":105},25,80,{"$f":"SUM(I69:J69)","v":8},3,5]
[]
["UNIVERSIDAD ORT URUGUAY",{"$f":"SUM(C71:D71)","v":1181},{"$f":"+C73+C79+C95+C103","v":669},{"$f":"+D73+D79+D95+D103","v":512},{"$f":"SUM(F71:G71)","v":6991},{"$f":"+F73+F79+F95+F103","v":4125},{"$f":"+G73+G79+G95+G103","v":2866},{"$f":"SUM(I71:J71)","v":302},{"$f":"+I73+I79+I95+I103","v":145},{"$f":"+J73+J79+J95+J103","v":157}]
[null,null,null,null,null,null,null,null,null,null,null,null,null,null,null,null,null,null,null,null,null,null,null,null,null,null,null,null,null,null,17,15]
["FACULTAD DE ADMINISTRACIÓN Y CIENCIAS SOCIALES",{"$f":"SUM(C73:D73)","v":405},{"$f":"SUM(C74:C77)","v":233},{"$f":"SUM(D74:D77)","v":172},{"$f":"SUM(F73:G73)","v":2397},{"$f":"SUM(F74:F77)","v":1352},{"$f":"SUM(G74:G77)","v":1045},{"$f":"SUM(I73:J73)","v":120},{"$f":"SUM(I74:I77)","v":59},{"$f":"SUM(J74:J77)","v":61},null,null,null,null,null,null,null,null,null,null,null,null,null,null,null,null,null,null,null,null,22,33]
["Contador Público",{"$f":"SUM(C74:D74)","v":150},80,70,{"$f":"SUM(F74:G74)","v":858},449,409,{"$f":"SUM(I74:J74)","v":42},17,25]
["Lic en Economía",{"$f":"SUM(C75:D75)","v":31},21,10,{"$f":"SUM(F75:G75)","v":193},121,72,{"$f":"SUM(I75:J75)","v":15},6,9]
["Lic en Estudios Internacionales",{"$f":"SUM(C76:D76)","v":65},30,35,{"$f":"SUM(F76:G76)","v":330},158,172,{"$f":"SUM(I76:J76)","v":16},8,8]
["Lic en Gerencia y Administración",{"$f":"SUM(C77:D77)","v":159},102,57,{"$f":"SUM(F77:G77)","v":1016},624,392,{"$f":"SUM(I77:J77)","v":47},28,19]
[]
["FACULTAD DE ARQUITECTURA",{"$f":"SUM(C79:D79)","v":109},{"$f":"SUM(C80:C82)","v":28},{"$f":"SUM(D80:D82)","v":81},{"$f":"SUM(F79:G79)","v":710},{"$f":"SUM(F80:F82)","v":251},{"$f":"SUM(G80:G82)","v":459},{"$f":"SUM(I79:J79)","v":43},{"$f":"SUM(I80:I82)","v":17},{"$f":"SUM(J80:J82)","v":26}]
["Arquitectura",{"$f":"SUM(C80:D80)","v":70},27,43,{"$f":"SUM(F80:G80)","v":514},233,281,{"$f":"SUM(I80:J80)","v":28},16,12]
["Lic en Diseño de Interiores",{"$f":"SUM(C81:D81)","v":35},1,34,{"$f":"SUM(F81:G81)","v":192},18,174,{"$f":"SUM(I81:J81)","v":15},1,14]
["Lic en Diseño de Interiores",{"$f":"SUM(C82:D82)","v":4},0,4,{"$f":"SUM(F82:G82)","v":4},0,4,{"$f":"SUM(I82:J82)","v":0},0,0]
[null,null,null,null,null,null,null,null,"(Continúa)"]
[]
[]
[]
["UNIVERSIDADES PRIVADAS: OFERTA DE GRADO",null,null,null,null,"ALUMNOS MATRICULADOS"]
[]
["Cuadro Nº II-6.2.3 (continuación)"]
[]
["ALUMNOS INGRESADOS, MATRICULADOS Y EGRESADOS EN PROGRAMAS DE GRADO DE UNIVERSIDADES PRIVADAS POR SEXO SEGÚN UNIVERSIDAD Y CARRERA. AÑO 2011."]
["UNIVERSIDAD / CARRERA","TOTAL","INGRESADOS",null,"TOTAL","MATRICULADOS",null,"TOTAL","EGRESADOS"]
[null,null,"SEXO",null,null,"SEXO",null,null,"SEXO"]
[null,null,"    M","   F",null,"M","F",null,"M","F"]
["FACULTAD DE COMUNICACIÓN Y DISEÑO",{"$f":"SUM(C95:D95)","v":287},{"$f":"SUM(C96:C101)","v":109},{"$f":"SUM(D96:D101)","v":178},{"$f":"SUM(F95:G95)","v":1512},{"$f":"SUM(F96:F101)","v":558},{"$f":"SUM(G96:G101)","v":954},{"$f":"SUM(I95:J95)","v":69},{"$f":"SUM(I96:I101)","v":16},{"$f":"SUM(J96:J101)","v":53}]
["Lic en Comunicación",105,42,63,583,227,356,21,3,18]
["Lic en Diseño Gráfico",83,29,54,452,183,269,25,9,16]
["Lic en Diseño de Modas",32,1,31,215,4,211,14,0,14]
["Lic en Diseño Industrial",25,10,15,128,57,71,9,4,5]
["Lic en Diseño Multimedia",16,9,7,61,36,25,0,0,0]
["Licenciatura en Animación y Videojuegos",26,18,8,73,51,22,0,0,0]
[]
["FACULTAD DE INGENIERÍA",{"$f":"SUM(C103:D103)","v":380},{"$f":"SUM(C104:C109)","v":299},{"$f":"SUM(D104:D109)","v":81},{"$f":"SUM(F103:G103)","v":2372},{"$f":"SUM(F104:F109)","v":1964},{"$f":"SUM(G104:G109)","v":408},{"$f":"SUM(I103:J103)","v":70},{"$f":"SUM(I104:I109)","v":53},{"$f":"SUM(J104:J109)","v":17}]
["Ingeniería en Electrónica",21,15,6,153,138,15,7,7,0]
["Ingeniería en Sistemas",162,146,16,1046,902,144,38,25,13]
["Ingeniería en Telecomunicaciones",12,9,3,179,152,27,7,7,0]
["Lic en Sistemas",130,110,20,884,732,152,18,14,4]
["Licenciatura en Biotecnología",49,17,32,94,32,62,0,0,0]
["Técnico Biotecnólogo",6,2,4,16,8,8,0,0,0]
[]
["UNIVERSIDAD DE MONTEVIDEO",{"$f":"SUM(C111:D111)","v":357},{"$f":"+C113+C119+C125+C144+C148","v":188},{"$f":"+D113+D119+D125+D144+D148","v":169},{"$f":"SUM(F111:G111)","v":1667},{"$f":"+F113+F119+F125+F144+F148","v":824},{"$f":"+G113+G119+G125+G144+G148","v":843},{"$f":"SUM(I111:J111)","v":223},{"$f":"+I113+I119+I125+I144+I148","v":101},{"$f":"+J113+J119+J125+J144+J148","v":122}]
[]
["FACULTAD DE CIENCIAS EMPRESARIALES Y ECONOMÍA",{"$f":"SUM(C113:D113)","v":179},{"$f":"SUM(C114:C117)","v":104},{"$f":"SUM(D114:D117)","v":75},{"$f":"SUM(F113:G113)","v":802},{"$f":"SUM(F114:F117)","v":420},{"$f":"SUM(G114:G117)","v":382},{"$f":"SUM(I113:J113)","v":121},{"$f":"SUM(I114:I117)","v":54},{"$f":"SUM(J114:J117)","v":67}]
["Lic en Dirección y Administración de Empresas",{"$f":"SUM(C114:D114)","v":39},27,12,{"$f":"SUM(F114:G114)","v":160},91,69,{"$f":"SUM(I114:J114)","v":17},5,12]
["Licenciatura en Economía",{"$f":"SUM(C115:D115)","v":22},12,10,{"$f":"SUM(F115:G115)","v":125},77,48,{"$f":"SUM(I115:J115)","v":24},12,12]
["Contador Público",{"$f":"SUM(C116:D116)","v":100},56,44,{"$f":"SUM(F116:G116)","v":491},237,254,{"$f":"SUM(I116:J116)","v":80},37,43]
["Licenciatura en Negocios Internacionales",{"$f":"SUM(C117:D117)","v":18},9,9,{"$f":"SUM(F117:G117)","v":26},15,11,{"$f":"SUM(I117:J117)","v":0},0,0]
[]
["FACULTAD DE INGENIERÍA",{"$f":"SUM(C119:D119)","v":79},{"$f":"SUM(C120:C123)","v":48},{"$f":"SUM(D120:D123)","v":31},{"$f":"SUM(F119:G119)","v":296},{"$f":"SUM(F120:F123)","v":215},{"$f":"SUM(G120:G123)","v":81},{"$f":"SUM(I119:J119)","v":33},{"$f":"SUM(I120:I123)","v":28},{"$f":"SUM(J120:J123)","v":5}]
["Ingeniería Civil",{"$f":"SUM(C120:D120)","v":41},31,10,{"$f":"SUM(F120:G120)","v":111},70,41,{"$f":"SUM(I120:J120)","v":9},7,2]
["Ingeniería Industrial",{"$f":"SUM(C121:D121)","v":22},8,14,{"$f":"SUM(F121:G121)","v":116},92,24,{"$f":"SUM(I121:J121)","v":13},12,1]
["Ingeniería Telemática",{"$f":"SUM(C122:D122)","v":8},4,4,{"$f":"SUM(F122:G122)","v":61},48,13,{"$f":"SUM(I122:J122)","v":11},9,2]
["Ingeniería en Informática ",{"$f":"SUM(C123:D123)","v":8},5,3,{"$f":"SUM(F123:G123)","v":8},5,3,{"$f":"SUM(I123:J123)","v":0},0,0]
[]
["FACULTAD DE HUMANIDADES",{"$f":"SUM(C125:D125)","v":8},{"$f":"SUM(C126:C131)","v":2},{"$f":"SUM(D126:D131)","v":6},{"$f":"SUM(F125:G125)","v":74},{"$f":"SUM(F126:F131)","v":25},{"$f":"SUM(G126:G131)","v":49},{"$f":"SUM(I125:J125)","v":18},{"$f":"SUM(I126:I131)","v":7},{"$f":"SUM(J126:J131)","v":11}]
["Licenciatura en Humanidades",8,2,6,58,21,37,6,3,3]
["Profesorado en Filosofía",0,"s/d","s/d",4,3,1,3,2,1]
["Profesorado en Historia",0,"s/d","s/d",1,1,0,3,2,1]
["Profesorado en Matemática",0,"s/d","s/d",7,0,7,2,0,2]
["Profesorado en Literatura",0,"s/d","s/d",2,0,2,2,0,2]
["Profesorado de Inglés",0,"s/d","s/d",2,0,2,2,0,2]
[null,null,null,null,null,null,null,null,"(Continúa)"]
[]
[]
[]
["UNIVERSIDADES PRIVADAS: OFERTA DE GRADO",null,null,null,null,"ALUMNOS MATRICULADOS"]
[]
["Cuadro Nº II-6.2.3 (continuación)"]
[]
["ALUMNOS INGRESADOS, MATRICULADOS Y EGRESADOS EN PROGRAMAS DE GRADO DE UNIVERSIDADES PRIVADAS POR SEXO SEGÚN UNIVERSIDAD Y CARRERA. AÑO 2011."]
["UNIVERSIDAD / CARRERA","TOTAL","INGRESADOS",null,"TOTAL","MATRICULADOS",null,"TOTAL","EGRESADOS"]
[null,null,"SEXO",null,null,"SEXO",null,null,"SEXO"]
[null,null,"    M","   F",null,"M","F",null,"M","F"]
["FACULTAD DE DERECHO",{"$f":"SUM(C144:D144)","v":44},{"$f":"SUM(C145:C146)","v":21},{"$f":"SUM(D145:D146)","v":23},{"$f":"SUM(F144:G144)","v":241},{"$f":"SUM(F145:F146)","v":97},{"$f":"SUM(G145:G146)","v":144},{"$f":"SUM(I144:J144)","v":36},{"$f":"SUM(I145:I146)","v":9},{"$f":"SUM(J145:J146)","v":27}]
["Derecho",{"$f":"SUM(C145:D145)","v":38},18,20,{"$f":"SUM(F145:G145)","v":178},84,94,{"$f":"SUM(I145:J145)","v":22},7,15]
["Escribanía",{"$f":"SUM(C146:D146)","v":6},3,3,{"$f":"SUM(F146:G146)","v":63},13,50,{"$f":"SUM(I146:J146)","v":14},2,12]
[]
["FACULTAD DE COMUNICACIÓN",{"$f":"SUM(C148:D148)","v":47},{"$f":"SUM(C149:C150)","v":13},{"$f":"SUM(D149:D150)","v":34},{"$f":"SUM(F148:G148)","v":254},{"$f":"SUM(F149:F150)","v":67},{"$f":"SUM(G149:G150)","v":187},{"$f":"SUM(I148:J148)","v":15},{"$f":"SUM(I149:I150)","v":3},{"$f":"SUM(J149:J150)","v":12}]
["Licenciatura en Comunicación",{"$f":"SUM(C149:D149)","v":31},9,22,{"$f":"SUM(F149:G149)","v":187},54,133,{"$f":"SUM(I149:J149)","v":15},3,12]
["Licenciatura en Traducción e Interpretación",{"$f":"SUM(C150:D150)","v":16},4,12,{"$f":"SUM(F150:G150)","v":67},13,54,{"$f":"SUM(I150:J150)","v":0},0,0]
[]
["UNIVERSIDAD DE LA EMPRESA",{"$f":"SUM(C152:D152)","v":570},{"$f":"+C154+C158+C163+C170","v":325},{"$f":"+D154+D158+D163+D170","v":245},{"$f":"SUM(F152:G152)","v":1780},{"$f":"+F154+F158+F163+F170","v":929},{"$f":"+G154+G158+G163+G170","v":851},{"$f":"SUM(I152:J152)","v":104},{"$f":"+I154+I158+I163+I170","v":65},{"$f":"+J154+J158+J163+J170","v":39}]
[]
["FACULTAD DE CIENCIAS JURÍDICAS",{"$f":"SUM(C154:D154)","v":40},{"$f":"SUM(C155:C156)","v":20},{"$f":"SUM(D155:D156)","v":20},{"$f":"SUM(F154:G154)","v":168},{"$f":"SUM(F155:F156)","v":70},{"$f":"SUM(G155:G156)","v":98},{"$f":"SUM(I154:J154)","v":8},{"$f":"SUM(I155:I156)","v":2},{"$f":"SUM(J155:J156)","v":6}]
["Dr en Derecho",{"$f":"SUM(C155:D155)","v":16},11,5,{"$f":"SUM(F155:G155)","v":91},47,44,{"$f":"SUM(I155:J155)","v":3},1,2]
["Escribano Público",{"$f":"SUM(C156:D156)","v":24},9,15,{"$f":"SUM(F156:G156)","v":77},23,54,{"$f":"SUM(I156:J156)","v":5},1,4]
[]
["FACULTAD DE DISEÑO Y COMUNICACIÓN",{"$f":"SUM(C158:D158)","v":38},{"$f":"SUM(C159:C161)","v":3},{"$f":"SUM(D159:D161)","v":35},{"$f":"SUM(F158:G158)","v":115},{"$f":"SUM(F159:F161)","v":11},{"$f":"SUM(G159:G161)","v":104},{"$f":"SUM(I158:J158)","v":2},{"$f":"SUM(I159:I161)","v":0},{"$f":"SUM(J159:J161)","v":2}]
["Lic en Diseño Aplicado",{"$f":"SUM(C159:D159)","v":9},3,6,{"$f":"SUM(F159:G159)","v":30},9,21,{"$f":"SUM(I159:J159)","v":0},0,0]
["Lic en Indumentaria,",{"$f":"SUM(C160:D160)","v":15},0,15,{"$f":"SUM(F160:G160)","v":67},1,66,{"$f":"SUM(I160:J160)","v":1},0,1]
["Diseño de Interiores ,",{"$f":"SUM(C161:D161)","v":14},0,14,{"$f":"SUM(F161:G161)","v":18},1,17,{"$f":"SUM(I161:J161)","v":1},0,1]
[]
["FACULTAD DE CIENCIAS EMPRESARIALES",{"$f":"SUM(C163:D163)","v":283},{"$f":"SUM(C164:C168)","v":135},{"$f":"SUM(D164:D168)","v":148},{"$f":"SUM(F163:G163)","v":1019},{"$f":"SUM(F164:F168)","v":480},{"$f":"SUM(G164:G168)","v":539},{"$f":"SUM(I163:J163)","v":16},{"$f":"SUM(I164:I168)","v":8},{"$f":"SUM(J164:J168)","v":8}]
["Lic en Administración de Empresas",82,43,39,249,127,122,4,1,3]
["Lic en Marketing",70,38,32,271,146,125,7,5,2]
["Lic en Comercio Exterior",20,10,10,51,29,22,0,0,0]
["Lic en Recursos Humanos",16,4,12,43,11,32,0,0,0]
["Contador Público",95,40,55,405,167,238,5,2,3]
[]
["FACULTAD DE CIENCIAS AGRARIAS",{"$f":"SUM(C170:D170)","v":209},{"$f":"SUM(C171:C175)","v":167},{"$f":"SUM(D171:D175)","v":42},{"$f":"SUM(F170:G170)","v":478},{"$f":"SUM(F171:F175)","v":368},{"$f":"SUM(G171:G175)","v":110},{"$f":"SUM(I170:J170)","v":78},{"$f":"SUM(I171:I175)","v":55},{"$f":"SUM(J171:J175)","v":23}]
["Lic en Gestión Agropecuaria",78,63,15,226,178,48,23,20,3]
["Técnico Agropecuario",60,48,12,111,87,24,31,24,7]
["Técnico Asistente Veterinario",21,9,12,38,14,24,12,3,9]
["Técnico Forestal",22,19,3,39,30,9,12,8,4]
["Ingeniero Agrónomo",28,28,0,64,59,5,0,0,0]
["Fuente: Oficinas Productoras de cada una de las Instituciones. "]
["Nota: Los profesorados de la Universidad de Montevideo, corresponden a  alumnos matriculados en planes de estudio anteriores al 2008. "]

{"sheet":"II-6.2.4","index":211,"n_rows":59,"n_cols":10,"rows_kept":59,"cut":false,"hidden":false,"merged":[[6,5,6,6],[6,8,6,9],[0,5,1,8],[4,0,4,9],[5,0,7,0],[5,1,7,1],[5,2,5,3],[5,4,7,4],[5,5,5,6],[5,7,7,7],[5,8,5,9],[6,2,6,3]]}
["INSTITUTOS UNIVERSITARIOS: OFERTA DE GRADO",null,null,null,null,"ALUMNOS MATRICULADOS"]
[]
["Cuadro Nº II-6.2.4"]
[]
["ALUMNOS INGRESADOS, MATRICULADOS Y EGRESADOS EN PROGRAMAS DE GRADO DE INSTITUTOS UNIVERSITARIOS POR SEXO SEGÚN INSTITUTO UNIVERSITARIO Y CARRERA. AÑO 2011."]
["INSTITUTO UNIVERSITARIO / CARRERA","TOTAL","INGRESADOS",null,"TOTAL","MATRICULADOS",null,"TOTAL","EGRESADOS"]
[null,null,"SEXO",null,null,"SEXO",null,null,"SEXO"]
[null,null,"M","F",null,"M","F",null,"M","F"]
["TOTAL",{"$f":"SUM(C9:D9)","v":644},{"$f":"+C11+C19+C23+C29+C35+C37+C44+C49+C54","v":322},{"$f":"+D11+D19+D23+D29+D35+D37+D44+D49+D54","v":322},{"$f":"SUM(F9:G9)","v":2436},{"$f":"+F11+F19+F23+F29+F35+F37+F44+F49+F54","v":1287},{"$f":"+G11+G19+G23+G29+G35+G37+G44+G49+G54","v":1149},{"$f":"SUM(I9:J9)","v":205},{"$f":"+I11+I19+I23+I29+I35+I37+I44+I49+I54","v":82},{"$f":"+J11+J19+J23+J29+J35+J37+J44+J49+J54","v":123}]
[]
["INST UNIV AUTÓNOMO DEL SUR",{"$f":"SUM(C11:D11)","v":109},{"$f":"SUM(C12:C17)","v":92},{"$f":"SUM(D12:D17)","v":17},{"$f":"SUM(F11:G11)","v":691},{"$f":"SUM(F12:F17)","v":580},{"$f":"SUM(G12:G17)","v":111},{"$f":"SUM(I11:J11)","v":30},{"$f":"SUM(I12:I17)","v":26},{"$f":"SUM(J12:J17)","v":4}]
["Licenciatura en Informática",{"$f":"SUM(C12:D12)","v":49},43,6,393,338,55,13,12,1]
["Ingeniería de Informática",10,10,0,76,63,13,3,2,1]
["Analista en Informática",32,28,4,115,100,15,14,12,2]
["Analista en Ingeniería Informática",10,10,0,77,63,14,0,0,0]
["Licenciatura en Administración y Marketing",{"$f":"SUM(C16:D16)","v":0},0,0,{"$f":"SUM(F16:G16)","v":12},8,4,{"$f":"SUM(I16:J16)","v":0},0,0]
["Contador Público",8,1,7,18,8,10,0,0,0]
[]
["INST UNIV ASOCIACIÓN CRISTIANA DE JÓVENES",{"$f":"SUM(C19:D19)","v":208},{"$f":"SUM(C20:C21)","v":129},{"$f":"SUM(D20:D21)","v":79},{"$f":"SUM(F19:G19)","v":515},{"$f":"SUM(F20:F21)","v":328},{"$f":"SUM(G20:G21)","v":187},{"$f":"SUM(I19:J19)","v":70},{"$f":"SUM(I20:I21)","v":30},{"$f":"SUM(J20:J21)","v":40}]
["Licenciatura en Educación Física, Recreación y Deporte",{"$f":"SUM(C20:D20)","v":145},104,41,{"$f":"SUM(F20:G20)","v":395},279,116,{"$f":"SUM(I20:J20)","v":14},7,7]
["Tecnicatura en Fitness",{"$f":"SUM(C21:D21)","v":63},25,38,{"$f":"SUM(F21:G21)","v":120},49,71,{"$f":"SUM(I21:J21)","v":56},23,33]
[]
["INST UNIV CLAEH -",{"$f":"SUM(C23:D23)","v":142},{"$f":"SUM(C24:C27)","v":47},{"$f":"SUM(D24:D27)","v":95},{"$f":"SUM(F23:G23)","v":354},{"$f":"SUM(F24:F27)","v":132},{"$f":"SUM(G24:G27)","v":222},{"$f":"SUM(I23:J23)","v":29},{"$f":"SUM(I24:I27)","v":13},{"$f":"SUM(J24:J27)","v":16}]
["Dr en Medicina (Maldonado) ",{"$f":"SUM(C24:D24)","v":21},8,13,{"$f":"SUM(F24:G24)","v":209},87,122,{"$f":"SUM(I24:J24)","v":29},13,16]
["Licenciatura en Gestión Cultural (Montevideo) ",{"$f":"SUM(C25:D25)","v":19},7,12,{"$f":"SUM(F25:G25)","v":43},13,30,{"$f":"SUM(I25:J25)","v":0},0,0]
["Abogacía (Maldonado) ",{"$f":"SUM(C26:D26)","v":73},23,50,{"$f":"SUM(F26:G26)","v":73},23,50,{"$f":"SUM(I26:J26)","v":0},0,0]
["Notariado (Maldonado)",{"$f":"SUM(C27:D27)","v":29},9,20,{"$f":"SUM(F27:G27)","v":29},9,20,{"$f":"SUM(I27:J27)","v":0},0,0]
[]
["INST METODISTA UNIV CRANDON",{"$f":"SUM(C29:D29)","v":22},{"$f":"SUM(C30:C32)","v":0},{"$f":"SUM(D30:D32)","v":22},{"$f":"SUM(F29:G29)","v":48},{"$f":"SUM(F30:F32)","v":1},{"$f":"SUM(G30:G32)","v":47},{"$f":"SUM(I29:J29)","v":22},{"$f":"SUM(I30:I32)","v":1},{"$f":"SUM(J30:J32)","v":21}]
["Licenciatura en Gestión de Empresas",{"$f":"SUM(C30:D30)","v":0},0,0,{"$f":"SUM(F30:G30)","v":0},0,0,{"$f":"SUM(I30:J30)","v":2},0,2]
["Secretariado Ejecutivo",{"$f":"SUM(C31:D31)","v":22},0,22,{"$f":"SUM(F31:G31)","v":46},0,46,{"$f":"SUM(I31:J31)","v":18},0,18]
["Asistente Ejecutivo",{"$f":"SUM(C32:D32)","v":0},0,0,{"$f":"SUM(F32:G32)","v":2},1,1,{"$f":"SUM(I32:J32)","v":2},1,1]
[]
["INST UNIV MONSEÑOR MARIANO SOLER - "]
["Licenciatura en Ciencias Teológicas",{"$f":"SUM(C35:D35)","v":16},13,3,{"$f":"SUM(F35:G35)","v":61},58,3,{"$f":"SUM(I35:J35)","v":6},6,0]
[]
["INST UNIV FRANCISCO DE ASÍS ",{"$f":"+C37+D37","v":63},{"$f":"SUM(C38:C42)","v":29},{"$f":"SUM(D38:D42)","v":34},{"$f":"+F37+G37","v":489},{"$f":"SUM(F38:F42)","v":156},{"$f":"SUM(G38:G42)","v":333},{"$f":"+I37+J37","v":9},{"$f":"SUM(I38:I42)","v":1},{"$f":"SUM(J38:J42)","v":8}]
["Licenciatura en Administración y Dirección de Empresas ",8,6,2,163,59,104,0,0,0]
["Contador Público ",21,10,11,96,22,74,5,1,4]
["Licenciatura en Psicología (Plan 2010) ",22,6,16,66,16,50,0,0,0]
["Licenciatura en Psicología (Plan 2002) ",0,0,0,52,8,44,4,0,4]
["Licenciatura en Turismo ",12,7,5,112,51,61,0,0,0]
[]
["INST UNIV BIOS",{"$f":"SUM(C44:D44)","v":16},{"$f":"SUM(C45:C47)","v":8},{"$f":"SUM(D45:D47)","v":8},{"$f":"SUM(F44:G44)","v":51},{"$f":"SUM(F45:F47)","v":21},{"$f":"SUM(G45:G47)","v":30},{"$f":"SUM(I44:J44)","v":18},{"$f":"SUM(I45:I47)","v":5},{"$f":"SUM(J45:J47)","v":13}]
["Licenciatura en Diseño Gráfico",{"$f":"SUM(C45:D45)","v":16},8,8,{"$f":"SUM(F45:G45)","v":41},19,22,{"$f":"SUM(I45:J45)","v":9},3,6]
["Licenciatura en Diseño Industrial",{"$f":"SUM(C46:D46)","v":0},0,0,{"$f":"SUM(F46:G46)","v":0},0,0,{"$f":"SUM(I46:J46)","v":2},1,1]
["Tecnicatura en Enseñanza Informática",{"$f":"SUM(C47:D47)","v":0},0,0,{"$f":"SUM(F47:G47)","v":10},2,8,{"$f":"SUM(I47:J47)","v":7},1,6]
[]
["INST UNIV CEDIIAP",{"$f":"+C49+D49","v":68},{"$f":"SUM(C50:C52)","v":4},{"$f":"SUM(D50:D52)","v":64},{"$f":"+F49+G49","v":227},{"$f":"SUM(F50:F52)","v":11},{"$f":"SUM(G50:G52)","v":216},{"$f":"+I49+J49","v":21},{"$f":"SUM(I50:I52)","v":0},{"$f":"SUM(J50:J52)","v":21}]
["Licenciatura en Psicomotricidad",{"$f":"+C50+D50","v":43},0,43,{"$f":"+F50+G50","v":125},8,117,{"$f":"+I50+J50","v":16},0,16]
["Licenciatura en Psicopedagogía",{"$f":"+C51+D51","v":18},1,17,{"$f":"+F51+G51","v":86},0,86,{"$f":"+I51+J51","v":5},0,5]
["Licenciatura en Musicoterapia",{"$f":"+C52+D52","v":7},3,4,{"$f":"+F52+G52","v":16},3,13,{"$f":"+I52+J52","v":0},0,0]
[]
["Escuela Naval","s/d","s/d","s/d","s/d","s/d","s/d","s/d","s/d","s/d"]
["Licenciado en Sistemas Navales","s/d",null,null,"s/d",null,null,"s/d"]
["Licenciado en Sistemas Náuticos","s/d",null,null,"s/d",null,null,"s/d"]
["Fuente: Oficinas Productoras de cada una de las Instituciones. "]
["Nota: (a) Ingresos, Matrículas y Egresos de Licenciatura en Sistemas Navales y de Licenciatura en Sistemas Náuticos, refieren a trámite de reválidas."]
["Para la definiciónde ingreso,matrícula y egreso, ir a Anexo-Definiciones."]

{"sheet":"II-6.2.5","index":212,"n_rows":22,"n_cols":10,"rows_kept":22,"cut":false,"hidden":false,"merged":[[5,5,5,6],[5,7,7,7],[5,8,5,9],[6,2,6,3],[6,5,6,6],[6,8,6,9],[0,2,1,4],[4,0,4,4],[5,0,7,0],[5,1,7,1],[5,2,5,3],[5,4,7,4]]}
["OFERTA UNIVERSITARIA DE POSTGRADO",null,"INSTITUCIONES"]
[]
["Cuadro Nº II-6.2.5"]
[]
["ALUMNOS INGRESADOS, MATRICULADOS Y EGRESADOS EN PROGRAMAS DE POSTGRADO POR SEXO SEGÚN INSTITUCIÓN. AÑO 2011."]
["INSTITUCIÓN","TOTAL","INGRESADOS",null,"TOTAL","MATRICULADOS",null,"TOTAL","EGRESADOS"]
[null,null,"SEXO",null,null,"SEXO",null,null,"SEXO"]
[null,null,"M","F",null,"M","F",null,"M","F"]
["TOTAL",{"$f":"SUM(C9:D9)","v":3338},{"$f":"SUM(C11:C21)","v":1215},{"$f":"SUM(D11:D21)","v":2123},{"$f":"SUM(F9:G9)","v":4526},{"$f":"SUM(F11:F21)","v":1454},{"$f":"SUM(G11:G21)","v":3072},{"$f":"SUM(I9:J9)","v":1332},{"$f":"SUM(I11:I21)","v":530},{"$f":"SUM(J11:J21)","v":802}]
[]
["UdelaR",{"$f":"SUM(C11:D11)","v":1862},689,1173,"S/D","s/d","s/d",{"$f":"SUM(I11:J11)","v":693},287,406]
["UCUDAL",558,114,444,{"$f":"SUM(F12:G12)","v":2244},510,1734,157,42,115]
["Universidad ORT Uruguay",182,74,108,631,271,360,156,49,107]
["Universidad de Montevideo",221,123,98,579,274,305,112,56,56]
["Universidad de la Empresa",229,115,114,472,230,242,70,40,30]
["Inst Univ CLAEH ",160,43,117,352,89,263,46,11,35]
["Inst Univ de Postgrado en Psicoanálisis",8,2,6,48,10,38,4,1,3]
["Inst Univ BIOS",0,0,0,43,14,29,0,0,0]
["Inst Metodista Univ Crandon",5,0,5,9,1,8,4,1,3]
["Inst Univ CEDIIAP",7,0,7,42,0,42,10,0,10]
["Centro de Altos Estudios Nacionales",106,55,51,106,55,51,80,43,37]
["Fuente: Oficinas Productoras de cada una de las Instituciones. "]

{"sheet":"II-6.2.6","index":213,"n_rows":224,"n_cols":7,"rows_kept":224,"cut":false,"hidden":false,"merged":[[77,3,78,6],[81,0,81,6],[82,0,84,0],[82,1,84,1],[82,2,82,3],[82,4,84,4],[82,5,82,6],[83,2,83,3],[83,5,83,6],[0,3,1,6],[4,0,4,6],[5,0,7,0],[5,1,7,1],[5,2,5,3],[5,4,7,4],[5,5,5,6],[6,2,6,3],[6,5,6,6]]}
["UNIVERSIDAD DE LA REPÚBLICA: OFERTA DE POSTGRADO",null,null,"ALUMNOS MATRICULADOS"]
[]
["Cuadro Nº II-6.2.6"]
[]
["ALUMNOS INGRESADOS Y EGRESADOS EN PROGRAMAS DE POSTGRADO DE LA UNIVERSIDAD DE LA REPÚBLICA POR SEXO SEGÚN SERVICIO UNIVERSITARIO Y ACREDITACIÓN. AÑO 2011."]
["SERVICIO UNIVERSITARIO / ACREDITACIÓN","TOTAL","INGRESADOS",null,"TOTAL","EGRESADOS"]
[null,null,"SEXO",null,null,"SEXO"]
[null,null,"M","F",null,"M","F"]
["TOTAL",{"$f":"SUM(C9:D9)","v":1862},{"$f":"+C11+C22+C28+C47+C86+C150+C158+C167+C171+C177+C185+C197+C200+C64+C68+C142+C205+C208+C211+C214+C217+C220","v":689},{"$f":"+D11+D22+D28+D47+D86+D150+D158+D167+D171+D177+D185+D197+D200+D64+D68+D142+D205+D208+D211+D214+D217+D220","v":1173},{"$f":"SUM(F9:G9)","v":693},{"$f":"+F11+F22+F28+F47+F86+F150+F158+F167+F171+F177+F185+F197+F200+F64+F68+F142+F205+F208+F211+F214+F217+F220","v":287},{"$f":"+G11+G22+G28+G47+G86+G150+G158+G167+G171+G177+G185+G197+G200+G64+G68+G142+G205+G208+G211+G214+G217+G220","v":406}]
[]
["FACULTAD DE CIENCIAS ECONÓMICAS Y ADMINISTRACIÓN",{"$f":"+C11+D11","v":151},{"$f":"SUM(C12:C20)","v":78},{"$f":"SUM(D12:D20)","v":73},{"$f":"+F11+G11","v":69},{"$f":"SUM(F12:F20)","v":31},{"$f":"SUM(G12:G20)","v":38}]
["Diploma de Especialización en Costos y Gestión Empresarial",14,9,5,12,3,9]
["Diploma de Posgrado en Economía, Derecho y Gestión del Deporte",31,14,17,0,0,0]
["Posgrado de Especialización en Administración",19,10,9,10,6,4]
["Posgrado de Especialización en Finanzas",23,11,12,22,11,11]
["Posgrado de Especialización en Marketing",15,5,10,10,2,8]
["Maestría en Finanzas",5,2,3,3,0,3]
["Maestría en Gerencia y Administración (MBA)",18,13,5,8,7,1]
["Magíster en Marketing",3,2,1,0,0,0]
["Magíster en Economía",23,12,11,4,2,2]
[]
["FACULTAD DE DERECHO",{"$f":"+C22+D22","v":19},{"$f":"SUM(C23:C26)","v":4},{"$f":"SUM(D23:D26)","v":15},{"$f":"+F22+G22","v":7},{"$f":"SUM(F23:F26)","v":3},{"$f":"SUM(G23:G26)","v":4}]
["Especialización en Derecho del Trabajo y de la Seguridad Social",{"$f":"+C23+D23","v":5},1,4,{"$f":"+F23+G23","v":1},0,1]
["Especialización en Derecho de Daños",{"$f":"+C24+D24","v":0},0,0,{"$f":"+F24+G24","v":3},2,1]
["Maestría en Derecho con Orientación en Derecho del Trabajo y de la Seguridad Social",{"$f":"+C25+D25","v":14},3,11,{"$f":"+F25+G25","v":2},0,2]
["Maestría en Relaciones Internacionales con Orientación en Economía, Política y Derecho de Integración Regional",{"$f":"+C26+D26","v":0},0,0,{"$f":"+F26+G26","v":1},1,0]
[]
["FACULTAD DE INGENIERÍA",{"$f":"+C28+D28","v":99},{"$f":"SUM(C29:C45)","v":75},{"$f":"SUM(D29:D45)","v":24},{"$f":"+F28+G28","v":59},{"$f":"SUM(F29:F45)","v":39},{"$f":"SUM(G29:G45)","v":20}]
["Diplomado de Especialización en Estudios Avanzados en Computación",4,3,1,6,6,0]
["Diplomado de Especialización en Gestión de Tecnologías",16,12,4,29,18,11]
["Diplomado de Especialización en Telecomunicaciones",2,2,0,1,1,0]
["Magíster en Informática (PEDECIBA)",14,13,1,6,5,1]
["Magíster en Ingeniería Ambiental",5,2,3,0,0,0]
["Magíster en Ingeniería de Celulosa y Papel",3,3,0,2,0,2]
["Magíster en Ingeniería de la Energía",22,16,6,0,0,0]
["Magíster en Ingeniería Eléctrica",3,3,0,3,1,2]
["Magíster en Ingeniería en Computación",2,2,0,2,2,0]
["Magíster en Ingeniería en Mecánica de los Fluídos  Aplicada",2,1,1,2,1,1]
["Magíster en Ingeniería Matemática",6,5,1,4,2,2]
["Magíster  en Ingeniería Química",5,3,2,0,0,0]
["Doctor en Infromática (PEDECIBA)",4,2,2,1,1,0]
["Doctor en Ingeniería Eléctrica",7,6,1,2,2,0]
["Doctor en Ingeniería Estructural",1,1,0,0,0,0]
["Doctor en Ingeniería Química",1,0,1,1,0,1]
["Doctor en Ingeniería Mecánica de Los Fluídos Aplicada",2,1,1,0,0,0]
[]
["FACULTAD DE CIENCIAS SOCIALES",{"$f":"+C47+D47","v":159},{"$f":"SUM(C48:C62)","v":36},{"$f":"SUM(D48:D62)","v":123},{"$f":"+F47+G47","v":44},{"$f":"SUM(F48:F62)","v":25},{"$f":"SUM(G48:G62)","v":19}]
["Certificado en Economía para no Economistas",3,2,1,2,0,2]
["Certificado en Economía   ",2,0,2,2,0,2]
["Diplomado en Análisis de la Información Sociodemográfica Aplicada a la Gestión",0,0,0,2,2,0]
["Diplomado en Ciencia Política",0,0,0,3,2,1]
["Diplomado en Género y Políticas Públicas",38,2,36,0,0,0]
["Diplomado en Historia Económica",0,0,0,1,0,1]
["Diplomado en Investigación Social Aplicada a Estudios de Mercado, Publicidad y Opinión Pública",15,1,14,0,0,0]
["Diplomado en Economía y Gestión Bancaria",17,9,8,13,8,5]
["Diplomado de Especialización en Intervención Familiar",40,3,37,0,0,0]
["Diplomado en Economía para no Economistas",14,6,8,6,4,2]
["Maestría en Ciencia Política",0,0,0,2,1,1]
["Maestría en Economía Internacional",30,13,17,4,2,2]
["Maestría en Sociología",0,0,0,4,2,2]
["Maestría en Trabajo Social",{"$f":"+C61+D61","v":0},0,0,{"$f":"+F61+G61","v":2},2,0]
["Doctor en Ciencias Sociales",0,0,0,3,2,1]
[]
["FACULTAD DE CIENCIAS ECONÓMICAS Y ADMINISTRACIÓN, FAC DE CIENCIAS SOCIALES Y UNIVERSIDAD DE SIENA",{"$f":"+C64+D64","v":32},{"$f":"SUM(C65:C66)","v":12},{"$f":"SUM(D65:D66)","v":20},{"$f":"+F64+G64","v":0},{"$f":"SUM(F65)","v":0},{"$f":"SUM(G65)","v":0}]
["Diplomado en Economía y Gestión del Turismo Sustentable",{"$f":"+C65+D65","v":1},1,0,{"$f":"+F65+G65","v":0},0,0]
["Maestría en Economía y Gestión del Turismo Sustentable",{"$f":"+C66+D66","v":31},11,20,0,0,0]
[]
["FACULTAD DE CS ECONÓMICAS Y ADM Y FACULTAD DE MEDICINA ",{"$f":"+C68+D68","v":24},{"$f":"SUM(C69)","v":8},{"$f":"SUM(D69)","v":16},{"$f":"+F68+G68","v":22},{"$f":"SUM(F69)","v":4},{"$f":"SUM(G69)","v":18}]
["Posgrado de Especialización en Gestión de Servicios de Salud",{"$f":"+C69+D69","v":24},8,16,{"$f":"+F69+G69","v":22},4,18]
[]
[]
[]
[null,null,null,null,null,"(Continúa)"]
[]
[]
[]
[]
["UNIVERSIDAD DE LA REPÚBLICA: OFERTA DE POSTGRADO",null,null,"ALUMNOS MATRICULADOS"]
[]
["Cuadro Nº II-6.2.6 (continuación)"]
[]
["ALUMNOS INGRESADOS Y EGRESADOS EN PROGRAMAS DE POSTGRADO DE LA UNIVERSIDAD DE LA REPÚBLICA POR SEXO SEGÚN SERVICIO UNIVERSITARIO Y ACREDITACIÓN AÑO 2011"]
["SERVICIO UNIVERSITARIO / ACREDITACIÓN","TOTAL","INGRESADOS",null,"TOTAL","EGRESADOS"]
[null,null,"SEXO",null,null,"SEXO"]
[null,null,"M","F",null,"M","F"]
["FACULTAD DE MEDICINA ",{"$f":"+C86+D86","v":525},{"$f":"SUM(C87:C140)","v":174},{"$f":"SUM(D87:D140)","v":351},{"$f":"+F86+G86","v":281},{"$f":"SUM(F87:F140)","v":104},{"$f":"SUM(G87:G140)","v":177}]
["Magíster en Epidemiología",0,0,0,4,1,3]
["Especialización en Oftalmología",10,5,5,6,2,4]
["Especialización en Administración de Servicios de Salud",2,0,2,2,0,2]
["Especialización en Anatomía Patológica",2,0,2,0,0,0]
["Especialización en Anestesiología",22,8,14,11,3,8]
["Especialización en Cardiología",25,12,13,6,4,2]
["Especialización en Cirugía Cardíaca",0,0,0,1,1,0]
["Especialización en Cirugía General",10,7,3,12,9,3]
["Especialización en Cirugía Pediátrica",1,1,0,0,0,0]
["Especialización en Cirugía Plástica, Reparadora y Estética",4,0,4,1,0,1]
["Especialización en Cirugía Vascular Periférica",1,1,0,4,2,2]
["Especialización en Dermatología",5,1,4,5,1,4]
["Especialización en Endocrinología y Metabolismo",11,3,8,2,0,2]
["Especialización en Enfermedades Infecciosas",1,1,0,1,0,1]
["Especialización en Gastroenterología",10,4,6,9,2,7]
["Diplomatura en Cuidados Paliativos del Adulto",0,0,0,2,1,1]
["Diploma en Genética Médica Opciones Pediatría y Adultos",1,1,0,0,0,0]
["Especialización en Geriatría",11,4,7,2,1,1]
["Especialización en Ginecotocología",17,4,13,19,10,9]
["Especialización en Hematología",5,0,5,0,0,0]
["Especialización en Hemoterapia y Medicina Transfusional",4,0,4,2,1,1]
["Especialización en Imagenología",21,7,14,3,1,2]
["Especialización en Laboratorio de Patología Clínica",6,1,5,5,1,4]
["Especialización en Medicina del Deporte",7,5,2,6,3,3]
["Especialización en Medicina Familiar y Comunitaria",50,15,35,11,0,11]
["Especialización en Medicina Intensiva",30,15,15,25,14,11]
["Especialización en Medicina Interna",24,8,16,24,5,19]
["Especialización en Medicina Legal ",1,0,1,1,0,1]
["Especialización en Medicina Nuclear",5,2,3,1,1,0]
["Especialización en Microbiología",1,0,1,2,0,2]
["Especialización en Nefrología",6,1,5,4,1,3]
["Especialización en Neonatología",0,0,0,6,1,5]
["Especialización en Neumología",4,1,3,4,1,3]
["Especialización en Neurocirugía",2,2,0,0,0,0]
["Especialización en Neurología",2,0,2,2,0,2]
["Especialización en Oncología Médica",5,1,4,5,2,3]
["Especialización en Oncología Radioterápica",0,0,0,1,1,0]
["Especialización en Otorrinolaringología",12,4,8,4,4,0]
["Especialización en Pediatría",131,31,100,37,5,32]
["Especialización en Psiquiatría ",5,1,4,11,2,9]
["Especialización en Psiquiatría Pediátrica",5,0,5,2,0,2]
["Especialización en Rehabilitación y Medicina Física",6,2,4,6,2,4]
["Especialización en Reumatología",3,1,2,1,0,1]
["Especialización en Salud Ocupacional",11,5,6,0,0,0]
["Especialización en Terapia Intensiva Pediátrica",0,0,0,2,2,0]
["Especialización en Toxicología Clínica",1,0,1,0,0,0]
["Especialización en Traumatología y Ortopedia",9,9,0,12,12,0]
["Especialización en Urología",6,5,1,1,1,0]
["Diploma en Especialización en Gerontopsicomotricidad",4,0,4,1,1,0]
["Diplomatura en Coordinación de Transplantes",3,1,2,5,1,4]
["Diploma en Profundización en Neurodesarrollo",0,0,0,3,0,3]
["Diploma de Profundización en Urología Pediátrica",0,0,0,4,4,0]
["Diploma de Profundización en Bases Inmunológicas de los Transplantes",0,0,0,3,1,2]
["Diplomatura en Psicoterapia en los Servicios de Salud",23,5,18,0,0,0]
[]
["FACULTAD DE ODONTOLOGÍA ",{"$f":"+C142+D142","v":45},{"$f":"SUM(C143:C148)","v":19},{"$f":"SUM(D143:D148)","v":26},{"$f":"+F142+G142","v":17},{"$f":"SUM(F143:F148)","v":9},{"$f":"SUM(G143:G148)","v":8}]
["Especialista en Cirugía Buco Maxilo Facial",{"$f":"+C143+D143","v":13},8,5,{"$f":"+F143+G143","v":0},0,0]
["Especialista en Endodoncia",{"$f":"+C144+D144","v":10},2,8,{"$f":"+F144+G144","v":0},0,0]
["Especialista en Gerodontología",0,0,0,5,0,5]
["Especialista en Odontopediatría ",5,0,5,0,0,0]
["Especialista en Ortopedia y Ortodoncia Dento Maxilo Facial",9,3,6,0,0,0]
["Especialista en Prostodoncia",8,6,2,12,9,3]
[]
["FACULTAD DE HUMANIDADES Y CIENCIAS DE LA EDUCACIÓN",{"$f":"+C150+D150","v":122},{"$f":"SUM(C151:C156)","v":31},{"$f":"SUM(D151:D156)","v":91},{"$f":"+F150+G150","v":8},{"$f":"SUM(F151:F156)","v":1},{"$f":"SUM(G151:G156)","v":7}]
["Maestría en Ciencias Humanas - Literatura Latinoamericana",{"$f":"+C151+D151","v":12},4,8,{"$f":"+F151+G151","v":2},0,2]
["Maestría en Ciencias Humanas - Historia Rioplatense",{"$f":"+C152+D152","v":3},1,2,{"$f":"+F152+G152","v":1},1,0]
["Maestría en Ciencias Humanas - Filosofía Contemporánea",{"$f":"+C153+D153","v":21},7,14,{"$f":"+F153+G153","v":0},0,0]
["Maestría en Ciencias Humanas - Estudios Latinoamericanos",35,9,26,0,0,0]
["Maestría en Ciencias Humanas - Teoría e Historia del Teatro",30,5,25,0,0,0]
["Maestría en Ciencias Humanas - Antropología de la Cuenca del Plata",21,5,16,5,0,5]
[]
["FACULTAD DE AGRONOMÍA",{"$f":"+C158+D158","v":153},{"$f":"SUM(C159:C165)","v":85},{"$f":"SUM(D159:D165)","v":68},{"$f":"+F158+G158","v":25},{"$f":"SUM(F159:F165)","v":14},{"$f":"SUM(G159:G165)","v":11}]
["Diploma en Agronomía",{"$f":"+C159+D159","v":24},18,6,{"$f":"+F159+G159","v":0},0,0]
["Diplomado en Desarrollo Rural Sustentable",{"$f":"+C160+D160","v":9},4,5,2,0,2]
["Maestría en Agronomía Opciones: Producción Vegetal, Suelo, Aguas, Protección VegetalPerfil Profesional",13,11,2,0,0,0]
["Magíster en Ciencias Agrarias",63,32,31,19,12,7]
["Magíster en Construcción de Obras de Arquitectura",20,12,8,0,0,0]
["Magíster en Desarrollo Rural Sustentable",4,0,4,4,2,2]
["Doctor en Ciencias Agrarias",20,8,12,0,0,0]
[]
["FACULTAD DE ARQUITECTURA",{"$f":"+C167+D167","v":33},{"$f":"SUM(C168:C169)","v":17},{"$f":"SUM(D168:D169)","v":16},{"$f":"+F167+G167","v":37},{"$f":"SUM(F168:F169)","v":15},{"$f":"SUM(G168:G169)","v":22}]
["Diploma en Construcción de Obras de Arquitectura",{"$f":"+C168+D168","v":6},4,2,{"$f":"+F168+G168","v":4},1,3]
["Especialización en Intervención en el Patrimonio Arquitectónico",{"$f":"+C169+D169","v":27},13,14,{"$f":"+F169+G169","v":33},14,19]
[]
["FACULTAD DE QUÍMICA",{"$f":"+C171+D171","v":33},{"$f":"SUM(C172:C175)","v":11},{"$f":"SUM(D172:D175)","v":22},{"$f":"+F171+G171","v":14},{"$f":"SUM(F172:F175)","v":5},{"$f":"SUM(G172:G175)","v":9}]
["Especialista en Farmacia Hospitalaria",{"$f":"+C172+D172","v":3},0,3,{"$f":"+F172+G172","v":0},0,0]
["Magíster en Química",3,1,2,6,1,5]
["Magíster en Química (Orientación Educación en Química)",1,0,1,0,0,0]
["Doctor en Química ",26,10,16,8,4,4]
[]
["FACULTAD DE VETERINARIA",{"$f":"+C177+D177","v":14},{"$f":"SUM(C178:C183)","v":4},{"$f":"SUM(D178:D183)","v":10},{"$f":"+F177+G177","v":6},{"$f":"SUM(F178:F183)","v":1},{"$f":"SUM(G178:G183)","v":5}]
["Magíster en Nutrición de Rumiantes",1,0,1,0,0,0]
["Magíster en Producción Animal ",1,0,1,3,1,2]
["Magíster en Reproducción Animal ",1,0,1,0,0,0]
["Magíster en Salud Animal",5,2,3,3,0,3]
["Doctor en Producción Animal ",4,2,2,0,0,0]
["Doctor en Salud Animal ",2,0,2,0,0,0]
[]
["FACULTAD DE CIENCIAS",{"$f":"+C185+D185","v":201},{"$f":"SUM(C186:C195)","v":69},{"$f":"SUM(D186:D195)","v":132},{"$f":"+F185+G185","v":89},{"$f":"SUM(F186:F195)","v":34},{"$f":"SUM(G186:G195)","v":55}]
["Maestría en Bioinformática (PEDECIBA)",{"$f":"+C186+D186","v":6},4,2,1,1,0]
["Magíster en Biotecnología",10,1,9,6,2,4]
["Magíster en Ciencias Ambientales",9,5,4,6,0,6]
["Magíster en Ciencias Biológicas (PEDECIBA)",160,51,109,51,18,33]
["Magíster en Física (PEDECIBA)",5,5,0,5,3,2]
["Magíster en Geociencias",4,0,4,0,0,0]
["Magíster en Matemáticas (PEDECIBA)",2,1,1,3,2,1]
["Doctor en Ciencias Biológicas (PEDECIBA)",0,0,0,17,8,9]
["Doctor en Física (PEDECIBA)",2,0,2,0,0,0]
["Doctor en Matemáticas (PEDECIBA)",3,2,1,0,0,0]
[]
["FACULTAD DE ENFERMERÍA",{"$f":"+C197+D197","v":0},{"$f":"SUM(C198:C198)","v":0},{"$f":"SUM(D198:D198)","v":0},{"$f":"+F197+G197","v":1},{"$f":"SUM(F198:F198)","v":0},{"$f":"SUM(G198:G198)","v":1}]
["Magíster en Salud Mental",{"$f":"+C198+D198","v":0},0,0,{"$f":"+F198+G198","v":1},0,1]
[]
["FACULTAD DE PSICOLOGÍA",{"$f":"+C200+D200","v":118},{"$f":"SUM(C201:C203)","v":18},{"$f":"SUM(D201:D203)","v":100},{"$f":"+F200+G200","v":5},{"$f":"SUM(F201:F203)","v":0},{"$f":"SUM(G201:G203)","v":5}]
["Maestría en Psicología Clínica",{"$f":"+C201+D201","v":39},5,34,{"$f":"+F201+G201","v":0},0,0]
["Maestría en Psicología Social",{"$f":"+C202+D202","v":41},8,33,{"$f":"+F202+G202","v":0},0,0]
["Maestría en Psicología y Educación",38,5,33,5,0,5]
[]
["Facultad de Derecho y Humanidades",{"$f":"+C205+D205","v":0},{"$f":"SUM(C206:C206)","v":0},{"$f":"SUM(D206:D206)","v":0},{"$f":"+F205+G205","v":2},{"$f":"SUM(F206:F206)","v":0},{"$f":"SUM(G206:G206)","v":2}]
["Diploma de Especialización en Traducción Literaria",{"$f":"+C206+D206","v":0},0,0,{"$f":"+F206+G206","v":2},0,2]
[]
["Facultad de Ingenieria y Química",{"$f":"+C208+D208","v":16},{"$f":"SUM(C209:C209)","v":1},{"$f":"SUM(D209:D209)","v":15},{"$f":"+F208+G208","v":0},{"$f":"SUM(F209:F209)","v":0},{"$f":"SUM(G209:G209)","v":0}]
["Maestría en Ciencia y Tecnología de Alimentos",{"$f":"+C209+D209","v":16},1,15,{"$f":"+F209+G209","v":0},0,0]
[]
["Facultad de Derecho, Medicina, Psicología y Ciencias Sociales Sociología",{"$f":"+C211+D211","v":42},{"$f":"SUM(C212:C212)","v":11},{"$f":"SUM(D212:D212)","v":31},{"$f":"+F211+G211","v":0},{"$f":"SUM(F212:F212)","v":0},{"$f":"SUM(G212:G212)","v":0}]
["Maestría en Derechos de Infancia y Políticas Públicas",{"$f":"+C212+D212","v":42},11,31,{"$f":"+F212+G212","v":0},0,0]
[]
["Facultad de Arquitectura, Derecho, Ingeniería,Ciencias Sociales Sociología y Ciencias",{"$f":"+C214+D214","v":0},{"$f":"SUM(C215:C215)","v":0},{"$f":"SUM(D215:D215)","v":0},{"$f":"+F214+G214","v":1},{"$f":"SUM(F215:F215)","v":0},{"$f":"SUM(G215:G215)","v":1}]
["Maestría en Manejo Costero Integrado del Cono Sur",{"$f":"+C215+D215","v":0},0,0,{"$f":"+F215+G215","v":1},0,1]
[]
["EUBCA y Licenciatura en Comunicaciones",{"$f":"+C217+D217","v":40},{"$f":"SUM(C218:C218)","v":15},{"$f":"SUM(D218:D218)","v":25},{"$f":"+F217+G217","v":0},{"$f":"SUM(F218:F218)","v":0},{"$f":"SUM(G218:G218)","v":0}]
["Magíster en Información y Comunicación",{"$f":"+C218+D218","v":40},15,25,{"$f":"+F218+G218","v":0},0,0]
[]
["Facultad de Agronomía y Veterinaria",{"$f":"+C220+D220","v":36},{"$f":"SUM(C221:C221)","v":21},{"$f":"SUM(D221:D221)","v":15},{"$f":"+F220+G220","v":6},{"$f":"SUM(F221:F221)","v":2},{"$f":"SUM(G221:G221)","v":4}]
["Especialización en Industria Cárnica (1)",{"$f":"+C221+D221","v":36},21,15,{"$f":"+F221+G221","v":6},2,4]
["Fuente: División Estadística - Dirección General de Planeamiento - UdelaR."]
["Nota:"]
["(1) Carera compartida entre las Facultades de Agronomía y Veterinaria."]

{"sheet":"II-6.2.7 ","index":214,"n_rows":153,"n_cols":10,"rows_kept":153,"cut":false,"hidden":false,"merged":[[6,5,6,6],[6,8,6,9],[0,5,1,8],[4,0,4,9],[5,0,7,0],[5,1,7,1],[5,2,5,3],[5,4,7,4],[5,5,5,6],[5,7,7,7],[5,8,5,9],[6,2,6,3]]}
["UNIVERSIDADES PRIVADAS: OFERTA DE POSTGRADO",null,null,null,null,"ALUMNOS MATRICULADOS"]
[]
["Cuadro Nº II-6.2.7"]
[]
["ALUMNOS INGRESADOS, MATRICULADOS Y EGRESADOS EN PROGRAMAS DE POSTGRADO DE UNIVERSIDADES PRIVADAS POR SEXO SEGÚN UNIVERSIDAD Y ACREDITACIÓN. AÑO 2011."]
["UNIVERSIDAD / ACREDITACIÓN","TOTAL","INGRESADOS",null,"TOTAL","MATRICULADOS",null,"TOTAL","EGRESADOS"]
[null,null,"SEXO",null,null,"SEXO",null,null,"SEXO"]
[null,null,"M","F",null,"M","F",null,"M","F"]
["TOTAL",{"$f":"SUM(C9:D9)","v":1190},{"$f":"C11+C81+C109+C136","v":426},{"$f":"D11+D81+D109+D136","v":764},{"$f":"SUM(F9:G9)","v":3926},{"$f":"F11+F81+F109+F136","v":1285},{"$f":"G11+G81+G109+G136","v":2641},{"$f":"SUM(I9:J9)","v":495},{"$f":"I11+I81+I109+I136","v":187},{"$f":"J11+J81+J109+J136","v":308}]
[]
["UCUDAL",{"$f":"SUM(C11:D11)","v":558},{"$f":"+C13+C22+C39+C60+C66+C70+C74","v":114},{"$f":"+D13+D22+D39+D60+D66+D70+D74","v":444},{"$f":"SUM(F11:G11)","v":2244},{"$f":"+F13+F22+F39+F60+F66+F70+F74","v":510},{"$f":"+G13+G22+G39+G60+G66+G70+G74","v":1734},{"$f":"SUM(I11:J11)","v":157},{"$f":"+I13+I22+I39+I60+I66+I70+I74","v":42},{"$f":"+J13+J22+J39+J60+J66+J70+J74","v":115}]
[]
["FACULTAD DE CIENCIAS EMPRESARIALES",{"$f":"+C13+D13","v":116},{"$f":"SUM(C14:C20)","v":62},{"$f":"SUM(D14:D20)","v":54},{"$f":"+F13+G13","v":415},{"$f":"SUM(F14:F20)","v":224},{"$f":"SUM(G14:G20)","v":191},{"$f":"+I13+J13","v":74},{"$f":"SUM(I14:I20)","v":31},{"$f":"SUM(J14:J20)","v":43}]
["Postgrado en Finanzas Corporativas",17,8,9,54,27,27,4,3,1]
["Postgrado en Finanzas Bancarias",9,4,5,25,10,15,11,3,8]
["Postgrado en Tributaria",4,1,3,33,12,21,8,4,4]
["Postgrado en Marketing",4,2,2,52,26,26,6,4,2]
["Postgrado en Gestión de RRHH",18,4,14,52,14,38,20,4,16]
["Postgrado en Dirección y Administración de Empresas",30,20,10,73,48,25,8,2,6]
["Maestría en Dirección de Empresas",{"$f":"+C20+D20","v":34},23,11,{"$f":"+F20+G20","v":126},87,39,{"$f":"+I20+J20","v":17},11,6]
[]
["FACULTAD DE CIENCIAS HUMANAS",{"$f":"+C22+D22","v":170},{"$f":"SUM(C23:C37)","v":23},{"$f":"SUM(D23:D37)","v":147},{"$f":"+F22+G22","v":590},{"$f":"SUM(F23:F37)","v":113},{"$f":"SUM(G23:G37)","v":477},{"$f":"+I22+J22","v":38},{"$f":"SUM(I23:I37)","v":6},{"$f":"SUM(J23:J37)","v":32}]
["Postgrado en Cambio Organizacional ",{"$f":"+C23+D23","v":31},7,24,{"$f":"+F23+G23","v":87},20,67,{"$f":"+I23+J23","v":4},1,3]
["Postgrado en Comunicación y Cultura",{"$f":"+C24+D24","v":4},0,4,{"$f":"+F24+G24","v":16},6,10,{"$f":"+I24+J24","v":0},0,0]
["Postgrado en Estrategias Comunicacionales",{"$f":"+C25+D25","v":11},3,8,{"$f":"+F25+G25","v":33},12,21,{"$f":"+I25+J25","v":0},0,0]
["Postgrado en Gestión de Centros Educativos",{"$f":"+C26+D26","v":42},7,35,{"$f":"+F26+G26","v":128},22,106,{"$f":"+I26+J26","v":4},0,4]
["Postgrado en Didáctica de la Matemática",{"$f":"+C27+D27","v":0},0,0,{"$f":"+F27+G27","v":6},0,6,{"$f":"+I27+J27","v":0},0,0]
["Postgrado en Dificultades de Aprendizaje del Lenguaje y Razonamiento",67,1,66,163,8,155,17,4,13]
["Postgrado en Docencia Universitaria",0,0,0,5,2,3,0,0,0]
["Postgrado en Currículum y Evaluación",0,0,0,1,0,1,0,0,0]
["Postgrado en Educación en Valores",0,0,0,0,0,0,0,0,0]
["Postgrado en Comunicación Política y Gestión de Campañas Electorales",0,0,0,1,1,0,0,0,0]
["Maestría en Comunicación - énfasis en Recepción y Cultura",7,4,3,{"$f":"+F33+G33","v":27},11,16,{"$f":"+I33+J33","v":0},0,0]
["Maestría en Educación",0,0,0,{"$f":"+F34+G34","v":64},10,54,{"$f":"+I34+J34","v":8},1,7]
["Maestría en Comunicación Política",0,0,0,{"$f":"+F35+G35","v":18},9,9,{"$f":"+I35+J35","v":0},0,0]
["Maestría en Estudios Organizacionales",8,1,7,{"$f":"+F36+G36","v":41},12,29,{"$f":"+I36+J36","v":4},0,4]
["Maestría en Desarrollo Local UCU - CLAEH",0,0,0,{"$f":"+F37+G37","v":0},0,0,{"$f":"+I37+J37","v":1},0,1]
[]
["FACULTAD DE PSICOLOGÍA",{"$f":"+C39+D39","v":234},{"$f":"SUM(C40:C58)","v":26},{"$f":"SUM(D40:D58)","v":208},{"$f":"+F39+G39","v":992},{"$f":"SUM(F40:F58)","v":121},{"$f":"SUM(G40:G58)","v":871},{"$f":"+I39+J39","v":24},{"$f":"SUM(I40:I58)","v":3},{"$f":"SUM(J40:J58)","v":21}]
["Postgrado en Psiconeuroinmunoendocrinología",36,2,34,109,8,101,3,0,3]
["Postgrado en Psicología Educacional",42,4,38,183,18,165,0,0,0]
["Postgrado en Psicología del Trabajo y Organización",26,1,25,74,8,66,1,0,1]
["Postgrado en Psicología Clínica orientación Cognitiva",19,1,18,72,3,69,0,0,0]
["Postgrado en Drogodependencia",36,8,28,94,21,73,3,0,3]
["Postgrado en Psicología Infantil y del Adolescente",15,3,12,77,8,69,3,0,3]
["Postgrado en Psicología Analítica",6,1,5,16,7,9,0,0,0]
["Postgrado en Psicología Sistémica y Familias",3,0,3,39,3,36,0,0,0]
["Postgrado en Orientación Educativa",20,2,18,35,5,30,0,0,0]
["Postgrado en Intervención Psicosocial",11,1,10,26,3,23,0,0,0]
["Postgrado en Diabetología",2,0,2,57,15,42,8,3,5]
["Maestría en Intervención Psicopedagógica",{"$f":"+C51+D51","v":2},0,2,{"$f":"+F51+G51","v":24},1,23,0,0,0]
["Maestría en Psicología Educacional",{"$f":"+C52+D52","v":8},2,6,{"$f":"+F52+G52","v":32},4,28,1,0,1]
["Maestría en Psicología Clínica Niños y Adolescentes",{"$f":"+C53+D53","v":0},0,0,{"$f":"+F53+G53","v":17},1,16,0,0,0]
["Maestría en Psicoterapia Jungiana",{"$f":"+C54+D54","v":0},0,0,{"$f":"+F54+G54","v":30},6,24,0,0,0]
["Maestría en Psicología Clínica Familiar Sistémica",{"$f":"+C55+D55","v":0},0,0,{"$f":"+F55+G55","v":24},2,22,1,0,1]
["Maestría en Psicología Clínica orientación Analítica",0,0,0,0,0,0,0,0,0]
["Maestría en Nutrición",4,0,4,79,7,72,4,0,4]
["Doctorado en Psicología",4,1,3,4,1,3,0,0,0]
[]
["FACULTAD DE ENFERMERÍA Y TECNOLOGÍAS DE LA SALUD",{"$f":"+C60+D60","v":23},{"$f":"SUM(C61:C64)","v":2},{"$f":"SUM(D61:D64)","v":21},{"$f":"+F60+G60","v":141},{"$f":"SUM(F61:F64)","v":14},{"$f":"SUM(G61:G64)","v":127},{"$f":"+I60+J60","v":20},{"$f":"SUM(I61:I64)","v":1},{"$f":"SUM(J61:J64)","v":19}]
["Postgrado en Gestión de Servicios de Salud",{"$f":"+C61+D61","v":20},2,18,{"$f":"+F61+G61","v":95},14,81,{"$f":"+I61+J61","v":14},1,13]
["Postgrado en Salud Comunitaria",{"$f":"+C62+D62","v":0},0,0,{"$f":"+F62+G62","v":26},0,26,{"$f":"+I62+J62","v":6},0,6]
["Postgrado en Enfermería Oncológica",{"$f":"+C63+D63","v":2},0,2,{"$f":"+F63+G63","v":2},0,2,{"$f":"+I63+J63","v":0},0,0]
["Postgrado en Urgencias y Emergencias Hospitalarias",{"$f":"+C64+D64","v":1},0,1,{"$f":"+F64+G64","v":18},0,18,{"$f":"+I64+J64","v":0},0,0]
[]
["FACULTAD DE INGENIERÍA Y TECNOLOGÍAS -",{"$f":"+C66+D66","v":15},{"$f":"SUM(C67:C68)","v":1},{"$f":"SUM(D67:D68)","v":14},{"$f":"+F66+G66","v":24},{"$f":"SUM(F67:F68)","v":6},{"$f":"SUM(G67:G68)","v":18},{"$f":"+I66+J66","v":1},{"$f":"SUM(I67:I68)","v":1},{"$f":"SUM(J67:J68)","v":0}]
["Postgrado en Ciencia y Tecnología de Alimentos",{"$f":"+C67+D67","v":15},1,14,{"$f":"+F67+G67","v":16},2,14,{"$f":"+I67+J67","v":0},0,0]
["Maestría en Ciencias de la Ingeniería Eléctrica",{"$f":"+C68+D68","v":0},0,0,{"$f":"+F68+G68","v":8},4,4,{"$f":"+I68+J68","v":1},1,0]
[]
["FACULTAD DE DERECHO",{"$f":"+C70+D70","v":0},{"$f":"SUM(C71:C72)","v":0},{"$f":"SUM(D71:D72)","v":0},{"$f":"+F70+G70","v":53},{"$f":"SUM(F71:F72)","v":32},{"$f":"SUM(G71:G72)","v":21},{"$f":"+I70+J70","v":0},{"$f":"SUM(I71:I72)","v":0},{"$f":"SUM(J71:J72)","v":0}]
["Maestría en Derecho",{"$f":"+C71+D71","v":0},0,0,{"$f":"+F71+G71","v":27},16,11,{"$f":"+I71+J71","v":0},0,0]
["Maestría en Derecho Civil Contractual",{"$f":"+C72+D72","v":0},0,0,{"$f":"+F72+G72","v":26},16,10,{"$f":"+I72+J72","v":0},0,0]
[]
["INTERFACULTADES",{"$f":"+C74+D74","v":0},{"$f":"SUM(C75:C79)","v":0},{"$f":"SUM(D75:D79)","v":0},{"$f":"+F74+G74","v":29},{"$f":"SUM(F75:F79)","v":0},{"$f":"SUM(G75:G79)","v":29},{"$f":"+I74+J74","v":0},{"$f":"SUM(I75:I79)","v":0},{"$f":"SUM(J75:J79)","v":0}]
["Postgrado en Psicología Educacional - Paysandú",0,0,0,3,0,3,0,0,0]
["Postgrado en Psicología Sistémica y Familias - Salto",0,0,0,0,0,0,0,0,0]
["Postgrado en Dificultad de Aprendizaje - Salto",0,0,0,0,0,0,0,0,0]
["Postgrado en Psicología Educacional - Salto",0,0,0,26,0,26,0,0,0]
["Maestría en Educación y Sociedad - Maldonado",0,0,0,0,0,0,0,0,0]
[]
["UNIVERSIDAD ORT URUGUAY",{"$f":"+B83+B99+B103","v":182},74,108,631,271,360,156,49,107]
[]
["FACULTAD DE ADMINISTRACIÓN Y CIENCIAS SOCIALES",{"$f":"+C83+D83","v":139},{"$f":"SUM(C84:C97)","v":59},{"$f":"SUM(D84:D97)","v":80},{"$f":"+F83+G83","v":461},{"$f":"SUM(F84:F97)","v":207},{"$f":"SUM(G84:G97)","v":254},{"$f":"+I83+J83","v":99},{"$f":"SUM(I84:I97)","v":33},{"$f":"SUM(J84:J97)","v":66}]
["Diploma de Especialización en Recursos Humanos",14,2,12,36,5,31,8,0,8]
["Diploma de Especialización en Finanzas",12,5,7,37,17,20,13,6,7]
["Master en Administración de Empresas",27,14,13,99,69,30,18,14,4]
["Master en Políticas Públicas",0,0,0,1,1,0,0,0,0]
["MBA en Agronegocios",0,0,0,1,1,0,0,0,0]
["Master en Dirección de Recursos Humanos",5,2,3,34,7,27,9,1,8]
["Master en Dirección Financiera",7,5,2,35,20,15,6,2,4]
["Diploma de Especialización en Impuestos",29,6,23,97,26,71,31,7,24]
["Diploma de Especialización en Dirección de Marketing",17,8,9,39,12,27,8,1,7]
["Diploma de Especialización en Contabilidad",6,1,5,16,3,13,4,0,4]
["Master en Contabilidad e Impuestos",3,1,2,19,9,10,0,0,0]
["Diploma de Especialización en Economía",0,0,0,0,0,0,2,2,0]
["Master en Economía por Investigación",0,0,0,12,7,5,0,0,0]
["Master en Gerencia de Empresas Tecnológicas",19,15,4,35,30,5,0,0,0]
[]
["FACULTAD DE INGENIERÍA",{"$f":"+C99+D99","v":5},{"$f":"SUM(C100:C101)","v":4},{"$f":"SUM(D100:D101)","v":1},{"$f":"+F99+G99","v":33},{"$f":"SUM(F100:F101)","v":25},{"$f":"SUM(G100:G101)","v":8},{"$f":"+I99+J99","v":2},{"$f":"SUM(I100:I101)","v":2},{"$f":"SUM(J100:J101)","v":0}]
["Doctorado en Ingeniería Informática",{"$f":"+C100+D100","v":0},0,0,{"$f":"+F100+G100","v":7},6,1,{"$f":"+I100+J100","v":0},0,0]
["Master en Ingeniería",{"$f":"+C101+D101","v":5},4,1,{"$f":"+F101+G101","v":26},19,7,{"$f":"+I101+J101","v":2},2,0]
[]
["INSTITUTO DE EDUCACIÓN",{"$f":"+C103+D103","v":38},{"$f":"SUM(C104:C107)","v":11},{"$f":"SUM(D104:D107)","v":27},{"$f":"+F103+G103","v":137},{"$f":"SUM(F104:F107)","v":39},{"$f":"SUM(G104:G107)","v":98},{"$f":"+I103+J103","v":55},{"$f":"SUM(I104:I107)","v":14},{"$f":"SUM(J104:J107)","v":41}]
["Diploma en Educación (a distancia)",1,1,0,1,1,0,13,1,12]
["Master en Educación",23,8,15,73,17,56,17,3,14]
["Diploma en Planificación y Gestión Educativa (a distancia)",0,0,0,9,6,3,14,7,7]
["Master en Gestión Educativa",14,2,12,54,15,39,11,3,8]
[]
["UNIVERSIDAD DE MONTEVIDEO",{"$f":"+C109+D109","v":221},{"$f":"+C111+C115+C121+C125+C132","v":123},{"$f":"+D111+D115+D121+D125+D132","v":98},{"$f":"+F109+G109","v":579},{"$f":"+F111+F115+F121+F125+F132","v":274},{"$f":"+G111+G115+G121+G125+G132","v":305},{"$f":"+I109+J109","v":112},{"$f":"+I111+I115+I121+I125+I132","v":56},{"$f":"+J111+J115+J121+J125+J132","v":56}]
[]
["FACULTAD DE CIENCIAS EMPRESARIALES Y ECONOMÍA",{"$f":"+C111+D111","v":26},{"$f":"SUM(C112:C113)","v":11},{"$f":"SUM(D112:D113)","v":15},{"$f":"+F111+G111","v":79},{"$f":"SUM(F112:F113)","v":42},{"$f":"SUM(G112:G113)","v":37},{"$f":"+I111+J111","v":14},{"$f":"SUM(I112:I113)","v":7},{"$f":"SUM(J112:J113)","v":7}]
["Maestría en Economía",{"$f":"+C112+D112","v":6},3,3,{"$f":"+F112+G112","v":27},19,8,{"$f":"+I112+J112","v":6},5,1]
["Maestría en Finanzas",{"$f":"+C113+D113","v":20},8,12,{"$f":"+F113+G113","v":52},23,29,{"$f":"+I113+J113","v":8},2,6]
[]
["FACULTAD DE DERECHO",{"$f":"+C115+D115","v":40},{"$f":"SUM(C116:C119)","v":18},{"$f":"SUM(D116:D119)","v":22},{"$f":"+F115+G115","v":210},{"$f":"SUM(F116:F119)","v":77},{"$f":"SUM(G116:G119)","v":133},{"$f":"+I115+J115","v":36},{"$f":"SUM(I116:I119)","v":16},{"$f":"SUM(J116:J119)","v":20}]
["Maestría en Derecho Administrativo Económico",{"$f":"+C116+D116","v":8},4,4,{"$f":"+F116+G116","v":33},10,23,{"$f":"+I116+J116","v":3},2,1]
["Maestría en Derecho de la Empresa",{"$f":"+C117+D117","v":10},5,5,{"$f":"+F117+G117","v":48},21,27,{"$f":"+I117+J117","v":4},2,2]
["Maestría en Derecho y Técnica Tributaria",{"$f":"+C118+D118","v":15},7,8,{"$f":"+F118+G118","v":108},38,70,{"$f":"+I118+J118","v":25},11,14]
["Maestría en Integración y Comercio Internacional",{"$f":"+C119+D119","v":7},2,5,{"$f":"+F119+G119","v":21},8,13,{"$f":"+I119+J119","v":4},1,3]
[]
["INSTITUTO DE ESTUDIOS EMPRESARIALES",{"$f":"+C121+D121","v":81},{"$f":"SUM(C122:C123)","v":56},{"$f":"SUM(D122:D123)","v":25},{"$f":"+F121+G121","v":140},{"$f":"SUM(F122:F123)","v":91},{"$f":"SUM(G122:G123)","v":49},{"$f":"+I121+J121","v":52},{"$f":"SUM(I122:I123)","v":30},{"$f":"SUM(J122:J123)","v":22}]
["Maestría en Dirección y Administración de Empresas",{"$f":"+C122+D122","v":48},36,12,{"$f":"+F122+G122","v":82},56,26,{"$f":"+I122+J122","v":33},19,14]
["Maestría en Dirección de Empresas de Salud",{"$f":"+C123+D123","v":33},20,13,{"$f":"+F123+G123","v":58},35,23,{"$f":"+I123+J123","v":19},11,8]
[]
["CENTRO DE CIENCIAS BIOMÉDICAS",{"$f":"+C125+D125","v":48},{"$f":"SUM(C126:C130)","v":17},{"$f":"SUM(D126:D130)","v":31},{"$f":"+F125+G125","v":124},{"$f":"SUM(F126:F130)","v":43},{"$f":"SUM(G126:G130)","v":81},{"$f":"+I125+J125","v":10},{"$f":"SUM(I126:I130)","v":3},{"$f":"SUM(J126:J130)","v":7}]
["Maestría en Medicina Familiar",17,5,12,34,7,27,6,1,5]
["Maestría en Farmacología Clínica",3,2,1,14,5,9,0,0,0]
["Especialización en Traumatología y Ortopedia",0,0,0,5,2,3,0,0,0]
["Especialización en Medicina de Emergencia",28,10,18,71,29,42,4,2,2]
["Especialización en Mastología",0,0,0,0,0,0,0,0,0]
[]
["FACULTAD DE HUMANIDADES",{"$f":"+C132+D132","v":26},{"$f":"SUM(C133:C134)","v":21},{"$f":"SUM(D133:D134)","v":5},{"$f":"+F132+G132","v":26},{"$f":"SUM(F133:F134)","v":21},{"$f":"SUM(G133:G134)","v":5},{"$f":"+I132+J132","v":0},{"$f":"SUM(I133:I134)","v":0},{"$f":"SUM(J133:J134)","v":0}]
["Maestría en Historia",{"$f":"+C133+D133","v":18},16,2,{"$f":"+F133+G133","v":18},16,2,{"$f":"+I133+J133","v":0},0,0]
["Maestría en Estudios Latinoamericanos",{"$f":"+C134+D134","v":8},5,3,{"$f":"+F134+G134","v":8},5,3,{"$f":"+I134+J134","v":0},0,0]
[]
["UNIVERSIDAD DE LA EMPRESA",{"$f":"+C136+D136","v":229},{"$f":"SUM(C138:C152)","v":115},{"$f":"SUM(D138:D152)","v":114},{"$f":"+F136+G136","v":472},{"$f":"SUM(F138:F152)","v":230},{"$f":"SUM(G138:G152)","v":242},{"$f":"+I136+J136","v":70},{"$f":"SUM(I138:I152)","v":40},{"$f":"SUM(J138:J152)","v":30}]
[]
["Postgrado Especialización en Dirección de Marketing",{"$f":"+C138+D138","v":14},6,8,{"$f":"+F138+G138","v":21},11,10,{"$f":"+I138+J138","v":7},4,3]
["Postgrado Finanzas",0,0,0,6,3,3,0,0,0]
["Postgrado Especialización en Ventas",0,0,0,0,0,0,0,0,0]
["Postgrado Comunicación y Relaciones Públicas",10,1,9,27,10,17,0,0,0]
["Postgrado en Habilidades Gerenciales",15,4,11,19,5,14,5,0,5]
["Postgrado en Recursos Humanos",16,5,11,16,5,11,7,2,5]
["Postgrado en Tributación y Fiscalidad",21,9,12,21,9,12,0,0,0]
["Maestría en Direccy Admde Empresas ",51,31,20,60,37,23,6,4,2]
["Maestría en Administración",27,13,14,52,29,23,0,0,0]
["Doctorado en Administración",4,4,0,25,20,5,0,0,0]
["Postgrado de Administración en Agronegocios",14,12,2,14,12,2,12,10,2]
["Postgrado en Semillas Forrajeras",22,19,3,22,19,3,22,19,3]
["Maestría en Relac Internac y Derecho Integrac",0,0,0,20,15,5,0,0,0]
["Maestría en Educación",{"$f":"+C151+D151","v":35},11,24,{"$f":"+F151+G151","v":123},37,86,{"$f":"+I151+J151","v":7},0,7]
["Doctorado en Educación",{"$f":"+C152+D152","v":0},0,0,{"$f":"+F152+G152","v":46},18,28,{"$f":"+I152+J152","v":4},1,3]
["Fuente: Oficinas Productoras de cada una de las Instituciones. "]

{"sheet":"II-6.2.8 ","index":215,"n_rows":60,"n_cols":10,"rows_kept":60,"cut":false,"hidden":false,"merged":[[6,5,6,6],[6,8,6,9],[0,5,1,8],[4,0,4,9],[5,0,7,0],[5,1,7,1],[5,2,5,3],[5,4,7,4],[5,5,5,6],[5,7,7,7],[5,8,5,9],[6,2,6,3]]}
["INSTITUTOS UNIVERSITARIOS: OFERTA DE POSTGRADO",null,null,null,null,"ALUMNOS MATRICULADOS"]
[]
["Cuadro Nº II-6.2.8"]
[]
["ALUMNOS INGRESADOS, MATRICULADOS Y EGRESADOS EN PROGRAMAS DE POSTGRADO DE INSTITUTOS UNIVERSITARIOS POR SEXO SEGÚN INSTITUTO UNIVERSITARIO Y ACREDITACIÓN. AÑO 2011."]
["INSTITUTO UNIVERSITARIO / ACREDITACIÓN","TOTAL","INGRESADOS",null,"TOTAL","MATRICULADOS",null,"TOTAL","EGRESADOS"]
[null,null,"SEXO",null,null,"SEXO",null,null,"SEXO"]
[null,null,"M","F",null,"M","F",null,"M","F"]
["TOTAL",{"$f":"SUM(C9:D9)","v":498},{"$f":"+C11+C39+C41+C51+C48+C54","v":210},{"$f":"+D11+D39+D41+D51+D48+D54","v":288},{"$f":"SUM(F9:G9)+567","v":1167},{"$f":"+F11+F39+F41+F51+F48+F54","v":169},{"$f":"+G11+G39+G41+G51+G48+G54","v":431},{"$f":"SUM(I9:J9)","v":304},{"$f":"+I11+I39+I41+I51+I48+I54","v":142},{"$f":"+J11+J39+J41+J51+J48+J54","v":162}]
[]
["INST UNIV CLAEH ",{"$f":"+C11+D11","v":160},{"$f":"SUM(C13:C36)","v":43},{"$f":"SUM(D13:D36)","v":117},{"$f":"+F11+G11","v":352},{"$f":"SUM(F13:F36)","v":89},{"$f":"SUM(G13:G36)","v":263},{"$f":"+I11+J11","v":46},{"$f":"SUM(I13:I36)","v":11},{"$f":"SUM(J13:J36)","v":35}]
[]
["Diploma de Especialización en Políticas Sociales",{"$f":"+C13+D13","v":12},6,6,{"$f":"+F13+G13","v":20},8,12,{"$f":"+I13+J13","v":1},0,1]
["Diploma de Posgrado en Gestión de Servicios de Salud",42,19,23,98,33,65,9,2,7]
["Maestria en Políticas y Gestión de la Educación",26,5,21,28,6,22,16,4,12]
["Maestria en Políticas y Gestión de la Educación",0,0,0,3,1,2,0,0,0]
["Posgrado en Políticas y Gestión de la Educación",26,4,22,67,16,51,7,3,4]
["Maestria en Didáctica de la Educación Básica",0,0,0,4,0,4,0,0,0]
["Posgrado en Didácitca de la Educación Básica",5,0,5,31,0,31,2,0,2]
["Posgrado en Didáctica de la Educación Básica",0,0,0,1,0,1,0,0,0]
["Maestría en Políticas y Gestión de la Salud",17,5,12,31,9,22,0,0,0]
["Maestría en Docencia de la Educación Media ",0,0,0,5,2,3,0,0,0]
["Maestría en Tecnología Educativa",0,0,0,4,2,2,0,0,0]
["Posgrado en Tecnología Educativa",8,2,6,15,2,13,7,1,6]
["Maestria en Didáctica de la Historia",14,1,13,35,9,26,0,0,0]
["Posgrado de Especializacion en Integracion y Mercosur",0,0,0,0,0,0,0,0,0]
["Especializacion en Farmacodependencia",0,0,0,0,0,0,0,0,0]
["Diploma en Investigacion en Historia Contemporenea",0,0,0,0,0,0,0,0,0]
["Maestría en Politicas de Infancia y Adolescencia",0,0,0,0,0,0,1,0,1]
["Maestría en Políticas y Gestión de la Educación",0,0,0,0,0,0,0,0,0]
["Posgrado en Políticas y Gestión de la Educación",0,0,0,0,0,0,0,0,0]
["Posgrado en Políticas y Gestión de la Educación",0,0,0,0,0,0,0,0,0]
["Posgrado en didáctica de la Educación Básica",0,0,0,10,1,9,0,0,0]
["Posgrado en Docencia de la Educación Media",10,1,9,0,0,0,0,0,0]
["Maestria en Políticas Sociales",0,0,0,0,0,0,1,1,0]
["Maestria en Desarrollo Regional y Local",0,0,0,0,0,0,2,0,2]
[]
["INST UNIV DE POSTGRADO EN PSICOANÁLISIS (APU) -"]
["Maestría en Psicoanálisis",{"$f":"+C39+D39","v":8},2,6,{"$f":"+F39+G39","v":48},10,38,{"$f":"+I39+J39","v":4},1,3]
[]
["INST UNIV BIOS",{"$f":"+C41+D41","v":0},{"$f":"SUM(C42:C46)","v":0},{"$f":"SUM(D42:D46)","v":0},{"$f":"+F41+G41","v":43},{"$f":"SUM(F42:F46)","v":14},{"$f":"SUM(G42:G46)","v":29},{"$f":"+I41+J41","v":0},{"$f":"SUM(I42:I46)","v":0},{"$f":"SUM(J42:J46)","v":0}]
["Maestría en Diseño",0,0,0,12,3,9,0,0,0]
["Maestría en Paisajismo",0,0,0,25,8,17,0,0,0]
["Maestría en Comunicación",0,0,0,6,3,3,0,0,0]
["Maestría en Gerontología",0,0,0,0,0,0,0,0,0]
["Maestría en Educación",0,0,0,0,0,0,0,0,0]
[]
["INST METODISTA UNIV CRANDON",{"$f":"+C48+D48","v":5},{"$f":"SUM(C49)","v":0},{"$f":"SUM(D49)","v":5},{"$f":"+F48+G48","v":9},{"$f":"SUM(F49)","v":1},{"$f":"SUM(G49)","v":8},{"$f":"+I48+J48","v":4},{"$f":"SUM(I49)","v":1},{"$f":"SUM(J49)","v":3}]
["Posgrado en Traducción",{"$f":"+C49+D49","v":5},0,5,{"$f":"+F49+G49","v":9},1,8,{"$f":"+I49+J49","v":4},1,3]
[]
["INST UNIV CEDIIAP",{"$f":"+C51+D51","v":219},{"$f":"SUM(C52:C59)","v":110},{"$f":"SUM(D52:D59)","v":109},{"$f":"+F51+G51","v":42},{"$f":"SUM(F52:F53)","v":0},{"$f":"SUM(G52:G53)","v":42},{"$f":"+I51+J51","v":170},{"$f":"SUM(I52:I59)","v":86},{"$f":"SUM(J52:J59)","v":84}]
["Especialización en Dificultades de Aprendizaje con mención en las funciones psicológicas superiores",{"$f":"+C52+D52","v":7},0,7,{"$f":"+F52+G52","v":42},0,42,{"$f":"+I52+J52","v":10},0,10]
[]
["Centro de Altos Estudios Nacionales (CALEN)",{"$f":"+C54+D54","v":106},{"$f":"SUM(C55:C58)","v":55},{"$f":"SUM(D55:D58)","v":51},{"$f":"+F54+G54","v":106},{"$f":"SUM(F55:F58)","v":55},{"$f":"SUM(G55:G58)","v":51},{"$f":"+I54+J54","v":80},{"$f":"SUM(I55:I58)","v":43},{"$f":"SUM(J55:J58)","v":37}]
["Especialización en Altos Estudios Nacionales",{"$f":"+C55+D55","v":41},25,16,{"$f":"+F55+G55","v":41},25,16,{"$f":"+I55+J55","v":32},19,13]
["Especialización en Ejercicios Estratégicos",42,19,23,42,19,23,31,15,16]
["Especialización en Metodología de Investigación en el Ámbito de la Estrategia Nacional",23,11,12,23,11,12,17,9,8]
["Maestría en Estrategia Nacional",{"$f":"+C58+D58","v":0},0,0,{"$f":"+F58+G58","v":0},0,0,{"$f":"+I58+J58","v":0},0,0]
["Fuente: Oficinas Productoras de cada una de las Instituciones. "]
["Nota: Para las definiciones de ingreso, matrícula y egreso, ir a Anexo-Definiciones. "]

{"sheet":"II-6.2.9 ","index":216,"n_rows":127,"n_cols":11,"rows_kept":127,"cut":false,"hidden":false,"merged":[[127,0,127,10],[0,3,1,6],[4,0,4,10],[5,0,8,0],[5,1,5,10],[6,1,8,1],[6,2,6,4],[6,5,6,7],[6,8,6,10],[7,2,8,2],[7,3,7,4],[7,5,8,5],[7,6,7,7],[7,8,8,8],[7,9,7,10],[126,0,126,10]]}
["UNIVERSIDADES E INSTITUTOS UNIVERSITARIOS",null,null,"PERSONAL ACADÉMICO"]
[]
["Cuadro Nº II-6.2.9"]
[]
["PERSONAL DOCENTE Y NO DOCENTE DE INSTITUCIONES UNIVERSITARIAS PUBLICAS Y PRIVADAS EXPRESADAS EN POSICIONES FUNCIONALES POR CARGA HORARIA SEMANAL SEGÚN INSTITUCIÓN, ACTIVIDAD Y SEXO. AÑO 2011."]
["INSTITUCIÓN / ACTIVIDAD","Carga horaria semanal"]
[null,"TOTAL","19 y -",null,null,"20 a 39",null,null,"40 y +"]
[null,null,"Total","Sexo",null,"Total","Sexo",null,"Total","Sexo"]
[null,null,null,"M","F",null,"M","F",null,"M","F"]
["TOTAL DOCENTYE Y NO DOCENTE",{"$f":"+C10+F10+I10","v":23443},{"$f":"+C11+C12","v":10027},{"$f":"SUM(D11:D12)","v":0},{"$f":"SUM(E11:E12)","v":0},{"$f":"+F11+F12","v":7463},{"$f":"SUM(G11:G12)","v":0},{"$f":"SUM(H11:H12)","v":0},{"$f":"+I11+I12","v":5953},{"$f":"SUM(J11:J12)","v":0},{"$f":"SUM(K11:K12)","v":0}]
["Total Personal Docente",{"$f":"+C11+F11+I11","v":16631},{"$f":"C15+C19","v":9750},"s/d","s/d",{"$f":"F15+F19","v":4871},"s/d","s/d",{"$f":"I15+I19","v":2010},"s/d","s/d"]
["Total Personal NO Docente",{"$f":"+C12+F12+I12","v":6812},{"$f":"C16+C20","v":277},"s/d","s/d",{"$f":"F16+F20","v":2592},"s/d","s/d",{"$f":"I16+I20","v":3943},"s/d","s/d"]
[]
["TOTAL UDELAR DOCENTYE Y NO DOCENTE*",{"$f":"+C14+F14+I14","v":15547},{"$f":"+C15+C16","v":3495},{"$f":"SUM(D15:D16)","v":0},{"$f":"SUM(E15:E16)","v":0},{"$f":"+F15+F16","v":6744},{"$f":"SUM(G15:G16)","v":0},{"$f":"SUM(H15:H16)","v":0},{"$f":"+I15+I16","v":5308},{"$f":"SUM(J15:J16)","v":0},{"$f":"SUM(K15:K16)","v":0}]
["Personal Docente UDELAR",{"$f":"+C15+F15+I15","v":9677},3495,"s/d","s/d",4393,"s/d","s/d",1789,"s/d","s/d"]
["Personal NO Docente UDELAR",{"$f":"+C16+F16+I16","v":5870},0,"s/d","s/d",2351,"s/d","s/d",3519,"s/d","s/d"]
[]
["TOTAL PRIVADOS DOCENTE Y NO DOCENTE",{"$f":"+C18+F18+I18","v":7896},{"$f":"+D18+E18","v":6532},{"$f":"+D19+D20","v":3819},{"$f":"+E19+E20","v":2713},{"$f":"+G18+H18","v":719},{"$f":"+G19+G20","v":366},{"$f":"+H19+H20","v":353},{"$f":"+J18+K18","v":645},{"$f":"+J19+J20","v":289},{"$f":"+K19+K20","v":356}]
["Personal Docente PRIVADOS",{"$f":"+C19+F19+I19","v":6954},{"$f":"+D19+E19","v":6255},{"$f":"SUM(D23:D26,D30:D33,D37:D40,D44:D47,D51:D54,D58:D61,D65:D68,D72:D75,D79:D82,D86:D89,D93:D96,D100:D103,D107:D110,D114:D117,D121:D124)","v":3713},{"$f":"SUM(E23:E26,E30:E33,E37:E40,E44:E47,E51:E54,E58:E61,E65:E68,E72:E75,E79:E82,E86:E89,E93:E96,E100:E103,E107:E110,E114:E117,E121:E124)","v":2542},{"$f":"+G19+H19","v":478},{"$f":"SUM(G23:G26,G30:G33,G37:G40,G44:G47,G51:G54,G58:G61,G65:G68,G72:G75,G79:G82,G86:G89,G93:G96,G100:G103,G107:G110,G114:G117,G121:G124)","v":280},{"$f":"SUM(H23:H26,H30:H33,H37:H40,H44:H47,H51:H54,H58:H61,H65:H68,H72:H75,H79:H82,H86:H89,H93:H96,H100:H103,H107:H110,H114:H117,H121:H124)","v":198},{"$f":"+J19+K19","v":221},{"$f":"SUM(J23:J26,J30:J33,J37:J40,J44:J47,J51:J54,J58:J61,J65:J68,J72:J75,J79:J82,J86:J89,J93:J96,J100:J103,J107:J110,J114:J117,J121:J124)","v":132},{"$f":"SUM(K23:K26,K30:K33,K37:K40,K44:K47,K51:K54,K58:K61,K65:K68,K72:K75,K79:K82,K86:K89,K93:K96,K100:K103,K107:K110,K114:K117,K121:K124)","v":89}]
["Personal NO Docente PRIVADOS",{"$f":"+C20+F20+I20","v":942},{"$f":"+D20+E20","v":277},{"$f":"+D27+D34+D41+D48+D55+D62+D69+D76+D83+D90+D97+D104+D111+D118+D125","v":106},{"$f":"+E27+E34+E41+E48+E55+E62+E69+E76+E83+E90+E97+E104+E111+E118+E125","v":171},{"$f":"+G20+H20","v":241},{"$f":"+G27+G34+G41+G48+G55+G62+G69+G76+G83+G90+G97+G104+G111+G118+G125","v":86},{"$f":"+H27+H34+H41+H48+H55+H62+H69+H76+H83+H90+H97+H104+H111+H118+H125","v":155},{"$f":"+J20+K20","v":424},{"$f":"+J27+J34+J41+J48+J55+J62+J69+J76+J83+J90+J97+J104+J111+J118+J125","v":157},{"$f":"+K27+K34+K41+K48+K55+K62+K69+K76+K83+K90+K97+K104+K111+K118+K125","v":267}]
[]
["UCUDAL",{"$f":"C22+F22+I22","v":2556},{"$f":"+D22+E22","v":2191},{"$f":"SUM(D23:D27)","v":1066},{"$f":"SUM(E23:E27)","v":1125},{"$f":"+G22+H22","v":190},{"$f":"SUM(G23:G27)","v":73},{"$f":"SUM(H23:H27)","v":117},{"$f":"+J22+K22","v":175},{"$f":"SUM(J23:J27)","v":78},{"$f":"SUM(K23:K27)","v":97}]
["Personal Docente",1892,1891,958,933,1,1,0,0,0,0]
["Personal de Investigación y Extensión",65,58,21,37,7,1,6,0,0,0]
["Docente-Investigador",133,17,11,6,84,35,49,32,22,10]
["Personal de Gestión Universitaria",167,93,39,54,46,22,24,28,18,10]
["Personal no docente",299,132,37,95,52,14,38,115,38,77]
[]
["UNIVERSIDAD ORT URUGUAY ",{"$f":"C29+F29+I29","v":2331},{"$f":"+D29+E29","v":2017},{"$f":"SUM(D30:D34)","v":1387},{"$f":"SUM(E30:E34)","v":630},{"$f":"+G29+H29","v":175},{"$f":"SUM(G30:G34)","v":86},{"$f":"SUM(H30:H34)","v":89},{"$f":"+J29+K29","v":139},{"$f":"SUM(J30:J34)","v":70},{"$f":"SUM(K30:K34)","v":69}]
["Personal Docente",1754,1690,1171,519,52,29,23,12,7,5]
["Personal de Investigación y Extensión",44,35,25,10,9,2,7,0,0,0]
["Docente-Investigador",0,0,0,0,0,0,0,0,0,0]
["Personal de Gestión Universitaria",329,220,164,56,69,34,35,40,16,24]
["Personal no docente",204,72,27,45,45,21,24,87,47,40]
[]
["UNIVERSIDAD DE MONTEVIDEO",{"$f":"C36+F36+I36","v":800},{"$f":"+D36+E36","v":575},{"$f":"SUM(D37:D41)","v":393},{"$f":"SUM(E37:E41)","v":182},{"$f":"+G36+H36","v":64},{"$f":"SUM(G37:G41)","v":32},{"$f":"SUM(H37:H41)","v":32},{"$f":"+J36+K36","v":161},{"$f":"SUM(J37:J41)","v":68},{"$f":"SUM(K37:K41)","v":93}]
["Personal Docente",0,0,0,0,0,0,0,0,0,0]
["Personal de Investigación y Extensión",0,0,0,0,0,0,0,0,0,0]
["Docente-Investigador",649,558,380,178,36,20,16,55,35,20]
["Personal de Gestión Universitaria",0,0,0,0,0,0,0,0,0,0]
["Personal no docente",151,17,13,4,28,12,16,106,33,73]
[]
["UNIVERSIDAD DE LA EMPRESA",{"$f":"C43+F43+I43","v":771},{"$f":"+D43+E43","v":547},{"$f":"SUM(D44:D48)","v":337},{"$f":"SUM(E44:E48)","v":210},{"$f":"+G43+H43","v":82},{"$f":"SUM(G44:G48)","v":56},{"$f":"SUM(H44:H48)","v":26},{"$f":"+J43+K43","v":142},{"$f":"SUM(J44:J48)","v":58},{"$f":"SUM(K44:K48)","v":84}]
["Personal Docente",607,509,314,195,51,43,8,47,29,18]
["Personal de Investigación y Extensión",5,1,1,0,2,2,0,2,2,0]
["Docente-Investigador",14,11,4,7,3,3,0,0,0,0]
["Personal de Gestión Universitaria",0,0,0,0,0,0,0,0,0,0]
["Personal no docente",145,26,18,8,26,8,18,93,27,66]
[]
["INST UNIV AUTÓNOMO DEL SUR",{"$f":"C50+F50+I50","v":132},{"$f":"+D50+E50","v":108},{"$f":"SUM(D51:D55)","v":78},{"$f":"SUM(E51:E55)","v":30},{"$f":"+G50+H50","v":6},{"$f":"SUM(G51:G55)","v":3},{"$f":"SUM(H51:H55)","v":3},{"$f":"+J50+K50","v":18},{"$f":"SUM(J51:J55)","v":11},{"$f":"SUM(K51:K55)","v":7}]
["Personal Docente",104,104,74,30,0,0,0,0,0,0]
["Personal de Investigación y Extensión",0,0,0,0,0,0,0,0,0,0]
["Docente-Investigador",1,1,1,0,0,0,0,0,0,0]
["Personal de Gestión Universitaria",4,2,2,0,0,0,0,2,1,1]
["Personal no docente",23,1,1,0,6,3,3,16,10,6]
[]
["INST UNIV ASOCIACIÓN CRISTIANA DE JÓVENES",{"$f":"C57+F57+I57","v":135},{"$f":"+D57+E57","v":113},{"$f":"SUM(D58:D62)","v":59},{"$f":"SUM(E58:E62)","v":54},{"$f":"+G57+H57","v":22},{"$f":"SUM(G58:G62)","v":12},{"$f":"SUM(H58:H62)","v":10},{"$f":"+J57+K57","v":0},{"$f":"SUM(J58:J62)","v":0},{"$f":"SUM(K58:K62)","v":0}]
["Personal Docente",{"$f":"C58+F58+I58","v":116},113,59,54,3,2,1,0,0,0]
["Personal de Investigación y Extensión",{"$f":"C59+F59+I59","v":1},0,0,0,1,1,0,0,0,0]
["Docente-Investigador",{"$f":"C60+F60+I60","v":10},0,0,0,10,5,5,0,0,0]
["Personal de Gestión Universitaria",{"$f":"C61+F61+I61","v":8},0,0,0,8,4,4,0,0,0]
["Personal no docente",17,0,"s/d","s/d",0,"s/d","s/d",0,"s/d","s/d"]
[]
["INST UNIV CLAEH ",{"$f":"C64+F64+I64","v":281},{"$f":"+D64+E64","v":281},{"$f":"SUM(D65:D69)","v":127},{"$f":"SUM(E65:E69)","v":154},{"$f":"+G64+H64","v":0},{"$f":"SUM(G65:G69)","v":0},{"$f":"SUM(H65:H69)","v":0},{"$f":"+J64+K64","v":0},{"$f":"SUM(J65:J69)","v":0},{"$f":"SUM(K65:K69)","v":0}]
["Personal Docente",281,281,127,154,0,0,0,0,0,0]
["Personal de Investigación y Extensión",0,0,0,0,0,0,0,0,0,0]
["Docente-Investigador",0,0,0,0,0,0,0,0,0,0]
["Personal de Gestión Universitaria",0,0,0,0,0,0,0,0,0,0]
["Personal no docente",0,0,0,0,0,0,0,0,0,0]
[]
["INST METODISTA UNIV CRANDON",{"$f":"C71+F71+I71","v":84},{"$f":"+D71+E71","v":77},{"$f":"SUM(D72:D76)","v":37},{"$f":"SUM(E72:E76)","v":40},{"$f":"+G71+H71","v":3},{"$f":"SUM(G72:G76)","v":0},{"$f":"SUM(H72:H76)","v":3},{"$f":"+J71+K71","v":4},{"$f":"SUM(J72:J76)","v":0},{"$f":"SUM(K72:K76)","v":4}]
["Personal Docente",72,72,34,38,0,0,0,0,0,0]
["Personal de Investigación y Extensión",0,0,0,0,0,0,0,0,0,0]
["Docente-Investigador",5,5,3,2,0,0,0,0,0,0]
["Personal de Gestión Universitaria",0,0,0,0,0,0,0,0,0,0]
["Personal no docente",7,0,0,0,3,0,3,4,0,4]
[]
["INST UNIV DE POSTGRADO EN PSICOANÁLISIS (APU)",{"$f":"C78+F78+I78","v":84},{"$f":"+D78+E78","v":84},{"$f":"SUM(D79:D83)","v":15},{"$f":"SUM(E79:E83)","v":69},{"$f":"+G78+H78","v":0},{"$f":"SUM(G79:G83)","v":0},{"$f":"SUM(H79:H83)","v":0},{"$f":"+J78+K78","v":0},{"$f":"SUM(J79:J83)","v":0},{"$f":"SUM(K79:K83)","v":0}]
["Personal Docente",28,28,5,23,0,0,0,0,0,0]
["Personal de Investigación y Extensión",28,28,5,23,0,0,0,0,0,0]
["Docente-Investigador",28,28,5,23,0,0,0,0,0,0]
["Personal de Gestión Universitaria",0,0,0,0,0,0,0,0,0,0]
["Personal no docente",0,0,0,0,0,0,0,0,0,0]
[]
["INST UNIV MONSEÑOR MARIANO SOLER",{"$f":"C85+F85+I85","v":69},{"$f":"+D85+E85","v":60},{"$f":"SUM(D86:D90)","v":57},{"$f":"SUM(E86:E90)","v":3},{"$f":"+G85+H85","v":9},{"$f":"SUM(G86:G90)","v":3},{"$f":"SUM(H86:H90)","v":6},{"$f":"+J85+K85","v":0},{"$f":"SUM(J86:J90)","v":0},{"$f":"SUM(K86:K90)","v":0}]
["Personal Docente",60,60,57,3,0,0,0,0,0,0]
["Personal de Investigación y Extensión",0,0,0,0,0,0,0,0,0,0]
["Docente-Investigador",0,0,0,0,0,0,0,0,0,0]
["Personal de Gestión Universitaria",0,0,0,0,0,0,0,0,0,0]
["Personal no docente",9,0,0,0,9,3,6,0,0,0]
[]
["INST UNIV FRANCISCO DE ASIS ",{"$f":"C92+F92+I92","v":149},{"$f":"+D92+E92","v":149},{"$f":"SUM(D93:D97)","v":91},{"$f":"SUM(E93:E97)","v":58},{"$f":"+G92+H92","v":0},{"$f":"SUM(G93:G97)","v":0},{"$f":"SUM(H93:H97)","v":0},{"$f":"+J92+K92","v":0},{"$f":"SUM(J93:J97)","v":0},{"$f":"SUM(K93:K97)","v":0}]
["Personal Docente",118,118,82,36,0,0,0,0,0,0]
["Personal de Investigación y Extensión",0,0,0,0,0,0,0,0,0,0]
["Docente-Investigador",6,6,2,4,0,0,0,0,0,0]
["Personal de Gestión Universitaria",11,11,2,9,0,0,0,0,0,0]
["Personal no docente",14,14,5,9,0,0,0,0,0,0]
[]
["INST UNIV BIOS",{"$f":"C99+F99+I99","v":99},{"$f":"+D99+E99","v":90},{"$f":"SUM(D100:D104)","v":42},{"$f":"SUM(E100:E104)","v":48},{"$f":"+G99+H99","v":9},{"$f":"SUM(G100:G104)","v":1},{"$f":"SUM(H100:H104)","v":8},{"$f":"+J99+K99","v":0},{"$f":"SUM(J100:J104)","v":0},{"$f":"SUM(K100:K104)","v":0}]
["Personal Docente",71,65,34,31,6,1,5,0,0,0]
["Personal de Investigación y Extensión",0,0,0,0,0,0,0,0,0,0]
["Docente-Investigador",13,10,3,7,3,0,3,0,0,0]
["Personal de Gestión Universitaria",0,0,0,0,0,0,0,0,0,0]
["Personal no docente",15,15,5,10,0,0,0,0,0,0]
[]
["INST UNIV CEDIIAP",{"$f":"C106+F106+I106","v":104},{"$f":"+D106+E106","v":97},{"$f":"SUM(D107:D111)","v":11},{"$f":"SUM(E107:E111)","v":86},{"$f":"+G106+H106","v":4},{"$f":"SUM(G107:G111)","v":0},{"$f":"SUM(H107:H111)","v":4},{"$f":"+J106+K106","v":3},{"$f":"SUM(J107:J111)","v":2},{"$f":"SUM(K107:K111)","v":1}]
["Personal Docente",86,86,10,76,0,0,0,0,0,0]
["Personal de Investigación y Extensión",0,0,0,0,0,0,0,0,0,0]
["Docente-Investigador",11,11,1,10,0,0,0,0,0,0]
["Personal de Gestión Universitaria",0,0,0,0,0,0,0,0,0,0]
["Personal no docente",7,0,0,0,4,0,4,3,2,1]
[]
["Escuela Naval",{"$f":"C113+F113+I113","v":127},{"$f":"+D113+E113","v":127},{"$f":"SUM(D114:D118)","v":104},{"$f":"SUM(E114:E118)","v":23},{"$f":"+G113+H113","v":0},{"$f":"SUM(G114:G118)","v":0},{"$f":"SUM(H114:H118)","v":0},{"$f":"+J113+K113","v":0},{"$f":"SUM(J114:J118)","v":0},{"$f":"SUM(K114:K118)","v":0}]
["Personal Docente",127,127,104,23,0,0,0,0,0,0]
["Personal de Investigación y Extensión",0,0,0,0,0,0,0,0,0,0]
["Docente-Investigador",0,0,0,0,0,0,0,0,0,0]
["Personal de Gestión Universitaria",0,0,0,0,0,0,0,0,0,0]
["Personal no docente",0,0,0,0,0,0,0,0,0,0]
[]
["Centro de Altos Estudios Nacionales",{"$f":"C120+F120+I120","v":174},{"$f":"+D120+E120","v":16},{"$f":"SUM(D121:D125)","v":15},{"$f":"SUM(E121:E125)","v":1},{"$f":"+G120+H120","v":155},{"$f":"SUM(G121:G125)","v":100},{"$f":"SUM(H121:H125)","v":55},{"$f":"+J120+K120","v":3},{"$f":"SUM(J121:J125)","v":2},{"$f":"SUM(K121:K125)","v":1}]
["Personal Docente",87,0,0,0,87,75,12,0,0,0]
["Personal de Investigación y Extensión",3,0,0,0,0,0,0,3,2,1]
["Docente-Investigador",16,16,15,1,0,0,0,0,0,0]
["Personal de Gestión Universitaria",0,0,0,0,0,0,0,0,0,0]
["Personal no docente",68,0,0,0,68,25,43,0,0,0]
["Fuente: Oficinas Productoras de cada una de las Instituciones. "]
["Nota:* Padrón Setiembre 2011 - SECIU. No se dispone de la información discriminada por sexo. El personal no docente es Técnico, Administrativo y de Servicios (T/A/S)."]

{"sheet":"II-6.2.10 ","index":217,"n_rows":65,"n_cols":7,"rows_kept":65,"cut":false,"hidden":false,"merged":[[65,0,65,6],[0,2,1,4],[4,0,4,6],[5,0,6,0],[5,1,6,1],[5,2,5,5],[64,0,64,6]]}
["UNIVERSIDADES PRIVADAS E INSTITUTOS UNIVERSITARIOS",null,"ALUMNOS MATRICULADOS"]
[]
["Cuadro Nº II-6.2.10"]
[]
["ALUMNOS INGRESADOS Y MATRICULADOS DE GRADO EN UNIVERSIDADES E INSTITUTOS UNIVERSITARIOS, SEGÚN INSTITUCIÓN Y LUGAR DE ORIGEN. AÑO 2011."]
["INSTITUCIÓN / FORMACIÓN","TOTAL","ORIGEN DE LOS ESTUDIANTES"]
[null,null,"Total Uruguay","Montevideo","Interior","Extranjero","Sin dato"]
[]
["UDELAR"]
["Ingresados","s/d","s/d","s/d","s/d","s/d","s/d"]
["Matriculados","s/d","s/d","s/d","s/d","s/d","s/d"]
[]
["UCUDAL"]
["Ingresados",{"$f":"SUM(D14:G14)","v":1452},{"$f":"SUM(D14:E14)","v":1360},926,434,92,0]
["Matriculados",{"$f":"SUM(D15:G15)","v":6551},{"$f":"SUM(D15:E15)","v":6177},4491,1686,374,0]
[]
["UNIVERSIDAD ORT URUGUAY "]
["Ingresados",{"$f":"SUM(D18:G18)","v":1171},{"$f":"SUM(D18:E18)","v":1160},885,275,11,0]
["Matriculados",{"$f":"SUM(D19:G19)","v":6971},{"$f":"SUM(D19:E19)","v":6827},5069,1758,144,0]
[]
["UNIVERSIDAD DE MONTEVIDEO"]
["Ingresados",{"$f":"SUM(D22:G22)","v":357},{"$f":"SUM(D22:E22)","v":349},256,93,8,0]
["Matriculados",{"$f":"SUM(D23:G23)","v":1667},{"$f":"SUM(D23:E23)","v":1643},1200,443,24,0]
[]
["UNIVERSIDAD DE LA EMPRESA"]
["Ingresados",{"$f":"SUM(D26:G26)","v":453},{"$f":"SUM(D26:E26)","v":453},319,134,0,0]
["Matriculados",{"$f":"SUM(D27:G27)","v":1574},{"$f":"SUM(D27:E27)","v":1572},1203,369,2,0]
[]
["INST UNIV AUTÓNOMO DEL SUR"]
["Ingresados",{"$f":"SUM(D30:G30)","v":67},{"$f":"SUM(D30:E30)","v":67},40,27,0,0]
["Matriculados",{"$f":"SUM(D31:G31)","v":499},{"$f":"SUM(D31:E31)","v":495},363,132,4,0]
[]
["INST UNIV ASOCIACIÓN CRISTIANA DE JÓVENES"]
["Ingresados",{"$f":"SUM(D34:F34)","v":145},{"$f":"SUM(D34:E34)","v":145},96,49,0,0]
["Matriculados",{"$f":"SUM(D35:G35)","v":256},{"$f":"SUM(D35:E35)","v":255},175,80,1,0]
[]
["INST UNIV CLAEH "]
["Ingresados",{"$f":"SUM(D38:G38)","v":142},{"$f":"SUM(D38:E38)","v":138},62,76,4,0]
["Matriculados",{"$f":"SUM(D39:G39)","v":314},{"$f":"SUM(D39:E39)","v":294},187,107,20,0]
[]
["INST METODISTA UNIV CRANDON"]
["Ingresados",{"$f":"SUM(D42:G42)","v":0},{"$f":"SUM(D42:E42)","v":0},{"$f":"SUM(E42:F42)","v":0},0,0,0]
["Matriculados",{"$f":"SUM(D43:G43)","v":0},{"$f":"SUM(D43:E43)","v":0},0,0,0,0]
[]
["INST UNIV MONSEÑOR MARIANO SOLER"]
["Ingresados",{"$f":"SUM(D46:G46)","v":16},{"$f":"SUM(D46:E46,G46)","v":7},7,0,9,0]
["Matriculados",{"$f":"SUM(D47:G47)","v":61},37,23,11,27,0]
[]
["INST UNIV FRANCISCO DE ASIS"]
["Ingresados",{"$f":"SUM(D50:G50)","v":63},{"$f":"SUM(D50:E50)","v":63},1,62,0,0]
["Matriculados",{"$f":"SUM(D51:G51)","v":489},{"$f":"SUM(D51:E51)","v":487},17,470,2,0]
[]
["INST UNIV BIOS"]
["Ingresados",{"$f":"SUM(D54:G54)","v":16},{"$f":"SUM(D54:E54)","v":15},11,4,1,0]
["Matriculados",{"$f":"SUM(D55:G55)","v":41},{"$f":"SUM(D55:E55)","v":41},20,21,0,0]
[]
["INST UNIV CEDIIAP"]
["Ingresados",{"$f":"SUM(D58:G58)","v":68},{"$f":"SUM(D58:E58)","v":68},49,19,0,0]
["Matriculados",{"$f":"SUM(D59:G59)","v":227},{"$f":"SUM(D59:E59)","v":227},165,62,0,0]
[]
["Escuela Naval"]
["Ingresados","s/d","s/d","s/d","s/d","s/d","s/d"]
["Matriculados","s/d","s/d","s/d","s/d","s/d","s/d"]
["Fuente: Oficinas Productoras de cada una de las Instituciones. "]
["Nota: Se excluye a las carreas cortas o tecnicaturas. La categoría \"Sin dato\" refiere a los  alumnos de los cuales no se cuenta con información de origen. "]

{"sheet":"EDUCACIÓN DE JÓVENES Y ADULTOS","index":218,"n_rows":0,"n_cols":0,"rows_kept":0,"cut":false,"hidden":false,"merged":[[20,0,20,4],[10,0,10,4],[12,0,12,4],[14,0,14,4],[16,0,16,4],[18,0,18,4],[33,0,33,4],[35,0,35,4],[22,0,22,4],[24,0,24,4],[25,0,25,4],[27,0,27,4],[29,0,29,4],[31,0,31,4]]}

{"sheet":" II-7.1.1","index":219,"n_rows":34,"n_cols":7,"rows_kept":34,"cut":false,"hidden":false,"merged":[[6,1,7,1],[6,4,7,4],[0,2,0,4],[1,0,1,1],[2,2,3,3],[5,0,5,6],[6,0,7,0],[6,2,6,3],[6,5,6,6]]}
["ANEP",null,"ALUMNOS MATRICULADOS"]
["CODICEN – PROGRAMA NACIONAL DE JÓVENES Y ADULTOS"]
[]
["Cuadro Nº  II-7.1.1"]
[]
["ALUMNOS MATRICULADOS EN EDUCACIÓN PRIMARIA POR SEXO SEGÚN GRANDES ÁREAS Y DEPARTAMENTO. AÑO 2011"]
["GRANDES ÁREAS Y DEPARTAMENTOS","TOTAL","PRIMER  TRAMO: NIVEL I",null,"TOTAL","SEGUNDO TRAMO: NIVEL II"]
[null,null,"M","F",null,"M","F"]
["TOTAL",{"$f":"+B11+B12+B31","v":1983},{"$f":"C11+C12","v":783},{"$f":"D11+D12","v":582},{"$f":"+E11+E12","v":1821},{"$f":"F11+F12","v":920},{"$f":"G11+G12","v":901}]
[]
["MONTEVIDEO",{"$f":"C11+D11","v":704},470,234,{"$f":"F11+G11","v":919},574,345]
["RESTO DEL PAÍS",661,{"$f":"SUM(C13:C30)","v":313},{"$f":"SUM(D13:D30)","v":348},902,{"$f":"SUM(F13:F30)","v":346},{"$f":"SUM(G13:G30)","v":556}]
["Artigas",8,2,6,18,0,18]
["Canelones",88,37,51,237,52,185]
["Cerro Largo",27,11,16,9,8,1]
["Colonia",37,17,20,33,6,27]
["Durazno",16,2,14,6,2,4]
["Flores",0,0,0,0,0,0]
["Florida",15,4,11,29,16,13]
["Lavalleja",29,10,19,9,6,3]
["Maldonado",16,14,2,52,29,23]
["Paysandú",53,22,31,95,31,64]
["Río Negro",29,11,18,48,26,22]
["Rivera",55,19,36,74,15,59]
["Rocha",38,11,27,15,6,9]
["Salto",169,87,82,91,48,43]
["San José",56,50,6,76,50,26]
["Soriano",14,10,4,51,27,24]
["Tacuarembó",6,2,4,51,20,31]
["Treinta y Tres",5,4,1,8,4,4]
["Prog de Alfabetización ",618,290,328]
["Fuente: ANEP - CODICEN - Programa de Educación de Jóvenes y Adultos."]
[]
["NOTA: El Programa de Alfabetización es un convenio entre ANEP - Mides y corresponde a Primer Tramo. "]

{"sheet":" II-7.1.2","index":220,"n_rows":29,"n_cols":4,"rows_kept":29,"cut":false,"hidden":false,"merged":[[0,1,0,3],[1,0,1,1],[2,2,3,3],[5,0,6,0],[5,2,5,3],[5,1,6,1],[4,0,4,4]]}
["ANEP","ALUMNOS MATRICULADOS"]
["CODICEN – PROGRAMA NACIONAL DE JÓVENES Y ADULTOS"]
[]
["Cuadro Nº  II-7.1.2"]
["TALLERES SEGÚN SEXO, GRANDES ÁREAS Y DEPARTAMENTOS"]
["GRANDES ÁREAS Y DEPARTAMENTOS","TOTAL","TALLERES"]
[null,null,"M","F"]
["TOTAL",{"$f":"+B9+B10","v":4092},{"$f":"C9+C10","v":1404},{"$f":"D9+D10","v":2688}]
["MONTEVIDEO",{"$f":"C9+D9","v":3312},1023,2289]
["RESTO DEL PAÍS",780,{"$f":"SUM(C11:C28)","v":381},{"$f":"SUM(D11:D28)","v":399}]
["Artigas",0,0,0]
["Canelones",255,129,126]
["Cerro Largo",20,7,13]
["Colonia",38,14,24]
["Durazno",0,0,0]
["Flores",15,8,7]
["Florida",8,8,0]
["Lavalleja",6,0,6]
["Maldonado",0,0,0]
["Paysandú",8,2,6]
["Río Negro",13,10,3]
["Rivera",212,99,113]
["Rocha",0,0,0]
["Salto",60,27,33]
["San José",0,0,0]
["Soriano",44,31,13]
["Tacuarembó",101,46,55]
["Treinta y Tres",0,0,0]
["Fuente: ANEP - CODICEN - Dirección Sectorial de Educación de Adultos"]

{"sheet":"II-7.1.3","index":221,"n_rows":32,"n_cols":11,"rows_kept":32,"cut":false,"hidden":false,"merged":[[10,6,10,7],[10,9,10,10],[0,10,1,12],[4,0,4,12],[7,0,11,0],[7,2,9,4],[7,5,8,10],[9,6,9,7],[9,9,9,10],[10,2,11,2],[10,3,10,4]]}
["CONSEJO DE EDUCACIÓN TÉCNICO PROFESIONAL (U.T.U.)",null,null,null,null,null,null,null,null,null,"ALUMNOS MATRICULADOS"]
[]
["Cuadro Nº II-7.1.3"]
[]
["ALUMNOS MATRICULADOS EN CURSOS DE EDUCACIÓN TÉCNICA PARA JÓVENES Y ADULTOS POR GRANDES ÁREAS Y SEXO SEGÚN TIPO DE CURSO. AÑO 2011"]
[]
[]
["TIPO DE CURSO",null,"TOTAL",null,null,"GRANDES ÁREAS"]
[]
[null,"TOTAL ",null,null,null,null,"MONTEVIDEO ",null,null,"RESTO DEL PAÍS"]
[null,null,"Total","SEXO",null,null,"SEXO",null,null,"SEXO"]
[null,"Total ",null,"Masculino","Femenino","Total ","Masculino ","Femenino ","Total","Masculino ","Femenino"]
["TOTAL",null,{"$f":"+C14+C26","v":7546},3851,3695,4226,2174,2052,3320,1677,1643]
["NIVEL BÁSICO",{"$f":"+D14:D24","v":3310},{"$f":"+D14+E14","v":6443},{"$f":"+G14+J14","v":3310},{"$f":"+H14+K14","v":3133},{"$f":"+G14+H14","v":3562},{"$f":"SUM(G15:G24)","v":1778},{"$f":"SUM(H15:H24)","v":1784},{"$f":"+J14+K14","v":2881},{"$f":"SUM(J15:J24)","v":1532},{"$f":"SUM(K15:K24)","v":1349}]
["Capacitación",null,186,138,48,21,17,4,165,121,44]
["Capacitación Profesional",null,80,45,35,0,0,0,80,45,35]
["Capacitación Profesional Básica",null,1303,732,571,367,250,117,936,482,454]
["Curso Básico",null,1292,767,525,757,390,367,535,377,158]
["Curso Básico Especialización",null,899,505,394,579,327,252,320,178,142]
["Form y Des Artesanal y Cultural",null,16,7,9,8,4,4,8,3,5]
["FormProf en Artes y Artesanías",null,510,293,217,510,293,217,0,0,0]
["Formación Profesional Acelerada",null,11,9,2,11,9,2,0,0,0]
["Formación Profesional Básica",null,1942,791,1151,1132,467,665,810,324,486]
["Formación Profesional Especializada",null,204,23,181,177,21,156,27,2,25]
[]
["NIVEL SUPERIOR",null,{"$f":"+D26+E26","v":1103},{"$f":"+G26+J26","v":541},562,{"$f":"+G26+H26","v":664},{"$f":"SUM(G27:G31)","v":396},{"$f":"SUM(H27:H31)","v":268},{"$f":"+J26+K26","v":439},{"$f":"SUM(J27:J31)","v":145},{"$f":"SUM(K27:K31)","v":294}]
["Capacitación Profesional Superior",null,69,54,15,69,54,15,0,0,0]
["Capacitación Superior",null,464,191,273,78,55,23,386,136,250]
["Capacitación Técnica",null,56,21,35,56,21,35,0,0,0]
["E M P Especialización",null,86,8,78,79,7,72,7,1,6]
["Formación Profesional Superior",null,428,267,161,382,259,123,46,8,38]
["Fuente: DE-CET P (UTU) "]

{"sheet":"II-7.1.4","index":222,"n_rows":29,"n_cols":14,"rows_kept":29,"cut":false,"hidden":false,"merged":[[0,12,1,14],[4,0,4,14],[6,0,7,0],[6,2,6,13],[6,1,7,1]]}
["CONSEJO DE EDUCACIÓN TÉCNICO PROFESIONAL (U.T.U.)",null,null,null,null,null,null,null,null,null,null,null,"ALUMNOS MATRICULADOS"]
[]
["Cuadro Nº II-7.1.4"]
[]
["ALUMNOS MATRICULADOS EN CURSOS DE EDUCACIÓN TÉCNICA PARA JÓVENES Y ADULTOS POR EDAD SEGÚN TIPO DE CURSO. AÑO 2011."]
[]
["TIPO DE CURSO","TOTAL","EDAD"]
[null,null,"12 años","13 años","14 años","15 años","16 años","17 años","18años","19años","20 a 24 años","25 a 29 años","30 años y más","Edad desc"]
["TOTAL",{"$f":"+B10+B22","v":7546},3,3,47,876,1019,906,466,357,1151,640,2062,16]
["NIVEL BÁSICO",{"$f":"+C10+D10+E10+F10+G10+H10+I10+J10+K10+L10+M10+N10","v":6443},{"$f":"SUM(C11:C20)","v":3},3,46,827,949,809,359,257,838,515,1821,16]
["Capacitación",186,0,1,2,16,10,19,8,3,14,15,97,1]
["Capacitación Profesional",80,0,0,0,0,0,1,0,0,4,6,59,10]
["Capacitación Profesional Básica",1303,0,0,6,144,149,142,72,53,162,110,462,3]
["Curso Básico",1292,1,2,17,338,281,174,53,44,130,68,184,0]
["Curso Básico Especialización",899,0,0,0,15,163,183,96,51,111,65,215,0]
["Form y Des Artesanal y Cultural",16,0,0,0,0,0,0,3,2,8,1,2,0]
["FormProf en Artes y Artesanías",510,0,0,0,7,15,12,22,21,114,60,259,0]
["Formación Profesional Acelerada",11,0,0,0,0,0,0,0,1,0,0,10,0]
["Formación Profesional Básica",1942,2,0,21,306,316,246,83,66,256,170,474,2]
["Formación Profesional Especializada",204,0,0,0,1,15,32,22,16,39,20,59,0]
[]
["NIVEL SUPERIOR",{"$f":"SUM(B23:B27)","v":1103},0,0,1,49,70,97,107,100,313,125,241,0]
["Capacitación Profesional Superior",{"$f":"+C23+D23+E23+F23+G23+H23+I23+J23+K23+L23+M23+N23","v":69},0,0,0,1,2,0,1,1,17,13,34,0]
["Capacitación Superior",{"$f":"+C24+D24+E24+F24+G24+H24+I24+J24+K24+L24+M24+N24","v":464},0,0,0,36,37,50,39,37,100,48,117,0]
["Capacitación Técnica",{"$f":"+C25+D25+E25+F25+G25+H25+I25+J25+K25+L25+M25+N25","v":56},0,0,0,0,0,1,2,10,16,8,19,0]
["E M P Especialización",{"$f":"+C26+D26+E26+F26+G26+H26+I26+J26+K26+L26+M26+N26","v":86},0,0,0,0,0,9,16,9,30,10,12,0]
["Formación Profesional Superior",{"$f":"+C27+D27+E27+F27+G27+H27+I27+J27+K27+L27+M27+N27","v":428},0,0,1,12,31,37,49,43,150,46,59,0]
[]
["Fuente: DE - CETP (UTU)"]

{"sheet":"II-7.1.5 ","index":223,"n_rows":27,"n_cols":4,"rows_kept":27,"cut":false,"hidden":false,"merged":[[0,2,0,3],[3,0,3,5],[4,0,5,0],[4,1,5,1],[4,2,4,3]]}
[null,null,"ALUMNOS MATRICULADOS"]
[]
["Cuadro Nº II-7.1.5"]
["ALUMNOS MATRICULADOS EN EDUCACIÓN TÉCNICA POR TIPO DE CURSO SEGÚN DEPARTAMENTO AÑO 2011."]
["DEPARTAMENTO ","Total ","TIPO DE CURSO"]
[null,null,"NIVEL BÁSICO","NIVEL SUPERIOR"]
["TOTAL ",{"$f":"+C7+D7","v":7546},{"$f":"SUM(C8:C9)","v":6443},{"$f":"SUM(D8:D9)","v":1103}]
["MONTEVIDEO ",4226,3562,664]
["RESTO DEL PAÍS",3320,{"$f":"SUM(C10:C27)","v":2881},{"$f":"SUM(D10:D27)","v":439}]
["Artigas",215,164,51]
["Canelones",807,735,72]
["Cerro Largo",104,76,28]
["Colonia",180,174,6]
["Durazno",179,179,0]
["Flores",33,33,0]
["Florida",92,63,29]
["Lavalleja",46,46,0]
["Maldonado",86,76,10]
["Paysandú",52,52,0]
["Rio Negro",69,41,28]
["Rivera",63,48,15]
["Rocha",535,430,105]
["Salto",91,91,0]
["San José",367,349,18]
["Soriano",113,87,26]
["Tacuarembó",243,192,51]
["Treinta y Tres",45,45,0]

{"sheet":"II-7.1.6 ","index":224,"n_rows":41,"n_cols":4,"rows_kept":41,"cut":false,"hidden":false,"merged":[[0,0,1,1],[0,2,0,3],[4,0,4,3],[6,0,7,0],[6,1,7,1],[6,2,6,3]]}
["CONSEJO DE EDUCACIÓN TÉCNICO PROFESIONAL (UTU)",null,"ALUMNOS MATRICULADOS"]
[]
["Cuadro Nº II-7.1.6"]
[]
["ALUMNOS MATRICULADOS EN EDUCACIÓN TÉCNICA POR TIPO DE CURSO SEGÚN ÁREAS Y SECTORES DE ESTUDIO AÑO 2011"]
[]
["ÁREAS Y SECTOR DE ESTUDIO","Total","TIPO DE CURSO"]
[null,null,"NIVEL\nBÁSICO","NIVEL\nSUPERIOR"]
["TOTAL",{"$f":"+C9+D9","v":7546},{"$f":"C10+C13+C24+C26+C28+C31+C36","v":6443},{"$f":"D10+D13+D24+D26+D28+D31+D36","v":1103}]
["AGRICULTURA Y PESCA",56,{"$f":"C11+C12","v":56},{"$f":"D11+D12","v":0}]
["Agropecuario",12,12,0]
["Hortifruticultura y jardinería",44,44,0]
["INDUSTRIA",3433,{"$f":"SUM(C14:C23)","v":3265},{"$f":"SUM(D14:D23)","v":168}]
["Metal - mecánica",691,608,83]
["Electricidad y electrónica",284,284,0]
["Producción de alimentos",1274,1274,0]
["Textil y confección de vestimenta",614,607,7]
["Cuero y calzado",104,104,0]
["Madera y muebles",180,180,0]
["Gráficos",157,79,78]
["Cerámica",89,89,0]
["Mant, reparac y serv a la producción",16,16,0]
["Química, Termodinámica y Agroenergía",24,24,0]
["MANTENIMIENTO Y REPARACIÓN DE VEHÍCULOS",468,{"$f":"C25","v":397},{"$f":"D25","v":71}]
["Mantenimiento y reparación de vehículos",468,397,71]
["CONSTRUCCIÓN",null,{"$f":"C27","v":319},{"$f":"D27","v":8}]
["Construcción y Arquitectura",{"$f":"+C27+D27","v":327},319,8]
["COMERCIO,ADMINIST,INFORM Y COMUNICACIÓN",null,{"$f":"C29+C30","v":317},{"$f":"D29+D30","v":533}]
["Comercio y administración",{"$f":"+C29+D29","v":185},68,117]
["Informática",{"$f":"+C30+D30","v":665},249,416]
["SERVICIOS",null,{"$f":"SUM(C32:C35)","v":1085},{"$f":"SUM(D32:D35)","v":323}]
["Hotelería",{"$f":"+C32+D32","v":227},0,227]
["Gastronomía",{"$f":"+C33+D33","v":901},901,0]
["Turismo",{"$f":"+C34+D34","v":96},0,96]
["Servicios personales",{"$f":"+C35+D35","v":184},184,0]
["ARTES Y ARTESANÍAS",null,{"$f":"C37+C38","v":1004},{"$f":"D37+D38","v":0}]
["Artes",{"$f":"+C37+D37","v":236},236,0]
["Artesanías",{"$f":"+C38+D38","v":768},768,0]
["Fuente: DE - UTU"]
["Nota: El presente cuadro no incluye las Áreas y Sectores de Estudios contenidos en Educación "]
["      Media Básica y Superior, en tanto solo aplican para dichos niveles "]

{"sheet":"II-7.1.7 ","index":225,"n_rows":68,"n_cols":10,"rows_kept":68,"cut":false,"hidden":false,"merged":[[0,5,1,7],[8,5,8,6],[8,8,8,9],[63,0,63,6],[64,0,64,9],[67,0,67,9],[6,0,6,9],[7,0,9,0],[7,1,9,1],[7,2,7,3],[7,4,9,4],[7,5,7,6],[7,7,9,7],[7,8,7,9],[8,2,8,3],[65,0,65,9]]}
["MEC - DIRECCIÓN DE EDUCACIÓN",null,null,null,null,"ALUMNOS MATRICULADOS"]
["ÁREA DE EDUCACIÓN NO FORMAL"]
[]
[]
["Cuadro Nº II-7.1.7"]
[]
["ALUMNOS INGRESADOS, MATRICULADOS Y EGRESADOS EN CECAP POR SEXO, SEGÚN DEPARTAMENTO Y EDAD AÑO 2011"]
["DEPARTAMENTO Y EDAD","TOTAL ","INGRESADOS",null,"TOTAL ","MATRICULADOS",null,"TOTAL ","EGRESADOS"]
[null,null,"SEXO",null,null,"SEXO",null,null,"SEXO"]
[null,null,"M","F",null,"M","F",null,"M","F"]
["TOTAL",{"$f":"SUM(C11:D11)","v":835},{"$f":"+C13+C17","v":419},{"$f":"+D13+D17","v":416},{"$f":"F11+G11","v":2060},1067,993,{"$f":"I11+J11","v":238},{"$f":"+I13+I17","v":117},{"$f":"+J13+J17","v":121}]
[null,null,null,null,null,0,0]
["MONTEVIDEO",{"$f":"SUM(C13:D13)","v":227},{"$f":"SUM(C14:C15)","v":115},{"$f":"SUM(D14:D15)","v":112},{"$f":"F13+G13","v":669},355,314,{"$f":"I13+J13","v":74},{"$f":"SUM(I14:I15)","v":40},{"$f":"SUM(J14:J15)","v":34}]
["    14 a 17 años",{"$f":"SUM(C14:D14)","v":141},76,65,{"$f":"F14+G14","v":528},281,247,{"$f":"I14+J14","v":55},30,25]
["    18 años y más",{"$f":"SUM(C15:D15)","v":86},39,47,{"$f":"F15+G15","v":141},74,67,{"$f":"I15+J15","v":19},10,9]
[]
["RESTO DEL PAÍS",{"$f":"C17+D17","v":608},{"$f":"C18+C19","v":304},{"$f":"D18+D19","v":304},{"$f":"F17+G17","v":1391},712,679,{"$f":"I17+J17","v":164},{"$f":"I18+I19","v":77},{"$f":"J18+J19","v":87}]
["    14 a 17 años",{"$f":"C18+D18","v":510},{"$f":"+C27+C30+C34+C42+C50+C54+C58+C38+C46+C22+C62","v":258},{"$f":"+D27+D30+D34+D42+D50+D54+D58+D38+D46+D22+D62","v":252},{"$f":"F18+G18","v":1169},601,568,{"$f":"I18+J18","v":121},{"$f":"+I27+I30+I34+I42+I50+I54+I58+I38+I46+I22+I62","v":58},{"$f":"+J27+J30+J34+J42+J50+J54+J58+J38+J46+J22+J62","v":63}]
["    18 años y más",{"$f":"C19+D19","v":98},{"$f":"+C28+C31+C35+C43+C51+C55+C59+C39+C47+C23+C63","v":46},{"$f":"+D28+D31+D35+D43+D51+D55+D59+D39+D47+D23+D63","v":52},{"$f":"F19+G19","v":222},111,111,{"$f":"I19+J19","v":43},{"$f":"+I28+I31+I35+I43+I51+I55+I59+I39+I47+I23+I63","v":19},{"$f":"+J28+J31+J35+J43+J51+J55+J59+J39+J47+J23+J63","v":24}]
[]
["Artigas",{"$f":"C21+D21","v":45},{"$f":"C22+C23","v":19},{"$f":"D22+D23","v":26},{"$f":"F21+G21","v":83},38,45,{"$f":"I21+J21","v":0},{"$f":"I22+I23","v":0},{"$f":"J22+J23","v":0}]
["    14 a 17 años",{"$f":"C22+D22","v":30},13,17,{"$f":"F22+G22","v":59},26,33,{"$f":"I22+J22","v":0},0,0]
["    18 años y más",{"$f":"C23+D23","v":15},6,9,{"$f":"F23+G23","v":24},12,12,{"$f":"I23+J23","v":0},0,0]
[null,null,null,null,null,0,0]
["Canelones",{"$f":"B26+B29","v":126},{"$f":"C26+C29","v":66},{"$f":"D26+D29","v":60},{"$f":"E26+E29","v":305},160,145,{"$f":"H26+H29","v":32},{"$f":"I26+I29","v":12},{"$f":"J26+J29","v":20}]
["  Barros Blancos",{"$f":"C26+D26","v":48},{"$f":"C27+C28","v":25},{"$f":"D27+D28","v":23},{"$f":"F26+G26","v":133},63,70,{"$f":"I26+J26","v":16},{"$f":"I27+I28","v":4},{"$f":"J27+J28","v":12}]
["    14 a 17 años",43,22,21,112,52,60,9,3,6]
["    18 años y más",5,3,2,21,11,10,7,1,6]
["  La Paz",78,{"$f":"C30+C31","v":41},{"$f":"D30+D31","v":37},172,97,75,16,{"$f":"I30+I31","v":8},{"$f":"J30+J31","v":8}]
["    14 a 17 años",47,27,20,125,75,50,10,6,4]
["    18 años y más",31,14,17,47,22,25,6,2,4]
[]
["Colonia",{"$f":"C33+D33","v":49},{"$f":"C34+C35","v":19},{"$f":"D34+D35","v":30},{"$f":"F33+G33","v":84},33,51,{"$f":"I33+J33","v":2},{"$f":"I34+I35","v":1},{"$f":"J34+J35","v":1}]
["    14 a 17 años",{"$f":"C34+D34","v":49},19,30,{"$f":"F34+G34","v":84},33,51,{"$f":"I34+J34","v":1},0,1]
["    18 años y más",{"$f":"C35+D35","v":0},0,0,{"$f":"F35+G35","v":0},0,0,{"$f":"I35+J35","v":1},1,0]
[]
["Florida",{"$f":"C37+D37","v":41},{"$f":"C38+C39","v":11},{"$f":"D38+D39","v":30},{"$f":"F37+G37","v":65},18,47,{"$f":"I37+J37","v":0},{"$f":"I38+I39","v":0},{"$f":"J38+J39","v":0}]
["    14 a 17 años",{"$f":"C38+D38","v":36},8,28,{"$f":"F38+G38","v":56},13,43,{"$f":"I38+J38","v":0},0,0]
["    18 años y más",{"$f":"C39+D39","v":5},3,2,{"$f":"F39+G39","v":9},5,4,{"$f":"I39+J39","v":0},0,0]
[]
["Maldonado (San Carlos)",{"$f":"C41+D41","v":30},{"$f":"C42+C43","v":14},{"$f":"D42+D43","v":16},{"$f":"F41+G41","v":60},31,29,{"$f":"I41+J41","v":18},{"$f":"I42+I43","v":12},{"$f":"J42+J43","v":6}]
["    14 a 17 años",{"$f":"C42+D42","v":25},11,14,{"$f":"F42+G42","v":51},26,25,{"$f":"I42+J42","v":16},11,5]
["    18 años y más",{"$f":"C43+D43","v":5},3,2,{"$f":"F43+G43","v":9},5,4,{"$f":"I43+J43","v":2},1,1]
[]
["Paysandú",{"$f":"C45+D45","v":49},{"$f":"C46+C47","v":20},{"$f":"D46+D47","v":29},{"$f":"F45+G45","v":119},52,67,{"$f":"I45+J45","v":4},{"$f":"I46+I47","v":2},{"$f":"J46+J47","v":2}]
["    14 a 17 años",{"$f":"C46+D46","v":47},20,27,{"$f":"F46+G46","v":114},51,63,{"$f":"I46+J46","v":4},2,2]
["    18 años y más",{"$f":"C47+D47","v":2},0,2,{"$f":"F47+G47","v":5},1,4,{"$f":"I47+J47","v":0},0,0]
[]
["Río Negro (Young)",{"$f":"C49+D49","v":41},{"$f":"C50+C51","v":22},{"$f":"D50+D51","v":19},{"$f":"F49+G49","v":56},26,30,{"$f":"I49+J49","v":18},{"$f":"I50+I51","v":8},{"$f":"J50+J51","v":10}]
["    14 a 17 años",{"$f":"C50+D50","v":41},22,19,{"$f":"F50+G50","v":56},26,30,{"$f":"I50+J50","v":15},5,10]
["    18 años y más",{"$f":"C51+D51","v":0},0,0,{"$f":"F51+G51","v":0},0,0,{"$f":"I51+J51","v":3},3,0]
[]
["Rivera",{"$f":"C53+D53","v":125},{"$f":"C54+C55","v":90},{"$f":"D54+D55","v":35},{"$f":"F53+G53","v":339},236,103,{"$f":"I53+J53","v":39},{"$f":"I54+I55","v":24},{"$f":"J54+J55","v":15}]
["    14 a 17 años",{"$f":"C54+D54","v":104},79,25,{"$f":"F54+G54","v":278},200,78,{"$f":"I54+J54","v":30},17,13]
["    18 años y más",{"$f":"C55+D55","v":21},11,10,{"$f":"F55+G55","v":61},36,25,{"$f":"I55+J55","v":9},7,2]
[]
["Salto",{"$f":"C57+D57","v":39},{"$f":"C58+C59","v":19},{"$f":"D58+D59","v":20},{"$f":"F57+G57","v":109},53,56,{"$f":"I57+J57","v":16},{"$f":"I58+I59","v":8},{"$f":"J58+J59","v":8}]
["    14 a 17 años",{"$f":"C58+D58","v":31},17,14,{"$f":"F58+G58","v":89},47,42,{"$f":"I58+J58","v":11},6,5]
["    18 años y más",{"$f":"C59+D59","v":8},2,6,{"$f":"F59+G59","v":20},6,14,{"$f":"I59+J59","v":5},2,3]
[]
["Treinta y Tres",{"$f":"C61+D61","v":63},{"$f":"C62+C63","v":24},{"$f":"D62+D63","v":39},{"$f":"F61+G61","v":171},65,106,{"$f":"I61+J61","v":35},{"$f":"I62+I63","v":10},{"$f":"J62+J63","v":25}]
["    14 a 17 años",{"$f":"C62+D62","v":57},20,37,{"$f":"F62+G62","v":145},52,93,{"$f":"I62+J62","v":25},8,17]
["    18 años y más",{"$f":"C63+D63","v":6},4,2,{"$f":"F63+G63","v":26},13,13,{"$f":"I63+J63","v":10},2,8]
["Fuente: Procesamiento propio en base a datos proporcionados por el  Área de Educación No Formal, Dirección de Educación, MEC."]
["Nota: Ingresos: Todos los individuos que comenzaron a cursar la propuesta educativa en el primer o segundo semestre del año 2011."]
["      Matriculados: Todos los individuos que durante el año 2011 cursaron la propuesta educativa. "]
["      Egreso: Todos los individuos que culminaron durante el 2011 los cuatro semestres que prevee la propuesta educativa. "]
["El aumento de la matrícula de CECAP para el año 2011, es debido a que se sumaron los alumnos ingresados en el año más los que continuaron la propuesta educativa de años anteriores. En anteriores años no se contabilizaron dentro de los matrículados a los alumnos ingresados en esos años. "]

{"sheet":"II-7.1.8","index":226,"n_rows":54,"n_cols":7,"rows_kept":54,"cut":false,"hidden":false,"merged":[[51,0,51,6],[52,0,52,6],[53,0,53,6],[0,5,1,7],[6,0,6,6],[7,0,9,0],[7,1,9,1],[7,2,7,3],[7,4,9,4],[7,5,7,6],[8,2,8,3],[8,5,8,6]]}
["MEC - DIRECCIÓN DE EDUCACIÓN",null,null,null,null,"ALUMNOS MATRICULADOS"]
["ÁREA DE EDUCACIÓN NO FORMAL"]
["Cuadro Nº II-2.2.7"]
[]
["Cuadro Nº II-7.1.8"]
[]
["ALUMNOS CON EGRESO ANTICIPADO Y DESVINCULADOS DE CECAP POR SEXO, SEGÚN DEPARTAMENTO Y EDAD AÑO 2011"]
["DEPARTAMENTO Y EDAD","TOTAL ","EGRESO ANTICIPADO",null,"TOTAL ","DESVINCULADOS"]
[null,null,"SEXO",null,null,"SEXO"]
[null,null,"M","F",null,"M","F"]
["TOTAL",{"$f":"SUM(C11:D11)","v":100},{"$f":"+C12+C15","v":46},{"$f":"+D12+D15","v":54},{"$f":"F11+G11","v":306},{"$f":"+F12+F15","v":168},{"$f":"+G12+G15","v":138}]
["MONTEVIDEO",{"$f":"SUM(C12:D12)","v":39},{"$f":"SUM(C13:C14)","v":23},{"$f":"SUM(D13:D14)","v":16},69,{"$f":"SUM(F13:F14)","v":40},{"$f":"SUM(G13:G14)","v":29}]
["    14 a 17 años",{"$f":"SUM(C13:D13)","v":29},15,14,48,28,20]
["    18 años y más",{"$f":"SUM(C14:D14)","v":10},8,2,21,12,9]
["RESTO DEL PAÍS",{"$f":"C15+D15","v":61},{"$f":"C16+C17","v":23},{"$f":"D16+D17","v":38},237,{"$f":"F16+F17","v":128},{"$f":"G16+G17","v":109}]
["    14 a 17 años",35,{"$f":"+C23+C26+C29+C35+C41+C44+C47+C50+C38+C19+C32","v":11},{"$f":"+D23+D26+D29+D35+D41+D44+D47+D50+D38+D19+D32","v":24},201,{"$f":"+F23+F26+F29+F35+F41+F44+F47+F50+F38+F19+F32","v":107},{"$f":"+G23+G26+G29+G35+G41+G44+G47+G50+G38+G19+G32","v":94}]
["    18 años y más",26,{"$f":"+C24+C27+C30+C36+C42+C45+C48+C51+C39+C20+C33","v":12},{"$f":"+D24+D27+D30+D36+D42+D45+D48+D51+D39+D20+D33","v":14},36,{"$f":"+F24+F27+F30+F36+F42+F45+F48+F51+F39+F20+F33","v":21},{"$f":"+G24+G27+G30+G36+G42+G45+G48+G51+G39+G20+G33","v":15}]
["Artigas",5,{"$f":"C19+C20","v":0},{"$f":"D19+D20","v":5},7,{"$f":"F19+F20","v":5},{"$f":"G19+G20","v":2}]
["    14 a 17 años",1,0,1,5,3,2]
["    18 años y más",4,0,4,2,2,0]
["Canelones",{"$f":"B22+B25","v":3},1,2,42,23,19]
["  Barros Blancos",{"$f":"C22+D22","v":2},{"$f":"C23+C24","v":1},{"$f":"D23+D24","v":1},{"$f":"F22+G22","v":21},{"$f":"F23+F24","v":13},{"$f":"G23+G24","v":8}]
["    14 a 17 años",2,1,1,16,9,7]
["    18 años y más",0,0,0,5,4,1]
["  La Paz",1,{"$f":"C26+C27","v":0},{"$f":"D26+D27","v":1},21,{"$f":"F26+F27","v":10},{"$f":"G26+G27","v":11}]
["    14 a 17 años",0,0,0,19,10,9]
["    18 años y más",1,0,1,2,0,2]
["Colonia",3,{"$f":"C29+C30","v":1},{"$f":"D29+D30","v":2},13,{"$f":"F29+F30","v":4},{"$f":"G29+G30","v":9}]
["    14 a 17 años",3,1,2,13,4,9]
["    18 años y más",0,0,0,0,0,0]
["Florida",5,{"$f":"C32+C33","v":1},{"$f":"D32+D33","v":4},12,{"$f":"F32+F33","v":3},{"$f":"G32+G33","v":9}]
["    14 a 17 años",5,1,4,11,2,9]
["    18 años y más",0,0,0,1,1,0]
["Maldonado (San Carlos)",12,{"$f":"C35+C36","v":5},{"$f":"D35+D36","v":7},13,{"$f":"F35+F36","v":6},{"$f":"G35+G36","v":7}]
["    14 a 17 años",10,4,6,10,5,5]
["    18 años y más",2,1,1,3,1,2]
["Paysandú",17,{"$f":"C38+C39","v":8},{"$f":"D38+D39","v":9},10,{"$f":"F38+F39","v":4},{"$f":"G38+G39","v":6}]
["    14 a 17 años",7,2,5,10,4,6]
["    18 años y más",10,6,4,0,0,0]
["Río Negro (Young)",0,{"$f":"C41+C42","v":0},{"$f":"D41+D42","v":0},32,{"$f":"F41+F42","v":16},{"$f":"G41+G42","v":16}]
["    14 a 17 años",0,0,0,30,16,14]
["    18 años y más",0,0,0,2,0,2]
["Rivera",8,{"$f":"C44+C45","v":2},{"$f":"D44+D45","v":6},42,{"$f":"F44+F45","v":30},{"$f":"G44+G45","v":12}]
["    14 a 17 años",7,2,5,33,23,10]
["    18 años y más",1,0,1,9,7,2]
["Salto",5,{"$f":"C47+C48","v":2},{"$f":"D47+D48","v":3},26,{"$f":"F47+F48","v":14},{"$f":"G47+G48","v":12}]
["    14 a 17 años",0,0,0,21,12,9]
["    18 años y más",5,2,3,5,2,3]
["Treinta y Tres",3,{"$f":"C50+C51","v":3},{"$f":"D50+D51","v":0},40,{"$f":"F50+F51","v":23},{"$f":"G50+G51","v":17}]
["    14 a 17 años",0,0,0,33,19,14]
["    18 años y más",3,3,0,7,4,3]
["Fuente: Procesamiento propio en base a datos proporcionados por el  Área de Educación No Formal, Dirección de Educación, MEC."]
["Nota:                                                                                                                                            Egreso Anticipado: Todos los individuos que durante el 2011 egresaron de CECAP para incorporarse a otra propuesta educativa o al mundo del     trabajo, habiendo cursado un período menor a cuatro semestres."]
["Desvinculados: Todos los individuos que durante el 2011 dejaron de asistir a la propuesta."]

{"sheet":"II-7.1.9 ","index":227,"n_rows":59,"n_cols":10,"rows_kept":59,"cut":false,"hidden":false,"merged":[[5,8,5,9],[6,2,6,3],[6,5,6,6],[6,8,6,9],[0,5,1,8],[4,0,4,9],[5,0,7,0],[5,1,7,1],[5,2,5,3],[5,4,7,4],[5,5,5,6],[5,7,7,7]]}
["UNIVERSIDADES PRIVADAS: OFERTAS EDUCATIVAS NO TERCIARIAS",null,null,null,null,"ALUMNOS MATRICULADOS"]
[]
["Cuadro Nº II- 7.1.9"]
[]
["ALUMNOS INGRESADOS, MATRICULADOS Y EGRESADOS EN OFERTAS EDUCATIVAS NO TERCIARIAS DE UNIVERSIDADES PRIVADAS POR SEXO. AÑO 2011."]
["UNIVERSIDAD / ACREDITACIÓN","TOTAL","INGRESADOS",null,"TOTAL","MATRICULADOS",null,"TOTAL","EGRESADOS"]
[null,null,"SEXO",null,null,"SEXO",null,null,"SEXO"]
[null,null,"M","F",null,"M","F",null,"M","F"]
["TOTAL",{"$f":"SUM(C9:D9)","v":1126},{"$f":"+C11+C47","v":727},{"$f":"+D11+D47","v":399},{"$f":"SUM(F9:G9)","v":4311},{"$f":"+F11+F47","v":3006},{"$f":"+G11+G47","v":1305},{"$f":"SUM(I9:J9)","v":410},{"$f":"+I11+I47","v":278},{"$f":"+J11+J47","v":132}]
[]
["UNIVERSIDAD ORT URUGUAY ",{"$f":"SUM(C11:D11)","v":905},{"$f":"SUM(C12:C45)","v":612},{"$f":"SUM(D12:D45)","v":293},{"$f":"SUM(F11:G11)","v":4014},{"$f":"SUM(F12:F45)","v":2846},{"$f":"SUM(G12:G45)","v":1168},{"$f":"SUM(I11:J11)","v":389},{"$f":"SUM(I12:I45)","v":271},{"$f":"SUM(J12:J45)","v":118}]
["Analista en Marketing",{"$f":"+C12+D12","v":101},49,52,{"$f":"+F12+G12","v":258},128,130,{"$f":"+I12+J12","v":22},11,11]
["Analista Programador",80,66,14,478,407,71,36,32,4]
["Diseñador Gráfico",68,35,33,305,171,134,18,7,11]
["Secretariado Ejecutivo",0,0,0,41,1,40,9,0,9]
["Diseñador de Interiores",0,0,0,125,28,97,5,1,4]
["Técnico en Gerencia",73,40,33,246,133,113,5,2,3]
["Técnico en Realización Audiovisual",23,17,6,89,55,34,12,7,5]
["Analista en Publicidad",30,13,17,85,44,41,9,3,6]
["Técnico en Animación Digital",0,0,0,42,31,11,2,2,0]
["Técnico en Electrónica Informática",11,10,1,66,61,5,30,29,1]
["Programador de Páginas Web",0,0,0,40,32,8,1,1,0]
["Diseñador de Páginas Web",1,1,0,26,21,5,37,19,18]
["Técnico en Gerencia Turística",22,7,15,93,46,47,5,0,5]
["Técnico en Diseño de Sonido",30,25,5,157,140,17,13,11,2]
["Analista en Comunicación Corporativa y Relaciones Públicas",44,11,33,136,38,98,16,4,12]
["Técnico en Periodismo Deportivo",0,0,0,38,32,6,9,9,0]
["Técnico en Relaciones Públicas y Organización de Eventos",18,5,13,105,27,78,18,5,13]
["Analista en Tecnologías de la Información",102,93,9,734,650,84,18,16,2]
["Técnico en Electro Electrónica",13,13,0,66,66,0,10,10,0]
["Técnico en Gerencia Comercial",21,11,10,81,53,28,6,6,0]
["Técnico en Edición de Audio Digital",0,0,0,7,7,0,2,2,0]
["Técnico en Sistemas Operativos y Redes",70,70,0,376,365,11,21,21,0]
["Analista en Comercio Exterior",49,24,25,106,55,51,24,15,9]
["Analista Programador de Aplicaciones Web",32,28,4,116,90,26,4,3,1]
["Programador Web - Camino TICs",0,0,0,2,2,0,1,1,0]
["Programador Orientado a Objetos - Camino TICs",17,13,4,24,18,6,1,1,0]
["Técnico en Electrónica Informática - Camino TICs",0,0,0,1,1,0,0,0,0]
["Técnico en Electro Electrónica - Camino TICs",1,1,0,3,3,0,0,0,0]
["Técnico en Producción Musical",15,12,3,15,12,3,0,0,0]
["Técnico en Diseño Web",29,19,10,29,19,10,0,0,0]
["Técnico en Soporte Informático",34,31,3,35,32,3,0,0,0]
["Instalación y mantenimiento de redes",16,13,3,65,57,8,48,46,2]
["Programación Visual Basic .Net",0,0,0,2,2,0,0,0,0]
["Administrador de Sistemas Operativos Microsoft",5,5,0,22,19,3,7,7,0]
[]
["UNIVERSIDAD DE LA EMPRESA.................................................................................................................",{"$f":"SUM(C47:D47)","v":221},{"$f":"SUM(C48:C58)","v":115},{"$f":"SUM(D48:D58)","v":106},{"$f":"SUM(F47:G47)","v":297},{"$f":"SUM(F48:F58)","v":160},{"$f":"SUM(G48:G58)","v":137},{"$f":"SUM(I47:J47)","v":21},{"$f":"SUM(I48:I58)","v":7},{"$f":"SUM(J48:J58)","v":14}]
["Analista en Diseño Gráfico",{"$f":"+C48+D48","v":11},4,7,{"$f":"+F48+G48","v":26},16,10,{"$f":"+I48+J48","v":0},0,0]
["Analista en Publicidad",16,5,11,19,7,12,2,0,2]
["Técnico en Vestimenta",0,0,0,0,0,0,1,0,1]
["Analista en Comercio Exterior",24,13,11,26,15,11,3,1,2]
["Analista en Marketing",84,46,38,107,57,50,9,2,7]
["Analista en Recursos Humanos",21,4,17,23,5,18,1,0,1]
["Analista en Relaciones Públicas",8,3,5,8,3,5,0,0,0]
["Técnico en Gerencia",27,16,11,58,33,25,1,0,1]
["Analista Ejecutivo en Turismo",8,5,3,7,4,3,0,0,0]
["Técnico en Gerencia en Ventas",{"$f":"+C57+D57","v":11},10,1,{"$f":"+F57+G57","v":11},10,1,0,0,0]
["Técnico en Administración Rural ",{"$f":"+C58+D58","v":11},9,2,{"$f":"+F58+G58","v":12},10,2,{"$f":"+I58+J58","v":4},4,0]
["Fuente: Oficinas Productoras de cada una de las Instituciones. "]

{"sheet":"II-7.2.1","index":228,"n_rows":65,"n_cols":6,"rows_kept":65,"cut":false,"hidden":false,"merged":[[64,0,64,6],[5,1,8,1],[5,0,8,0],[0,4,1,5],[4,0,4,5],[5,2,5,5],[6,2,6,3],[6,4,6,5],[7,2,7,5]]}
["MEC - DIRECCIÓN DE EDUCACIÓN",null,null,null,"PERSONAL DOCENTE"]
["ÁREA DE EDUCACIÓN NO FORMAL"]
[]
["Cuadro Nº II-7.2.1"]
["PERSONAL DOCENTE,TITULADO Y NO TITULADO, POR SEXO, REGIÒN Y DEPARTAMENTO SEGÙN CARGA HORARIA SEMANAL. AÑO 2011."]
["Dedicación","TOTAL ","DOCENTES"]
[null,null,"TITULADOS",null,"NO TITULADOS"]
[null,null,"SEXO"]
[null,null,"M","F","M","F"]
["TOTAL",{"$f":"SUM(C10:F10)","v":194},{"$f":"+C11+C16","v":20},{"$f":"+D11+D16","v":55},{"$f":"+E11+E16","v":47},{"$f":"+F11+F16","v":72}]
["MONTEVIDEO",{"$f":"SUM(C11:F11)","v":50},{"$f":"SUM(C12:C14)","v":7},{"$f":"SUM(D12:D14)","v":10},{"$f":"SUM(E12:E14)","v":12},{"$f":"SUM(F12:F14)","v":21}]
["Hasta 19 hs semanales",{"$f":"SUM(C12:F12)","v":7},1,0,0,6]
["De 20 hs a 39 hs semanales",{"$f":"SUM(C13:F13)","v":43},6,10,12,15]
["De 40 hs y más semanales",{"$f":"SUM(C14:F14)","v":0},0,0,0,0]
[]
["RESTO DEL PAÍS",{"$f":"SUM(C16:F16)","v":144},{"$f":"SUM(C17:C19)","v":13},{"$f":"SUM(D17:D19)","v":45},{"$f":"SUM(E17:E19)","v":35},{"$f":"SUM(F17:F19)","v":51}]
["Hasta 19 hs semanales",81,{"$f":"+C26+C30+C34+C42+C46+C50+C54+C58+C21+C62+C38","v":4},11,27,39]
["De 20 hs a 39 hs semanales",63,9,34,8,12]
["De 40 hs y más semanales",0,0,0,0,0]
["Artigas",7,{"$f":"SUM(C21:C23)","v":0},{"$f":"SUM(D21:D23)","v":2},{"$f":"SUM(E21:E23)","v":2},{"$f":"SUM(F21:F23)","v":3}]
["Hasta 19 hs semanales",5,0,1,2,2]
["De 20 hs a 39 hs semanales",2,0,1,0,1]
["De 40 hs y más semanales",0,0,0,0,0]
["Canelones",22,{"$f":"+C25+C29","v":0},{"$f":"+D25+D29","v":9},{"$f":"+E25+E29","v":6},{"$f":"+F25+F29","v":7}]
["  Barros Blancos",10,{"$f":"SUM(C26:C28)","v":0},{"$f":"SUM(D26:D28)","v":3},{"$f":"SUM(E26:E28)","v":3},{"$f":"SUM(F26:F28)","v":4}]
["Hasta 19 hs semanales",7,0,2,2,3]
["De 20 hs a 39 hs semanales",3,0,1,1,1]
["De 40 hs y más semanales",0,0,0,0,0]
["  La Paz",12,{"$f":"SUM(C30:C32)","v":0},{"$f":"SUM(D30:D32)","v":6},{"$f":"SUM(E30:E32)","v":3},{"$f":"SUM(F30:F32)","v":3}]
["Hasta 19 hs semanales",6,0,0,3,3]
["De 20 hs a 39 hs semanales",6,0,6,0,0]
["De 40 hs y más semanales",0,0,0,0,0]
["Colonia",13,{"$f":"SUM(C34:C36)","v":0},{"$f":"SUM(D34:D36)","v":4},{"$f":"SUM(E34:E36)","v":3},{"$f":"SUM(F34:F36)","v":6}]
["Hasta 19 hs semanales",9,0,2,2,5]
["De 20 hs a 39 hs semanales",4,0,2,1,1]
["De 40 hs y más semanales",0,0,0,0,0]
["Florida",7,{"$f":"SUM(C38:C40)","v":1},{"$f":"SUM(D38:D40)","v":2},{"$f":"SUM(E38:E40)","v":1},{"$f":"SUM(F38:F40)","v":3}]
["Hasta 19 hs semanales",4,0,0,1,3]
["De 20 hs a 39 hs semanales",3,1,2,0,0]
["De 40 hs y más semanales",0,0,0,0,0]
["Maldonado (San Carlos)",10,{"$f":"SUM(C42:C44)","v":1},{"$f":"SUM(D42:D44)","v":2},{"$f":"SUM(E42:E44)","v":3},{"$f":"SUM(F42:F44)","v":4}]
["Hasta 19 hs semanales",7,0,1,3,3]
["De 20 hs a 39 hs semanales",3,1,1,0,1]
["De 40 hs y más semanales",0,0,0,0,0]
["Paysandú",12,{"$f":"SUM(C46:C48)","v":1},{"$f":"SUM(D46:D48)","v":1},{"$f":"SUM(E46:E48)","v":2},{"$f":"SUM(F46:F48)","v":8}]
["Hasta 19 hs semanales",9,1,0,2,6]
["De 20 hs a 39 hs semanales",3,0,1,0,2]
["De 40 hs y más semanales",{"$f":"SUM(C48:F48)","v":0},0,0,0,0]
["Río Negro (Young)",12,{"$f":"SUM(C50:C52)","v":0},{"$f":"SUM(D50:D52)","v":6},{"$f":"SUM(E50:E52)","v":1},{"$f":"SUM(F50:F52)","v":5}]
["Hasta 19 hs semanales",8,0,2,1,5]
["De 20 hs a 39 hs semanales",4,0,4,0,0]
["De 40 hs y más semanales",0,0,0,0,0]
["Rivera",29,{"$f":"SUM(C54:C56)","v":6},{"$f":"SUM(D54:D56)","v":13},{"$f":"SUM(E54:E56)","v":5},{"$f":"SUM(F54:F56)","v":5}]
["Hasta 19 hs semanales",4,0,2,0,2]
["De 20 hs a 39 hs semanales",25,6,11,5,3]
["De 40 hs y más semanales",0,0,0,0,0]
["Salto",16,{"$f":"SUM(C58:C60)","v":3},{"$f":"SUM(D58:D60)","v":2},{"$f":"SUM(E58:E60)","v":6},{"$f":"SUM(F58:F60)","v":5}]
["Hasta 19 hs semanales",11,3,0,5,3]
["De 20 hs a 39 hs semanales",5,0,2,1,2]
["De 40 hs y más semanales",0,0,0,0,0]
["Treinta y Tres",16,{"$f":"SUM(C62:C64)","v":1},{"$f":"SUM(D62:D64)","v":4},{"$f":"SUM(E62:E64)","v":6},{"$f":"SUM(F62:F64)","v":5}]
["Hasta 19 hs semanales",11,0,1,6,4]
["De 20 hs a 39 hs semanales",5,1,3,0,1]
["De 40 hs y más semanales",0,0,0,0,0]
["Fuente: Procesamiento propio en base a datos proporcionados por el  Área de Educación No Formal, Dirección de Educación, MEC."]

{"sheet":"II-7.2.2","index":229,"n_rows":16,"n_cols":3,"rows_kept":16,"cut":false,"hidden":false,"merged":[[0,1,1,2],[2,0,2,2],[4,0,4,2],[5,0,5,2]]}
["ANEP","PERSONAL "]
[]
["Cuadro Nº II-7.2.2"]
[]
[]
["PERSONAL DOCENTE Y NÚMERO DE ESTABLECIMIENTOS EN PNJA"]
[null,"ESTABLECIMIENTOS","DOCENTES"]
["TOTAL ",{"$f":"SUM(B9:B15)","v":230},{"$f":"SUM(C9:C15)","v":497}]
["EJA",72,224]
["Atención a la Discapacidad",29,87]
["M del Interior (Ed en Cárceles)",24,51]
["Organismos del Estado",13,24]
["ONGs",15,27]
["Convenio MIDES - CODICEN",73,75]
["Programa Puente (Infamilia-CODICEN)",4,9]
["Fuente: ANEP - CODICEN - Programa de Educación de Jóvenes y Adultos"]

{"sheet":"II-7.2.3","index":230,"n_rows":27,"n_cols":4,"rows_kept":27,"cut":false,"hidden":false,"merged":[[4,0,4,3],[5,0,6,0],[5,1,6,1],[0,3,1,4]]}
["CONSEJO DE EDUCACIÓN TÉCNICO PROFESIONAL (U.T.U.)",null,null,"PERSONAL DOCENTE"]
[]
["Cuadro Nº II-7.2.3"]
[]
["PERSONAL DOCENTE EN EDUCACIÓN  TECNOLÓGICA POR TIPO DE CURSO. AÑO 2011."]
["EDUCACIÓN MEDIA SUPERIOR","TOTAL"]
[]
["TOTAL",{"$f":"B10+B22","v":1136}]
[]
["NIVEL BÁSICO",{"$f":"SUM(B11:B21)","v":940}]
["Formación Profesional Básica",186]
["Formación Profesional Acelerada",1]
["Formación Profesional Especializada",25]
["FormProfesional en Artes Y Artesanías",49]
["Curso Básico",269]
["Curso Básico de Especialización",201]
["Capacitación",39]
["Capacitación Profesional Básica",169]
["Formy Des Artesanal y Cultural",0]
["Capacitación Profesional",0]
["Acreditación Saberes",1]
["NIVEL SUPERIOR",{"$f":"SUM(B23:B27)","v":196}]
["Formación Profesional Superior",104]
["Capacitación Técnica",3]
["Capacitación Superior",87]
["Capacitación Profesional Superior",2]
["Fuente: DE - CETP (UTU)"]

{"sheet":"II-7.3.1 ","index":231,"n_rows":23,"n_cols":12,"rows_kept":23,"cut":false,"hidden":false,"merged":[[0,4,1,11],[6,0,6,11],[7,0,10,0],[7,1,8,2],[7,3,10,3],[7,4,8,5],[7,6,8,11],[9,1,10,1],[9,2,10,2],[9,4,9,5],[9,6,10,6],[9,7,9,8],[9,9,10,9],[9,10,9,11]]}
["MEC - DIRECCIÓN DE EDUCACIÓN",null,null,null,"CURSOS, ALUMNOS MATRICULADOS Y RECURSOS HUMANOS"]
["ÁREA DE EDUCACIÓN NO FORMAL"]
[]
[]
["Cuadro Nº II-7.3.1"]
[]
["CANTIDAD DE CURSOS, DE HORAS Y DE ALUMNOS MATRICULADOS SEGÚN TIPO DE CURSO Y ÁREA DE FORMACIÓN. AÑO 2011."]
["TIPO DE CURSO Y ÁREA DE FORMACIÓN","CURSOS",null,"TOTAL","ALUMNOS MATRICULADOS",null,"RECURSOS HUMANOS"]
[]
[null,"CANTIDAD","HORAS",null,"SEXO",null,"TOTAL","DOCENTES",null,"TOTAL","FUNCIONARIOS"]
[null,null,null,null,"M","F",null,"M","F",null,"M","F"]
["TOTAL",{"$f":"B13+B18","v":71},{"$f":"SUM(C13,C18)","v":0},{"$f":"E12+F12","v":833},{"$f":"SUM(E13,E18)","v":824},{"$f":"SUM(F13,F18)","v":9},{"$f":"H12+I12","v":30},{"$f":"SUM(H13,H18)","v":29},{"$f":"SUM(I13,I18)","v":1},{"$f":"K12+L12","v":15},{"$f":"SUM(K13,K18)","v":6},{"$f":"SUM(L13,L18)","v":9}]
["   Cursos Abiertos",65,0,749,740,9,24,23,1,15,6,9]
["    Industrial",65,0,0,0,0,0,0,0,0,0,0]
["    Hotelería / Gastronomía",0,0,0,0,0,0,0,0,0,0,0]
["    Administración y Servicios",0,0,0,0,0,0,0,0,0,0,0]
["    Agropecuario",0,0,0,0,0,0,0,0,0,0,0]
["   Cursos Cerrados",6,0,84,84,0,6,6,0,0,0,0]
["    Industrial",0,0,0,0,0,0,0,0,0,0,0]
["    Hotelería / Gastronomía",0,0,0,0,0,0,0,0,0,0,0]
["    Administración y Servicios",0,0,0,0,0,0,0,0,0,0,0]
["    Agropecuario",0,0,0,0,0,0,0,0,0,0,0]
["Fuente: COCAP"]

{"sheet":"II-7.3.2.","index":232,"n_rows":30,"n_cols":4,"rows_kept":30,"cut":false,"hidden":false,"merged":[[29,0,29,6],[31,0,31,6],[2,0,2,4],[3,0,3,3],[4,0,6,0],[4,1,6,1],[4,2,4,3],[5,2,5,3]]}
["ANEP"]
["CODICEN – DIRECCIÓN SECTORIAL DE EDUCACIÓN DE ADULTOS"]
["Cuadro Nº II-7.3.2"]
["CANTIDAD DE PRUEBAS DE ACREDITACIÓN SEGÚN SEXO, GRANDES ÁREAS Y DEPARTAMENTOS."]
["GRANDES ÁREAS Y DEPARTAMENTOS","TOTAL","Prueba de Acreditación"]
[null,null,"SEXO"]
[null,null,"M","F"]
["TOTAL",{"$f":"+B9+B10","v":1041},{"$f":"C9+C10","v":435},{"$f":"D9+D10","v":606}]
["MONTEVIDEO",{"$f":"C9+D9","v":301},169,132]
["RESTO DEL PAÍS",{"$f":"C10+D10","v":740},{"$f":"SUM(C11:C28)","v":266},{"$f":"SUM(D11:D28)","v":474}]
["Artigas",{"$f":"C11+D11","v":31},5,26]
["Canelones",269,95,174]
["Cerro Largo",14,2,12]
["Colonia",15,4,11]
["Durazno",15,3,12]
["Flores",7,5,2]
["Florida",18,8,10]
["Lavalleja",12,2,10]
["Maldonado",37,23,14]
["Paysandú",73,31,42]
["Río Negro",28,8,20]
["Rivera",45,14,31]
["Rocha",27,6,21]
["Salto",42,18,24]
["San José",59,29,30]
["Soriano",8,3,5]
["Tacuarembó",29,3,26]
["Treinta y Tres",11,7,4]
["Fuente: ANEP - CODICEN - Dirección Sectorial de Educación de Adultos"]
["Observaciones: La modalidad Prueba de Acreditación corresponde a Segundo Tramo "]

{"sheet":"II-7.4.2","index":233,"n_rows":327,"n_cols":5,"rows_kept":327,"cut":false,"hidden":false,"merged":[[326,0,326,4],[4,0,4,4],[5,0,7,0],[5,1,7,1],[5,2,5,3],[5,4,7,4],[6,2,6,3]]}
[]
[]
[]
[]
["PERSONAL DOCENTE Y MATRÍCULA POR SEXO SEGÚN TIPO DE INSTITUCIÓN, ÁREAS DE CONOCIMIENTO E INSTITUCIONES. Año 2010."]
["TIPO DE INSTITUCIÓN / ÁREAS DE CONOCMIENTO /  INSTITUCIONES","TOTAL","MATRÍCULA",null,"DOCENTES"]
[null,null,"SEXO"]
[null,null,"M","F"]
["TOTAL",{"$f":"C9+D9","v":78544},{"$f":"C10+C33","v":39471},{"$f":"D10+D33","v":39073},{"$f":"E10+E33","v":6216}]
["PÚBLICO",{"$f":"B11+B13+B15","v":3348},{"$f":"C11+C13+C15","v":2816},532,958]
["Idiomas",{"$f":"B12","v":211},{"$f":"C12","v":109},{"$f":"D12","v":102},{"$f":"E12","v":13}]
["‘Escuela de Idiomas del Ejército’",{"$f":"(C12+D12)","v":211},109,102,13]
["Artes",{"$f":"B14","v":142},{"$f":"C14","v":41},{"$f":"D14","v":101},{"$f":"E14","v":0}]
["‘E.M.A.D.’",{"$f":"(C14+D14)","v":142},41,101,0]
["Otros Técnicos",{"$f":"SUM(B16:B32)","v":2995},{"$f":"SUM(C16:C32)","v":2666},329,945]
["‘Centro de Comando Unificado’",330,209,121,9]
["‘Centro de Instrucción de blindados y Mecanizados’",230,230,0,52]
["‘Centro de Instrucción de Infantería’",291,283,8,117]
["‘Centro de Instrucción de Ingenieros’",187,187,0,45]
["‘Centro de Instruccion de la Armada -CIARM-’",787,732,55,67]
["‘E.A.D.E.S.’",76,16,60,12]
["‘Escuela de Aviación Naval’",23,22,1,0]
["‘Escuela de Buceo’",70,68,2,10]
["‘Escuela de Capacitación y Perfeccionamiento de Oficiales’",39,35,4,12]
["‘Escuela de Comando y Estado Mayor Aéreo’",43,36,7,231]
["‘Escuela de Comando y Estado Mayor’",0,null,null,118]
["‘Escuela de Educación Física y Tiro del Ejército’",54,51,3,11]
["‘Escuela de Estrategia’",19,16,3,14]
["‘Escuela de Suboficiales del Ejército’",575,564,11,86]
["‘Escuela Militar de Aeronautica’",77,63,14,92]
["‘Escuela Técnica de Aeronautica’",194,154,40,51]
["‘Jefatura de Policia - Escuela Departamental’",0,null,null,18]
["PRIVADO",{"$f":"B34+B113+B151+B191+B226+B239+B264","v":75196},{"$f":"C34+C113+C151+C191+C226+C239+C264","v":36655},{"$f":"D34+D113+D151+D191+D226+D239+D264","v":38541},{"$f":"E34+E113+E151+E191+E226+E239+E264","v":5258}]
["Idiomas",{"$f":"SUM(B35:B112)","v":13114},{"$f":"SUM(C35:C112)","v":5753},7361,830]
["‘Alianza Cultural Colonia Del Sacramento’",312,121,191,26]
["‘Alianza Cultural Fray Bentos -Franquicia Alianza Uruguay Estados Unidos-’",303,135,168,23]
["‘Alianza Cultural Las Piedras’",41,15,26,7]
["‘Alianza Cultural Pando’",195,72,123,9]
["‘Alianza Cultural Rivera S.R.L.’",177,80,97,5]
["‘Alianza Cultural San Ramón’",149,56,93,15]
["‘Alianza Cultural Uruguay-Estados Unidos’",1936,968,968,30]
["‘American Language Institute’",27,9,18,5]
["‘Anglo Albo’",210,90,120,12]
["‘Anglo Artigas’",5,3,2,1]
["‘Anglo Atlántida’",59,28,31,2]
["‘Anglo Cerro -Amaral Casas Maria Elizabeth-’",182,78,104,9]
["‘Anglo Colonia’",136,58,78,6]
["‘Anglo De La Costa’",63,32,31,7]
["‘Anglo La Blanqueada ‘",135,32,103,11]
["‘Anglo La Teja’",145,70,75,8]
["‘Anglo Uruguayo De Las Piedras’",379,316,63,17]
["‘Anglo Uruguayo De San José’",42,12,30,3]
["‘Anglo Uruguayo Melo ‘",250,80,170,9]
["‘Anna Laura Payret Arbiza -Cedi-’",115,46,69,2]
["‘Antonia Gabriela Rodriguez Vero’",50,15,35,2]
["‘Bécassine S.R.L.’",50,12,38,3]
["‘Berlitz Uruguay S.A.’",120,55,65,105]
["‘Brighton Institute - Enseñanza De Inglés’",129,57,72,17]
["‘Britannia Centre’",71,34,37,6]
["‘British Institute ‘",80,27,53,2]
["‘Business English, Inc’",185,125,60,14]
["‘Castro Castro Luis Eduardo’",20,8,12,3]
["‘Centro De Estudios Camelot’",60,20,40,2]
["‘Centro De Estudios De Ingles -Cedi-’",99,49,50,2]
["‘Centro De Investigación Y Desarrollo Para La Persona Sorda -Cinde-’",332,26,306,22]
["‘Content English S.R.L’",317,169,148,28]
["‘Decker Institute’",135,70,65,6]
["‘Delta Educa’",91,35,56,15]
["‘Eduland’",429,195,234,27]
["‘Emily Dickinson Educational Center S.R.L.’",280,120,160,7]
["‘Empire English Center’",112,55,57,30]
["‘Essential English Institute Srl’",70,33,37,3]
["‘Executive’",450,240,210,0]
["‘Fundación Alianza Cultural Hebrea’",60,27,33,4]
["‘Goethe-Institut’",180,87,93,7]
["‘Green Park Centre’",288,129,159,6]
["‘Highlands School’",50,25,25,3]
["‘I.A.E.L. Srl’",{"$f":"(C78+D78)","v":30},5,25,2]
["‘Instituto Cedi - Blanca Edith Cirisola Carbo’",155,53,102,26]
["‘Instituto Cultural I M F’",67,24,43,3]
["‘Instituto De Enseñanza Summit’",256,84,172,15]
["‘Instituto De Lenguas Extranjeras’",200,100,100,8]
["‘Instituto Dickens SRL’",581,244,337,0]
["‘Instituto Evolucion’",58,32,26,2]
["‘Instituto Highway -Clara Beatriz Libatter-’",50,27,23,4]
["‘Instituto I.E.T.I- Rivera’",110,45,65,3]
["‘Instituto Ieco - Ela Mila Tourn Ricca’",150,70,80,7]
["‘Instituto Italiano De Cultura’",0,0,0,7]
["‘Instituto Porto Brasil’",47,16,31,4]
["‘Instituto Queen Victoria’",66,30,36,0]
["‘International House London Institute’",198,27,171,25]
["‘Juan Pedro García Baraybar’",175,75,100,2]
["‘Kent Institute’",360,177,183,0]
["‘Kingston Language Centre’",86,20,66,10]
["‘L\\Akdmia Institute’",60,26,34,2]
["‘Langland Language Institute ‘",157,72,85,19]
["‘Limelight Language School’",60,22,38,14]
["‘Luis Francisco Hernandez Parodi -Urubrit- ‘",3,0,3,1]
["‘María Andrea Perdomo Nieves Y Graciela Alejandra Pintos Sartore’",26,10,16,6]
["‘María De Los Ángeles Vázquez’",145,40,105,34]
["‘Mirta Daniela Vidal Acosta - Instituto De Inglés \\ Ept Institute\\’",30,8,22,10]
["‘New Way Institute’",167,60,107,21]
["‘Rosine Arwas’",80,30,50,4]
["‘Saint Mary\\S English School’",103,40,63,13]
["‘Seaside English Center’",20,6,14,1]
["‘Sh Ingles’",55,20,35,4]
["‘Silvia Elizabeth Parga Garabelli -B Live Institute’",41,20,21,9]
["‘Sociedad De Cultura Inglesa Anglo Florida’",700,300,400,30]
["‘Somerset House Els’",56,39,17,9]
["‘The British Institute ‘",261,94,167,12]
["‘The British Lighthouse Institute’",30,16,14,1]
["‘Yes! Institute Srl’",12,7,5,1]
["Informática",{"$f":"SUM(B114:B150)","v":12444},{"$f":"SUM(C114:C150)","v":8100},4344,1216]
["‘Adec Informática’",49,20,29,5]
["‘Arturo Favián Medero Duarte’",466,125,341,67]
["‘Biblioteca Tecnológica De Maldonado ‘",43,8,35,5]
["‘Cei’",167,122,45,42]
["‘Centro Educativo Recreativo Y Social -Cers-’",56,16,40,2]
["‘CForma’",75,32,43,0]
["‘Club De Usuarios De Informática ‘",24,15,9,6]
["‘Computacion Brugman Hnos- Red Qualitas’",74,41,33,10]
["‘Eduserv Srl’",23,8,15,2]
["‘EMI educa’",663,318,345,0]
["‘Escuela De Informática’",39,36,3,23]
["‘Estudios De Informática’",30,20,10,6]
["‘Fundación De Cultura Informática’",445,213,232,134]
["‘Fundación Mentalis - Centro Psicosocial Sur Palermo ‘",119,83,36,9]
["‘Fundacion Zonamerica’",1000,1000,0,20]
["‘IAC Fray Marcos ‘",35,16,19,2]
["‘Icedu - Sucursal Treinta Y Tres’",1235,555,680,60]
["‘IEAC - Carmelo’",115,52,63,0]
["‘Info Easy’",467,155,312,6]
["‘Instituto Atlantida De Capacitacion’",284,134,150,15]
["‘Instituto De Educación I-Com’",190,71,119,9]
["‘Instituto De Informatica Viñales’",182,37,145,8]
["‘Instituto Tecnológico Ctc - Sucursal Minas’",48,30,18,10]
["‘Instituto Tecnológico Ctc ‘",129,55,74,17]
["‘Instituto Tecnológico De Informática - -Iti-’",57,25,32,7]
["‘Instituto Universitario Autónomo Del Sur’",605,508,97,160]
["‘La Academia De Computacion S.A. - Empower U’",816,585,231,74]
["‘Megasoft’",255,101,154,0]
["‘Mundo Informático’",{"$f":"(C142+D142)","v":199},80,119,20]
["‘Pc Choice’",16,5,11,2]
["‘Red Informatica Ltda’",0,0,0,0]
["‘Silicomp Enseñanza’",17,7,10,1]
["‘Silvia Noelia Paipo Mosquera -Instituto De Enseñanza Cultural Del Mercosur-’",330,142,188,9]
["‘Sosa Banchero, Ana Silvia ‘",25,7,18,5]
["‘Taller De Informática Srl’",1091,1091,0,46]
["‘Union Informatica Ltda.’",281,139,142,14]
["‘Universidad ORT’",2794,2248,546,420]
["Administración y Comercio",{"$f":"SUM(B152:B190)","v":24350},{"$f":"SUM(C152:C190)","v":11486},12864,881]
["‘Academia Alfa’",0,0,0,0]
["‘Alicia Iriarte, Carlos Gómez Y Otros’",50,15,35,1]
["‘Bernardez Castro Victor Manuel Y Huertas Conti Gaston’",150,50,100,2]
["‘Centro De Navegación’",120,100,20,14]
["‘Cesa - Osliman Sa’",687,570,117,8]
["‘Ciedur’",2315,541,1774,38]
["‘Educa Internacional S.A.’",49,27,22,2]
["‘Escuela De Formación Profesional En Comercio Exterior Y Aduanas’",139,82,57,51]
["‘Escuela De Negocios Internacionales ‘",22,7,15,22]
["‘Escuela Francesa De Negocios’",44,21,23,28]
["‘Escuela Tercer Milenio’",100,40,60,10]
["‘Fundación Ecuménica De Desarrollo Del Uruguay’",333,183,150,23]
["‘Fundasol’",6230,3423,2807,43]
["‘Ict & Eventos Ltda.’",112,84,28,29]
["‘Instituo Aldey’",801,104,697,0]
["‘Instituto Atenea Srl’",136,44,92,12]
["‘Instituto Baldovino ‘",50,20,30,1]
["‘Instituto Bios -Giazzu S.A.-’",9843,4863,4980,0]
["‘Instituto Ciencias Exactas Y Empresariales’",330,188,142,3]
["‘Instituto De Capacitación Empresarial -Ice-’",118,10,108,37]
["‘Instituto De Capacitacion Interactiva’",80,25,55,2]
["‘Instituto De Formación Y Capacitación - Centro De Viajantes Y Vendedores De Plaza ‘",50,47,3,10]
["‘Instituto De Promocion Economico Social Del Uruguay ‘",85,20,65,15]
["‘Instituto Ganem ‘",24,9,15,1]
["‘Instituto Ipade ‘",248,61,187,66]
["‘Instituto Metodista Universitario Crandon’",67,2,65,64]
["‘Instituto Tecnologico Empresarial Item’",290,79,211,64]
["‘Instituto Universitario Francisco De Asís.’",50,10,40,6]
["‘Motta Fernandez Fabiana Elizabeth’",100,35,65,11]
["‘Overseas Affairs Service Co Ltda. ‘",5,2,3,1]
["‘Pmi Capítulo Montevideo’",36,18,18,2]
["‘Proyecto Trabajo’",91,7,84,31]
["‘Redqualitas - Ciudad De La Costa’",354,180,174,17]
["‘Redqualitas Filial Tarariras’",279,110,169,18]
["‘Redqualitas Fray Bentos - Benitez Ortiz Estela Rosmari’",177,88,89,13]
["‘Renglón Uno - Capacitación Empresarial Ltda.’",88,37,51,24]
["‘Universidad De La Empresa’",609,366,243,176]
["‘Wolf & Duran’",88,18,70,36]
["Academia Mario Rodriguez Contabilidades S.C.I.",0,0,0,0]
["Artes",{"$f":"SUM(B192:B225)","v":3983},{"$f":"SUM(C192:C225)","v":946},{"$f":"SUM(D192:D225)","v":3037},{"$f":"SUM(E192:E225)","v":381}]
["‘Academia De Danza Paula Casteran’",0,0,0,0]
["‘Ars Escuela De Interiorismo ‘",24,3,21,4]
["‘Arte Club S.R.L.’",70,20,50,6]
["‘Centro De Estudios Yishel Battes’",10,5,5,10]
["‘Escuela De Ballet \\ Roxana Alberti\\’",130,12,118,10]
["‘Escuela De Cine Del Uruguay’",53,37,16,34]
["‘Escuela de Comedia Musical’",252,21,231,0]
["‘Escuela De Creativos Dg’",11,1,10,5]
["‘Escuela De Diseño Peter Hamers’",80,6,74,9]
["‘Espacio De Desarrollo Armónico’",1600,400,1200,80]
["‘Eufória Academia De Danza’",102,4,98,3]
["‘Fk Srl’",50,14,36,15]
["‘Foto Club Uruguayo’",11,6,5,2]
["‘Fundación Dodecá - Escuela De Cine Dodecá’",95,48,47,15]
["‘Fundación Promúsica’",{"$f":"(C206+D206)","v":260},144,116,58]
["‘Garbo Imagen’",99,5,94,29]
["‘Indans Escuela De Artes Del Movimiento’",32,7,25,9]
["‘Institución Teatral El Tinglado’",50,15,35,9]
["‘Instituto De Danzas \\\\’",57,2,55,7]
["‘Instituto De Restauración Y Conservación De Bienes Culurales.’",64,1,63,2]
["‘Instituto Diseg ‘",56,3,53,6]
["‘Instituto Musical Schuber’",100,40,60,6]
["‘Instituto Strasser’",14,0,14,0]
["‘Instituto Uruguayo De Alta Costura’",70,0,70,11]
["‘Instituto Uruguayo De Educacion Por El Arte -Taller Barradas’",50,1,49,3]
["‘Lurama S.R.L.’",0,0,0,3]
["‘Montevideo Ballet Studio’",80,10,70,4]
["‘Pablo Gimenez Escuela Integral De Diseño’",45,1,44,16]
["‘Polizonteatro ‘",40,10,30,3]
["‘Sg Danzatoria Academia De Ballet Y Danza Moderna’",120,0,120,2]
["‘Silvia Seguí Y Luis Seguí -Instituto Diseg- ‘",56,3,53,6]
["‘Taller Aquelarre - Escuela De Fotografía’",162,67,95,8]
["‘Taller De Artes Plásticas’",40,5,35,2]
["‘Taller De Montevideo’",100,55,45,4]
["Servicios Personales",{"$f":"SUM(B227:B238)","v":1623},{"$f":"SUM(C227:C238)","v":586},1037,338]
["‘Acp’",202,16,186,10]
["‘Asociación Civil El Abrojo’",265,99,166,89]
["‘Asociacion Uruguaya De Barmen ‘",80,60,20,8]
["‘Bizzozero-Montaldo Sdh -Gato Dumas Colegio De Cocineros-’",488,272,216,79]
["‘Institucion Kolping Sociedad Anonima’",16,10,6,4]
["‘Instituto De Gastronomía Ug’",44,22,22,20]
["‘Instituto Formacion De Peluqueros Iniciales Y Master’",230,12,218,7]
["‘Instituto Orion ‘",50,1,49,9]
["‘Instituto Tecnico \\ Syv Kone\\’",15,2,13,7]
["‘InstitutoDeAltaGastronomíaBeatrizMarino’",0,0,0,0]
["‘Programa Cardijn’",171,72,99,91]
["‘Sociedad Uruguaya De Enseñanza\\\\’",62,20,42,14]
["Otros Técnicos",{"$f":"SUM(B240:B263)","v":8858},{"$f":"SUM(C240:C263)","v":5542},3316,372]
["‘Arquitectura Por Partes Digital’",8,5,3,1]
["‘Asociación Civil Gurises Unidos’",17,17,0,4]
["‘Cámara De Industrias Del Uruguay’",823,428,395,66]
["‘Centro De Capacitacion Serrano Ltda ‘",64,19,45,17]
["‘Centro De Industriales Panaderos Del Uruguay - Instituto Tecnológico Del Pan’",11,10,1,2]
["‘Centro Integral de Formación de Enfermería’",32,5,27,3]
["‘Escuela De Desarrollo Profesional Del Uruguay’",1329,871,458,18]
["‘Escuela de Formación Turística’",57,29,28,0]
["‘Escuela de Hoteleria, Gastronomia y Turismo del Uruguay’",16,6,10,0]
["‘Escuelas E.U.C.I. ‘",537,381,156,27]
["‘Escuelas IADE ‘",711,705,6,0]
["‘Fernández Breccia Gonzalo Jose, Braga Fernandez Gerardo Y Otros - \\ Arquitemas\\’",45,17,28,4]
["‘I.E.S. Instituto De Estudios Sociales’",80,48,32,24]
["‘Iedu -Instituto De Enseñanza Durazno- ‘",140,57,83,10]
["‘Instituto De Capacitacion Integral Y Productividad’",10,8,2,2]
["‘Instituto De Capacitación, Promoción Y Trabajo’",24,24,0,10]
["‘Instituto Orgi’",263,125,138,42]
["‘Instituto Tecnico De Ciencias Agrarias’",120,95,25,25]
["‘MagdalenaCazarre’",105,48,57,43]
["‘Ministerio de Educación y Cultura- Programa Nacional de Educación y Trabajo’",1460,940,520,0]
["‘Movimiento Nacional GustavoVolpe’",163,105,58,5]
["‘Multitecnica Ltda -Escuela Ma-pa- ‘",1556,945,611,0]
["‘Profesionales Asociados S.R.L.’",450,310,140,36]
["‘Ricardo Ravotto’",837,344,493,33]
["Otros Diversos",{"$f":"SUM(B265:B326)","v":10824},{"$f":"SUM(C265:C326)","v":4242},6582,1240]
["‘Academia Americana’",0,0,0,0]
["‘Academia Pre-Universitaria’",429,236,193,7]
["‘Academia Uno’",100,40,60,6]
["‘Academia Uruguay’",6,1,5,6]
["‘Aero Club Del Uruguay ‘",28,23,5,5]
["‘Anahi Arvelo’",{"$f":"(C270+D270)","v":92},47,45,4]
["‘Asoc. CivilEl Chajá Centro De Formación Y Cultura Rural’",210,10,200,7]
["‘Asociación Cultural Y Técnica’",183,55,128,54]
["‘Asociacion De Enfermeras Catolicas \\ Ntra. Sra. De Los Remedios\\’",460,61,399,100]
["‘Asociacion De Profesionales Para El Estudio Social Integral’",20,8,12,2]
["‘Asociación De Química Y Farmacia Del Uruguay’",417,126,291,41]
["‘Aucyp’",20,2,18,2]
["‘C.I.E.P. Centro De Investigación Y Experimentación Pedagógica’",127,0,127,44]
["‘Casa De La Mujer De La Union’",275,128,147,50]
["‘Centro De Capacitacion Para La Salud -Cecas-’",54,6,48,15]
["‘Centro De Entrenamiento Kalya’",10,7,3,4]
["‘Ceprie’",40,20,20,13]
["‘Círculo Aerodeportivo Montevideo’",49,47,2,4]
["‘Confederación Uruguaya De Entidades Cooperativas -Cudecoop-’",435,215,220,73]
["‘Cooperativa De Docentes Para Una Formacion Integral’",137,67,70,30]
["‘E.F.A.E.S. Escuela de Formación de Auxiliare de Enfermería y Servicio ‘",120,18,102,0]
["‘Elimay S.R.L’",41,2,39,6]
["‘Escuela De Árbitros Auf’",40,36,4,3]
["‘Escuela De Capacitacion S.R.L ‘",280,15,265,3]
["‘Escuela De Enfermeria ‘",514,44,470,22]
["‘Escuela De Enfermería Antares’",357,66,291,12]
["‘Escuela De Psicologia Social De Montevideo’",71,19,52,22]
["‘Escuela Del Aire’",6,6,0,1]
["‘Escuela Militar’",211,184,27,50]
["‘Escuela Montevideo’",240,22,218,10]
["‘Escuela Nacional De Declamación’",39,10,29,12]
["‘Escuela Nacional de Policia ‘",275,215,60,0]
["‘Escuela Privada De Auxiliares De Enfermería’",77,18,59,14]
["‘EtumEscuela Técnica En Urgencias Médicas’",91,51,40,7]
["‘Fundación Centro De Educación Popular’",75,8,67,8]
["‘Fundacion De Integracion Socio Educativa’",110,41,69,35]
["‘Gimnasio Elixir Fitness’",80,30,50,4]
["‘Gimnasios Srl’",40,13,27,9]
["‘Grameen Uruguay ‘",120,10,110,3]
["‘Highlight Centre’",105,47,58,7]
["‘Idecas Escuela De Auxiliares De Enfermería’",334,51,283,36]
["‘Idei’",100,100,0,3]
["‘Insituto Beta’",0,0,0,0]
["‘Instituto Caprice Srl’",130,5,125,7]
["‘Instituto Cooperativo De Desarrollo Humano’",35,6,29,8]
["‘Instituto De Educación Centro Dei ‘",43,5,38,3]
["‘Instituto De Enseñanza De Cultura Física Vidactiva - Silvia Idiarte-.’",120,40,80,7]
["‘Instituto De Enseñanza Laura Casas’",380,172,208,38]
["‘Instituto De Formación Técnica Mg Ltda’",40,0,40,1]
["‘Instituto Mundo Nuevo’",237,55,182,26]
["‘Instituto P.I.E.M.C.E.’",1572,589,983,23]
["‘Instituto Tecnológico Victoria -Corporación Sudamericana De Logística-’",326,229,97,60]
["‘Instituto Universitario \\ Monseñor Mariano Soler\\- Facultad De Teología Del Uruguay ‘",80,76,4,37]
["‘Instituto Universitario Asociación Cristiana de Jóvenes’",431,266,165,0]
["‘Logtra - Instituto De Especialidades Laborales En Logística Y Transporte’",230,230,0,11]
["‘Norma Ametrano Reboledo’",119,50,69,56]
["‘Ong Manos Libres: Trabajo Por La Inclusión Social.’",62,23,39,34]
["‘Politècnico Del Uruguay’",56,19,37,166]
["‘Primera Escuela Uruguaya De Tiro’",159,148,11,12]
["‘Punta Del Este Flight School’",14,11,3,11]
["‘Servicio Paz Y Justicia - Serpaj Uruguay’",35,10,25,6]
["‘Walter Banchero -Instituto Profesional de Enseñanza Periodística IPEP-’",337,203,134,0]
["Fuente: Censo de Educación Técnica y Tecnológica. Área de Investigación y Estadística MEC."]

{"sheet":"II-7.4.3","index":234,"n_rows":61,"n_cols":5,"rows_kept":61,"cut":false,"hidden":false,"merged":[[60,0,60,4],[1,0,1,4],[2,0,4,0],[2,1,4,1],[2,2,4,2],[2,3,4,3],[2,4,4,4],[54,0,54,4],[56,0,56,4],[57,0,57,4],[58,0,58,4],[59,0,59,4]]}
[]
["INGRESADOS, MATRÍCULA Y EGRESADOS SEGÚN REGIÓN Y ÁREAS DE CONOCIMIENTO. Año 2010."]
["REGIÓN/AREAS DE CONOCIMENTO","TOTAL","INGRESADOS","MATRÍCULA","EGRESADOS"]
[]
[]
["TOTAL",{"$f":"B7+B15+B23+B31+B39+B47","v":208671},{"$f":"C7+C15+C23+C31+C39+C47","v":72182},78703,57786]
["MONTEVIDEO",{"$f":"SUM(B8:B14)","v":172178},{"$f":"SUM(C8:C14)","v":59862},64298,48018]
["Idiomas",{"$f":"SUM(C8:E8)","v":23332},7508,9228,6596]
["Informática",{"$f":"SUM(C9:E9)","v":18101},5847,8601,3653]
["Administración y Comercio",66821,23316,22838,20667]
["Artes",7229,2459,3702,1068]
["Servicios Personales",4957,2088,1349,1520]
["Otros Técnicos",27120,9695,9984,7441]
["Otros Diversos",24618,8949,8596,7073]
["REGIÓN SUR",{"$f":"SUM(B16:B22)","v":20994},{"$f":"SUM(C16:C22)","v":7156},8092,5746]
["Idiomas",3889,1261,1796,832]
["Informática",5971,2073,2090,1808]
["Administración y Comercio",2402,832,871,699]
["Artes",248,124,124,0]
["Servicios Personales",605,166,274,165]
["Otros Técnicos",3704,1270,1367,1067]
["Otros Diversos",4175,1430,1570,1175]
["REGIÓN ESTE",{"$f":"SUM(B24:B30)","v":4407},{"$f":"SUM(C24:C30)","v":1515},1530,1362]
["Idiomas",76,50,20,6]
["Informática",3660,1233,1283,1144]
["Administración y Comercio",145,50,50,45]
["Artes",20,10,10,0]
["Servicios Personales",0]
["Otros Técnicos",506,172,167,167]
["Otros Diversos",0]
["REGIÓN CENTRAL",{"$f":"SUM(B32:B38)","v":4569},{"$f":"SUM(C32:C38)","v":1351},2082,1136]
["Idiomas",1251,183,974,94]
["Informática",781,275,257,249]
["Administración y Comercio",908,332,290,286]
["Artes",0]
["Servicios Personales",0]
["Otros Técnicos",387,140,140,107]
["Otros Diversos",1242,421,421,400]
["REGIÓN LITORAL",{"$f":"SUM(B40:B46)","v":4033},{"$f":"SUM(C40:C46)","v":1481},1550,1002]
["Idiomas",1183,522,504,157]
["Informática",50,15,25,10]
["Administración y Comercio",744,252,277,215]
["Artes",58,0,57,1]
["Servicios Personales",0]
["Otros Técnicos",1300,450,450,400]
["Otros Diversos",698,242,237,219]
["REGIÓN NORTE",{"$f":"SUM(B48:B54)","v":2490},{"$f":"SUM(C48:C54)","v":817},1151,522]
["Idiomas",1520,492,803,225]
["Informática",545,188,190,167]
["Administración y Comercio",68,24,24,20]
["Artes",258,78,102,78]
["Servicios Personales",0]
["Otros Técnicos",99,35,32,32]
["Otros Diversos",0]
["Fuente: Censo de Educación Técnica y Tecnológica. Área de Investigación y Estadística MEC."]
["Nota:"]
["Región Sur: Canelones, Colonia, Maldonado y San Jose."]
["Región Este: Lavalleja, Rocha y Treinta y Tres."]
["Región Central: Durazno, Florida y Tacuarembó."]
["Región Litoral: Flores, Paysandú, Río Negro, Salto y Soriano."]
["Región Norte: Artigas, Cerro Largo y Rivera."]

{"sheet":"Hoja1","index":235,"n_rows":0,"n_cols":0,"rows_kept":0,"cut":false,"hidden":false,"merged":[]}